links to Continent
type: ObjectProperty
comment: Relation between Administrative Region and Continent
comment: Relazione tra Administrative Region e Continent @it
domain: administrative region
sub property of: place
range: continent

links to Trade Union
domain: administrative region
sub property of: organisation
comment: Relation between Administrative Region and Trade Union
range: trade union
type: ObjectProperty
comment: Relazione tra Administrative Region e Trade Union @it

television show
type: Class
label: émission de télévision @fr

links to Baseball Player
range: baseball player
sub property of: person
comment: Relazione tra Administrative Region e Baseball Player @it
domain: administrative region
comment: Relation between Administrative Region and Baseball Player
type: ObjectProperty

automobile
type: Class

colour
type: ObjectProperty
label: χρώμα @el
label: couleur @fr
type: Class

links to Artery
sub property of: anatomical structure
domain: administrative region
comment: Relazione tra Administrative Region e Artery @it
type: ObjectProperty
comment: Relation between Administrative Region and Artery
range: artery

Election
label: élection @fr
type: Class

links to Rugby League
comment: Relazione tra Administrative Region e Rugby League @it
sub property of: organisation
domain: administrative region
type: ObjectProperty
range: rugby league
comment: Relation between Administrative Region and Rugby League

mean of transportation
label: moyen de transport @fr
type: ObjectProperty

Axiom
dbpedia infobox matching weight: 100.0
annotated target: bird
annotated source: links to Bird
annotated property: relatedMatch

soccer league
label: ligue de football @fr
type: Class

links to Mammal
range: mammal
type: NamedIndividual
comment: Relazione tra Administrative Region e Mammal @it
related match: emblem
sub property of: species
related match: blankValue
comment: Relation between Administrative Region and Mammal
type: ObjectProperty
domain: administrative region

links to Stadium
type: ObjectProperty
sub property of: place
range: stadium
domain: administrative region
comment: Relazione tra Administrative Region e Stadium @it
comment: Relation between Administrative Region and Stadium

links to Single
range: single
domain: administrative region
comment: Relazione tra Administrative Region e Single @it
type: ObjectProperty
sub property of: work
comment: Relation between Administrative Region and Single

Axiom
dbpedia infobox matching weight: 60.0
annotated target: council
annotated source: links to Legislature
annotated property: relatedMatch

links to Lacrosse League
comment: Relation between Administrative Region and Lacrosse League
sub property of: organisation
domain: administrative region
type: ObjectProperty
range: lacrosse league
comment: Relazione tra Administrative Region e Lacrosse League @it

wrestler
label: lutteur @fr
type: Class

species
type: ObjectProperty
label: espèce @fr

speedway league
type: Class
label: ligue de speedway @fr

links to Song
comment: Relation between Administrative Region and Song
domain: administrative region
type: ObjectProperty
sub property of: work
comment: Relazione tra Administrative Region e Song @it
range: song

links to Race
domain: administrative region
sub property of: event
range: race
comment: Relazione tra Administrative Region e Race @it
type: ObjectProperty
comment: Relation between Administrative Region and Race

Axiom
dbpedia infobox matching weight: 50.0
annotated property: relatedMatch
annotated source: links to Congressman
annotated target: namedFor

road
type: Class
label: route @fr

boxer
type: Class
label: boxeur @fr

judge
label: juge @fr
type: Class

World Heritage Site
type: Class
label: site du patrimoine mondial @fr

Women's Tennis Association tournament
label: Tournoi de la Women's Tennis Association @fr
type: Class

Axiom
dbpedia infobox matching weight: 12.0
annotated target: languages
annotated source: links to Language
annotated property: relatedMatch

station
type: Class

links to Office Holder
type: NamedIndividual
related match: namedFor
sub property of: person
range: office holder
comment: Relation between Administrative Region and Office Holder
type: ObjectProperty
domain: administrative region
comment: Relazione tra Administrative Region e Office Holder @it

links to American Football Team
comment: Relation between Administrative Region and American Football Team
sub property of: organisation
domain: administrative region
type: ObjectProperty
comment: Relazione tra Administrative Region e American Football Team @it
range: american football team

Axiom
dbpedia infobox matching weight: 100.0
annotated source: links to Writer
annotated property: relatedMatch
annotated target: source

Axiom
dbpedia infobox matching weight: 100.0
annotated property: relatedMatch
annotated source: links to Village
annotated target: administrativeCenter

lake
type: Class
label: lac @fr

arachnid
type: Class
label: arachnides @fr

links to Pope
sub property of: person
type: ObjectProperty
comment: Relation between Administrative Region and Pope
range: pope
comment: Relazione tra Administrative Region e Pope @it
domain: administrative region

links to Reptile
comment: Relazione tra Administrative Region e Reptile @it
domain: administrative region
type: ObjectProperty
sub property of: species
range: reptile
comment: Relation between Administrative Region and Reptile
related match: reptile
type: NamedIndividual

governor
label: gouverneur @fr
type: Class

administrative region
label: région administrative @fr
type: Class

links to Fish
related match: emblem
type: ObjectProperty
sub property of: species
type: NamedIndividual
range: fish
comment: Relation between Administrative Region and Fish
related match: fish
domain: administrative region
comment: Relazione tra Administrative Region e Fish @it

poker player
type: Class
label: joueur de poker @fr

Axiom
dbpedia infobox matching weight: 40.0
annotated property: relatedMatch
annotated source: links to Legislature
annotated target: leaderTitle

links to Crustacean
comment: Relazione tra Administrative Region e Crustacean @it
type: ObjectProperty
sub property of: species
range: crustacean
domain: administrative region
comment: Relation between Administrative Region and Crustacean

links to Rugby Player
type: ObjectProperty
sub property of: person
comment: Relation between Administrative Region and Rugby Player
range: rugby player
comment: Relazione tra Administrative Region e Rugby Player @it
domain: administrative region

fish
type: Class
label: poisson @fr

ship
label: navire @fr
type: Class

tennis player
type: Class
label: joueur de tennis @fr

links to Bone
sub property of: anatomical structure
range: bone
comment: Relation between Administrative Region and Bone
comment: Relazione tra Administrative Region e Bone @it
type: ObjectProperty
domain: administrative region

Axiom
dbpedia infobox matching weight: 50.0
annotated property: relatedMatch
annotated source: links to River
annotated target: east

prime minister
type: Class
label: premier ministre @fr

links to Soccer Club
range: soccer club
comment: Relation between Administrative Region and Soccer Club
comment: Relazione tra Administrative Region e Soccer Club @it
type: ObjectProperty
domain: administrative region
sub property of: organisation

race
label: course @fr
type: Class

hospital
label: hôpital @fr
type: Class

links to Bacteria
type: ObjectProperty
comment: Relazione tra Administrative Region e Bacteria @it
range: bacteria
domain: administrative region
comment: Relation between Administrative Region and Bacteria
sub property of: species

links to Basketball League
comment: Relation between Administrative Region and Basketball League
range: basketball league
comment: Relazione tra Administrative Region e Basketball League @it
sub property of: organisation
domain: administrative region
type: ObjectProperty

album
label: Album @de
type: Class

president
label: président @fr
type: Class

links to Village
related match: administrativeCenter
type: NamedIndividual
type: ObjectProperty
range: village
comment: Relation between Administrative Region and Village
sub property of: place
comment: Relazione tra Administrative Region e Village @it
domain: administrative region

links to Rocket
comment: Relation between Administrative Region and Rocket
domain: administrative region
sub property of: mean of transportation
range: rocket
type: ObjectProperty
comment: Relazione tra Administrative Region e Rocket @it

moss
label: mousses @fr
type: Class

military unit
label: unité militaire @fr
type: Class

links to Television Episode
sub property of: work
domain: administrative region
range: television episode
type: ObjectProperty
comment: Relazione tra Administrative Region e Television Episode @it
comment: Relation between Administrative Region and Television Episode

links to Website
domain: administrative region
comment: Relazione tra Administrative Region e Website @it
range: website
sub property of: website
comment: Relation between Administrative Region and Website
type: ObjectProperty

soccer manager
type: Class
label: entraîneur de football @fr

basketball team
type: Class

cycad
label: cycadophytes @fr
type: Class

links to Historic Building
comment: Relation between Administrative Region and Historic Building
comment: Relazione tra Administrative Region e Historic Building @it
type: ObjectProperty
range: historic building
domain: administrative region
sub property of: place

links to Legislature
domain: administrative region
comment: Relazione tra Administrative Region e Legislature @it
range: legislature
sub property of: organisation
type: NamedIndividual
related match: leaderTitle
comment: Relation between Administrative Region and Legislature
related match: council
type: ObjectProperty

links to Colour
domain: administrative region
sub property of: colour
type: ObjectProperty
comment: Relation between Administrative Region and Colour
range: colour
comment: Relazione tra Administrative Region e Colour @it

olympic result
label: résultat de Jeux Olympiques @fr
type: Class
type: ObjectProperty

crustacean
label: crustacés @fr
type: Class

film festival
type: Class
label: festival du film @fr

links to Record Label
comment: Relation between Administrative Region and Record Label
comment: Relazione tra Administrative Region e Record Label @it
domain: administrative region
sub property of: organisation
type: ObjectProperty
range: record label

lighthouse
label: phare @fr
type: Class

aircraft
label: αεροσκάφος @el
type: Class
label: avion @fr

links to School
comment: Relazione tra Administrative Region e School @it
comment: Relation between Administrative Region and School
type: ObjectProperty
domain: administrative region
range: school
sub property of: organisation

links to Congressman
domain: administrative region
comment: Relazione tra Administrative Region e Congressman @it
range: congressman
type: NamedIndividual
sub property of: person
type: ObjectProperty
related match: representative
related match: namedFor
comment: Relation between Administrative Region and Congressman

links to Sport
comment: Relation between Administrative Region and Sport
comment: Relazione tra Administrative Region e Sport @it
type: ObjectProperty
range: sport
domain: administrative region
sub property of: activity

links to Scientist
comment: Relazione tra Administrative Region e Scientist @it
comment: Relation between Administrative Region and Scientist
range: scientist
domain: administrative region
type: ObjectProperty
sub property of: person

links to Insect
comment: Relation between Administrative Region and Insect
type: ObjectProperty
domain: administrative region
sub property of: species
range: insect
comment: Relazione tra Administrative Region e Insect @it
type: NamedIndividual
related match: insect

legislature
type: Class
label: pouvoir législatif @fr

links to Park
domain: administrative region
type: ObjectProperty
range: park
comment: Relation between Administrative Region and Park
comment: Relazione tra Administrative Region e Park @it
sub property of: place

links to Gnetophytes
domain: administrative region
range: Gnetophytes
type: ObjectProperty
comment: Relation between Administrative Region and Gnetophytes
sub property of: species
comment: Relazione tra Administrative Region e Gnetophytes @it

airline
label: compagnie aérienne @fr
type: Class

monarch
label: monarque @fr
type: Class

golf player
type: Class
label: golfeur @fr

nascar driver
label: pilote de la nascar @fr
type: Class

space mission
label: mission spatiale @fr
label: διαστημική αποστολή @el
type: Class

insect
type: Class
label: insecte @fr

film
label: ταινία @el
type: Class

Supreme Court of the United States case
type: Class
label: cas juridique de la Cour suprême des États-Unis @fr

links to Saint
comment: Relazione tra Administrative Region e Saint @it
comment: Relation between Administrative Region and Saint
sub property of: person
domain: administrative region
range: saint
type: ObjectProperty

links to Governor
type: NamedIndividual
related match: namedFor
comment: Relazione tra Administrative Region e Governor @it
sub property of: person
comment: Relation between Administrative Region and Governor
type: ObjectProperty
range: governor
domain: administrative region

links to Soccer Manager
sub property of: person
comment: Relation between Administrative Region and Soccer Manager
range: soccer manager
domain: administrative region
type: ObjectProperty
comment: Relazione tra Administrative Region e Soccer Manager @it

Gaelic games player
label: joueur de sports gaéliques @fr
type: Class

musical artist
label: artista musical @pt
type: Class
label: musicien @fr

fungus
label: fungi @fr
type: Class

Axiom
dbpedia infobox matching weight: 100.0
annotated property: relatedMatch
annotated source: links to Military Person
annotated target: namedFor

park
type: Class
label: parc @fr

links to Bird
related match: bird
type: NamedIndividual
type: ObjectProperty
range: bird
comment: Relation between Administrative Region and Bird
sub property of: species
comment: Relazione tra Administrative Region e Bird @it
domain: administrative region

cardinal
type: Class

rugby player
type: Class
label: joueur de rugby @fr

american football league
type: Class

Axiom
dbpedia infobox matching weight: 100.0
annotated target: insect
annotated property: relatedMatch
annotated source: links to Insect

cyclist
label: cycliste @fr
type: Class

links to Restaurant
type: ObjectProperty
domain: administrative region
range: restaurant
sub property of: place
comment: Relation between Administrative Region and Restaurant
comment: Relazione tra Administrative Region e Restaurant @it

links to Fern
comment: Relation between Administrative Region and Fern
comment: Relazione tra Administrative Region e Fern @it
domain: administrative region
type: ObjectProperty
range: fern
sub property of: species

links to Grape
range: grape
comment: Relazione tra Administrative Region e Grape @it
sub property of: species
comment: Relation between Administrative Region and Grape
domain: administrative region
type: ObjectProperty

Axiom
dbpedia infobox matching weight: 66.67
annotated target: emblem
annotated source: links to Mammal
annotated property: relatedMatch

links to Chancellor
sub property of: person
type: ObjectProperty
comment: Relation between Administrative Region and Chancellor
range: chancellor
domain: administrative region
comment: Relazione tra Administrative Region e Chancellor @it

links to Music Festival
range: music festival
comment: Relation between Administrative Region and Music Festival
type: ObjectProperty
domain: administrative region
comment: Relazione tra Administrative Region e Music Festival @it
sub property of: event

basketball league
type: Class
label: ligue de basketball @fr

Axiom
dbpedia infobox matching weight: 50.0
annotated property: relatedMatch
annotated target: east
annotated source: links to Lake

links to Canadian Football Team
comment: Relazione tra Administrative Region e Canadian Football Team @it
type: ObjectProperty
sub property of: organisation
domain: administrative region
comment: Relation between Administrative Region and Canadian Football Team
range: canadian football team

saint
type: Class

senator
type: Class
label: sénateur @fr

valley
label: vallée @fr
type: Class

links to Comics Creator
sub property of: person
range: comics creator
domain: administrative region
comment: Relation between Administrative Region and Comics Creator
comment: Relazione tra Administrative Region e Comics Creator @it
type: ObjectProperty

links to British Royalty
domain: administrative region
sub property of: person
comment: Relazione tra Administrative Region e British Royalty @it
comment: Relation between Administrative Region and British Royalty
range: British royalty
type: ObjectProperty

song
type: Class
label: chanson @fr

links to Olympics
domain: administrative region
type: ObjectProperty
comment: Relation between Administrative Region and Olympics
range: olympics
sub property of: event
comment: Relazione tra Administrative Region e Olympics @it

links to Cardinal
range: cardinal
comment: Relation between Administrative Region and Cardinal
type: ObjectProperty
domain: administrative region
comment: Relazione tra Administrative Region e Cardinal @it
sub property of: person

book
label: książka @pl
label: llibre @ca
label: βιβλίο @el
label: livre @fr
type: Class

links to Prime Minister
comment: Relation between Administrative Region and Prime Minister
sub property of: person
type: ObjectProperty
domain: administrative region
comment: Relazione tra Administrative Region e Prime Minister @it
range: prime minister

device
type: ObjectProperty
label: appareil @fr

shopping mall
label: centre commercial @fr
type: Class

links to Band
domain: administrative region
comment: Relazione tra Administrative Region e Band @it
comment: Relation between Administrative Region and Band
range: Band
type: ObjectProperty
sub property of: organisation

links to Space Station
comment: Relation between Administrative Region and Space Station
domain: administrative region
sub property of: mean of transportation
type: ObjectProperty
comment: Relazione tra Administrative Region e Space Station @it
range: space station

links to Senator
type: NamedIndividual
related match: namedFor
range: senator
type: ObjectProperty
sub property of: person
domain: administrative region
comment: Relazione tra Administrative Region e Senator @it
comment: Relation between Administrative Region and Senator

ski area
label: domaine skiable @fr
type: Class

space station
label: station spatiale @fr
type: Class

non-profit organisation
label: organisation à but non lucratif @fr
type: Class

AdministrativeRegion.owl
imports: dbpediainfoboxmatchingweight.owl
imports: cpannotationschema.owl
has author: Valentina Presutti
type: Ontology
has author: Andrea Giovanni Nuzzolese
comment: AdministrativeRegion Encyclopedic Knowledge Pattern
has author: Aldo Gangemi
has intent: To represent the encyclopedic knowledge expressed by an object typed as AdministrativeRegion
extracted from: dbpedia.org
extracted from: en.wikipedia.org

links to Cricketer
domain: administrative region
comment: Relazione tra Administrative Region e Cricketer @it
comment: Relation between Administrative Region and Cricketer
range: cricketer
type: ObjectProperty
sub property of: person

canadian football league
type: Class

links to Gaelic Games Player
comment: Relation between Administrative Region and Gaelic Games Player
range: Gaelic games player
sub property of: person
type: ObjectProperty
comment: Relazione tra Administrative Region e Gaelic Games Player @it
domain: administrative region

rugby league
type: Class
label: ligue de rugby @fr

wine region
label: région viticole @fr
type: Class

links to Ski Area
sub property of: place
comment: Relation between Administrative Region and Ski Area
domain: administrative region
type: ObjectProperty
comment: Relazione tra Administrative Region e Ski Area @it
range: ski area

weapon
type: Class
label: arme @fr

links to Field Hockey League
comment: Relazione tra Administrative Region e Field Hockey League @it
domain: administrative region
sub property of: organisation
comment: Relation between Administrative Region and Field Hockey League
range: field hockey league
type: ObjectProperty

links to Basketball Team
domain: administrative region
sub property of: organisation
range: basketball team
type: ObjectProperty
comment: Relation between Administrative Region and Basketball Team
comment: Relazione tra Administrative Region e Basketball Team @it

links to Grand Prix
range: Grand Prix
sub property of: event
domain: administrative region
comment: Relazione tra Administrative Region e Grand Prix @it
type: ObjectProperty
comment: Relation between Administrative Region and Grand Prix

links to Amphibian
range: amphibian
comment: Relation between Administrative Region and Amphibian
sub property of: species
domain: administrative region
comment: Relazione tra Administrative Region e Amphibian @it
type: ObjectProperty

links to Beverage
domain: administrative region
sub property of: beverage
range: beverage
type: ObjectProperty
comment: Relazione tra Administrative Region e Beverage @it
comment: Relation between Administrative Region and Beverage

philosopher
type: Class
label: philosophe @fr

links to President
comment: Relation between Administrative Region and President
comment: Relazione tra Administrative Region e President @it
type: ObjectProperty
range: president
sub property of: person
domain: administrative region

links to Game
comment: Relation between Administrative Region and Game
range: game
type: ObjectProperty
domain: administrative region
sub property of: activity
comment: Relazione tra Administrative Region e Game @it

links to Cricket League
type: ObjectProperty
domain: administrative region
sub property of: organisation
comment: Relazione tra Administrative Region e Cricket League @it
range: cricket league
comment: Relation between Administrative Region and Cricket League

links to Golf Player
range: golf player
sub property of: person
type: ObjectProperty
domain: administrative region
comment: Relazione tra Administrative Region e Golf Player @it
comment: Relation between Administrative Region and Golf Player

sport
type: Class

automobile engine
type: Class
label: moteur d'automobile @fr

restaurant
type: Class

links to Supreme Court Of The United States Case
comment: Relation between Administrative Region and Supreme Court Of The United States Case
range: Supreme Court of the United States case
sub property of: Legal Case
domain: administrative region
comment: Relazione tra Administrative Region e Supreme Court Of The United States Case @it
type: ObjectProperty

links to Chemical Compound
type: ObjectProperty
domain: administrative region
comment: Relation between Administrative Region and Chemical Compound
range: chemical compound
sub property of: chemical compound
comment: Relazione tra Administrative Region e Chemical Compound @it

Band
label: groupe de musique @fr
type: Class
label: Musikgruppe @de
label: banda @pt

links to Film Festival
domain: administrative region
range: film festival
sub property of: event
comment: Relation between Administrative Region and Film Festival
comment: Relazione tra Administrative Region e Film Festival @it
type: ObjectProperty

town
label: ville @fr
type: Class

links to Comics Character
comment: Relation between Administrative Region and Comics Character
range: comics character
type: ObjectProperty
sub property of: person
comment: Relazione tra Administrative Region e Comics Character @it
domain: administrative region

university
label: πανεπιστήμιο @el
label: université @fr
type: Class

links to Space Shuttle
domain: administrative region
sub property of: mean of transportation
comment: Relation between Administrative Region and Space Shuttle
type: ObjectProperty
range: space shuttle
comment: Relazione tra Administrative Region e Space Shuttle @it

artery
label: artère @fr
type: Class
label: Arterie @de

Axiom
dbpedia infobox matching weight: 8.0
annotated source: links to Language
annotated target: fficialLanguages
annotated property: relatedMatch

hotel
type: Class
label: hôtel @fr

music festival
label: festival de musique @fr
type: Class

village
type: Class
label: χωριό @el

ice hockey league
label: ligue d'hockey sur glace @fr
type: Class

links to Military Person
type: ObjectProperty
domain: administrative region
comment: Relazione tra Administrative Region e Military Person @it
sub property of: person
comment: Relation between Administrative Region and Military Person
range: military person
related match: namedFor
type: NamedIndividual

links to Adult Actor
domain: administrative region
sub property of: person
comment: Relazione tra Administrative Region e Adult Actor @it
range: adult actor
comment: Relation between Administrative Region and Adult Actor
type: ObjectProperty

Axiom
dbpedia infobox matching weight: 90.14
annotated source: links to Town
annotated property: relatedMatch
annotated target: capital

links to Site Of Special Scientific Interest
type: ObjectProperty
comment: Relazione tra Administrative Region e Site Of Special Scientific Interest @it
sub property of: place
domain: administrative region
comment: Relation between Administrative Region and Site Of Special Scientific Interest
range: Site of Special Scientific Interest

links to Baseball League
type: ObjectProperty
range: baseball league
comment: Relation between Administrative Region and Baseball League
sub property of: organisation
domain: administrative region
comment: Relazione tra Administrative Region e Baseball League @it

office holder
type: Class
label: Amtsinhaber @de
label: titulaire @fr

baseball player
label: joueur de baseball @fr
type: Class

links to Music Genre
domain: administrative region
range: music genre
type: ObjectProperty
sub property of: music genre
comment: Relation between Administrative Region and Music Genre
comment: Relazione tra Administrative Region e Music Genre @it

website
type: ObjectProperty
type: Class
label: site web @fr
label: Ιστότοπος @el

grape
type: Class
label: raisin @fr

links to Ice Hockey League
domain: administrative region
comment: Relation between Administrative Region and Ice Hockey League
range: ice hockey league
comment: Relazione tra Administrative Region e Ice Hockey League @it
sub property of: organisation
type: ObjectProperty

Axiom
dbpedia infobox matching weight: 50.0
annotated target: label
annotated property: relatedMatch
annotated source: links to Lake

basketball player
type: Class
label: joueur de basketball @fr

adult actor
label: erwachsener Schauspieler @de
type: Class
label: acteur adulte @fr

links to Book
sub property of: work
comment: Relation between Administrative Region and Book
range: book
comment: Relazione tra Administrative Region e Book @it
type: ObjectProperty
domain: administrative region

ice hockey player
type: Class
label: joueur de hockey sur glace @fr

links to Mayor
type: ObjectProperty
domain: administrative region
comment: Relazione tra Administrative Region e Mayor @it
sub property of: person
comment: Relation between Administrative Region and Mayor
range: mayor

Axiom
dbpedia infobox matching weight: 100.0
annotated target: namedFor
annotated source: links to Senator
annotated property: relatedMatch

links to Album
domain: administrative region
type: ObjectProperty
sub property of: work
comment: Relazione tra Administrative Region e Album @it
comment: Relation between Administrative Region and Album
range: album

beverage
type: ObjectProperty
type: Class
label: boisson @fr

links to Architect
comment: Relation between Administrative Region and Architect
type: ObjectProperty
domain: administrative region
sub property of: person
comment: Relazione tra Administrative Region e Architect @it
range: architect

links to Basketball Player
domain: administrative region
type: ObjectProperty
sub property of: person
comment: Relazione tra Administrative Region e Basketball Player @it
comment: Relation between Administrative Region and Basketball Player
range: basketball player

planet
type: Class
label: planète @fr
type: ObjectProperty

Axiom
dbpedia infobox matching weight: 50.0
annotated source: links to River
annotated property: relatedMatch
annotated target: namedFor

links to Club Moss
comment: Relation between Administrative Region and Club Moss
type: ObjectProperty
domain: administrative region
range: club moss
sub property of: species
comment: Relazione tra Administrative Region e Club Moss @it

scientist
label: Wissenschaftler @de
type: Class
label: scientifique @fr

links to Soccer League
comment: Relation between Administrative Region and Soccer League
domain: administrative region
sub property of: organisation
range: soccer league
comment: Relazione tra Administrative Region e Soccer League @it
type: ObjectProperty

golf league
label: ligue de golf @fr
type: Class

links to Musical
domain: administrative region
range: musical
comment: Relazione tra Administrative Region e Musical @it
type: ObjectProperty
comment: Relation between Administrative Region and Musical
sub property of: work

links to Space Mission
comment: Relazione tra Administrative Region e Space Mission @it
sub property of: event
comment: Relation between Administrative Region and Space Mission
range: space mission
domain: administrative region
type: ObjectProperty

olympics
type: Class
label: Jeux Olympiques @fr

Axiom
dbpedia infobox matching weight: 68.0
annotated property: relatedMatch
annotated source: links to Language
annotated target: officialLanguages

links to American Football Player
range: american football player
sub property of: person
comment: Relation between Administrative Region and American Football Player
comment: Relazione tra Administrative Region e American Football Player @it
type: ObjectProperty
domain: administrative region

bridge
type: Class
label: pont @fr

broadcast
label: Émission de télévision @fr
type: Class

links to Hospital
type: ObjectProperty
domain: administrative region
sub property of: place
range: hospital
comment: Relation between Administrative Region and Hospital
comment: Relazione tra Administrative Region e Hospital @it

links to Military Conflict
type: NamedIndividual
related match: era
sub property of: event
domain: administrative region
type: ObjectProperty
range: military conflict
comment: Relazione tra Administrative Region e Military Conflict @it
comment: Relation between Administrative Region and Military Conflict

island
type: Class
label: νησί @el
label: île @fr

links to Radio Station
domain: administrative region
sub property of: organisation
range: radio station
comment: Relation between Administrative Region and Radio Station
comment: Relazione tra Administrative Region e Radio Station @it
type: ObjectProperty

Axiom
dbpedia infobox matching weight: 100.0
annotated source: links to Governor
annotated property: relatedMatch
annotated target: namedFor

comics character
type: Class
label: personnage de bandes dessinées @fr

event
type: ObjectProperty
label: évènement @fr

skyscraper
type: Class
label: gratte-ciel @fr

Formula One racer
label: pilote de formule 1 @fr
type: Class

links to Poker Player
comment: Relazione tra Administrative Region e Poker Player @it
type: ObjectProperty
range: poker player
comment: Relation between Administrative Region and Poker Player
domain: administrative region
sub property of: person

radio station
label: station de radio @fr
type: Class

member of parliament
type: Class
label: membre du Parlement @fr

bone
type: Class
label: Knochen @de
label: os @fr

links to Writer
domain: administrative region
comment: Relazione tra Administrative Region e Writer @it
sub property of: person
type: ObjectProperty
comment: Relation between Administrative Region and Writer
range: writer
related match: source
type: NamedIndividual

Axiom
dbpedia infobox matching weight: 4.0
annotated source: links to Language
annotated property: relatedMatch
annotated target: officiallang

links to Cycad
type: ObjectProperty
comment: Relazione tra Administrative Region e Cycad @it
domain: administrative region
sub property of: species
comment: Relation between Administrative Region and Cycad
range: cycad

links to Conifer
range: conifer
type: ObjectProperty
comment: Relazione tra Administrative Region e Conifer @it
sub property of: species
domain: administrative region
comment: Relation between Administrative Region and Conifer

links to Valley
comment: Relation between Administrative Region and Valley
comment: Relazione tra Administrative Region e Valley @it
type: ObjectProperty
domain: administrative region
sub property of: place
range: valley

airport
label: aéroport @fr
label: Flughafen @de
type: Class

conifer
type: Class
label: conifères @fr

links to Hotel
range: hotel
domain: administrative region
comment: Relazione tra Administrative Region e Hotel @it
type: ObjectProperty
sub property of: place
comment: Relation between Administrative Region and Hotel

rocket
label: fusée @fr
type: Class

disease
type: ObjectProperty
type: Class
label: maladie @fr

links to Airport
type: ObjectProperty
comment: Relation between Administrative Region and Airport
range: airport
sub property of: place
comment: Relazione tra Administrative Region e Airport @it
domain: administrative region

links to Station
range: station
comment: Relation between Administrative Region and Station
comment: Relazione tra Administrative Region e Station @it
type: ObjectProperty
sub property of: place
domain: administrative region

links to Currency
comment: Relazione tra Administrative Region e Currency @it
sub property of: currency
domain: administrative region
range: currency
type: ObjectProperty
comment: Relation between Administrative Region and Currency

Axiom
dbpedia infobox matching weight: 8.0
annotated property: relatedMatch
annotated source: links to Language
annotated target: language

links to College Coach
range: college coach
comment: Relation between Administrative Region and College Coach
type: ObjectProperty
sub property of: person
domain: administrative region
comment: Relazione tra Administrative Region e College Coach @it

american football player
label: joueur de football américain @fr
type: Class

Legal Case
label: cas juridique @fr
type: ObjectProperty

Axiom
dbpedia infobox matching weight: 50.0
annotated source: links to Fish
annotated target: emblem
annotated property: relatedMatch

stadium
type: Class
label: stade @fr

astronaut
type: Class
label: Astronaut @de
label: astronaute @fr

links to Womens Tennis Association Tournament
sub property of: event
comment: Relazione tra Administrative Region e Womens Tennis Association Tournament @it
range: Women's Tennis Association tournament
type: ObjectProperty
domain: administrative region
comment: Relation between Administrative Region and Womens Tennis Association Tournament

links to Planet
range: planet
comment: Relation between Administrative Region and Planet
type: ObjectProperty
domain: administrative region
comment: Relazione tra Administrative Region e Planet @it
sub property of: planet

links to Boxer
domain: administrative region
type: ObjectProperty
range: boxer
comment: Relazione tra Administrative Region e Boxer @it
sub property of: person
comment: Relation between Administrative Region and Boxer

links to Video Game
domain: administrative region
sub property of: work
comment: Relazione tra Administrative Region e Video Game @it
comment: Relation between Administrative Region and Video Game
range: video game
type: ObjectProperty

Site of Special Scientific Interest
type: Class
label: site d'intérêt scientifique particulier @fr

mayor
label: maire @fr
type: Class

Axiom
dbpedia infobox matching weight: 0.34
annotated property: relatedMatch
annotated source: links to Town
annotated target: largestCity

amphibian
type: Class
label: amphibien @fr

pope
label: pape @fr
type: Class

newspaper
type: Class
label: journal @fr

Axiom
dbpedia infobox matching weight: 33.33
annotated property: relatedMatch
annotated source: links to Mammal
annotated target: blankValue

protected area
label: aire protégée @fr
label: προστατευμένη περιοχή @el
type: Class

game
label: jeu @fr
type: Class

ginkgo
type: Class

links to Softball League
range: softball league
sub property of: organisation
type: ObjectProperty
domain: administrative region
comment: Relation between Administrative Region and Softball League
comment: Relazione tra Administrative Region e Softball League @it

links to Formula One Racer
domain: administrative region
comment: Relazione tra Administrative Region e Formula One Racer @it
type: ObjectProperty
comment: Relation between Administrative Region and Formula One Racer
range: Formula One racer
sub property of: person

links to Tennis League
comment: Relation between Administrative Region and Tennis League
range: tennis league
sub property of: organisation
domain: administrative region
comment: Relazione tra Administrative Region e Tennis League @it
type: ObjectProperty

links to Weapon
domain: administrative region
range: weapon
comment: Relazione tra Administrative Region e Weapon @it
sub property of: device
type: ObjectProperty
comment: Relation between Administrative Region and Weapon

language
type: Class
label: langage @fr
type: ObjectProperty

tennis league
type: Class
label: ligue de tennis @fr

links to Museum
range: museum
type: ObjectProperty
comment: Relazione tra Administrative Region e Museum @it
sub property of: place
comment: Relation between Administrative Region and Museum
domain: administrative region

Axiom
dbpedia infobox matching weight: 100.0
annotated property: relatedMatch
annotated target: reptile
annotated source: links to Reptile

links to Lighthouse
domain: administrative region
range: lighthouse
comment: Relazione tra Administrative Region e Lighthouse @it
comment: Relation between Administrative Region and Lighthouse
type: ObjectProperty
sub property of: place

work
label: obra @pt
label: travail @fr
type: ObjectProperty

river
type: Class
label: rivière @fr

lacrosse league
label: ligue de crosse @fr
type: Class

school
type: Class
label: école @fr

museum
label: musée @fr
type: Class

video game
type: Class
label: jeux vidéo @fr

trade union
label: syndicat professionnel @fr
type: Class

currency
type: Class
label: devise @fr
type: ObjectProperty

British royalty
label: royauté Britannique @fr
type: Class

historic place
label: site historique @fr
type: Class

softball league
label: ligue de softball @fr
type: Class

links to Monarch
sub property of: person
comment: Relazione tra Administrative Region e Monarch @it
type: ObjectProperty
range: monarch
domain: administrative region
comment: Relation between Administrative Region and Monarch

links to Nascar Driver
sub property of: person
comment: Relazione tra Administrative Region e Nascar Driver @it
range: nascar driver
domain: administrative region
type: ObjectProperty
comment: Relation between Administrative Region and Nascar Driver

monument
type: Class

links to Non- Profit Organisation
domain: administrative region
comment: Relazione tra Administrative Region e Non- Profit Organisation @it
comment: Relation between Administrative Region and Non- Profit Organisation
type: ObjectProperty
sub property of: organisation
range: non-profit organisation

links to Locomotive
comment: Relation between Administrative Region and Locomotive
type: ObjectProperty
range: locomotive
comment: Relazione tra Administrative Region e Locomotive @it
domain: administrative region
sub property of: mean of transportation

links to Monument
comment: Relazione tra Administrative Region e Monument @it
range: monument
comment: Relation between Administrative Region and Monument
type: ObjectProperty
sub property of: place
domain: administrative region

Axiom
dbpedia infobox matching weight: 50.0
annotated property: relatedMatch
annotated target: representative
annotated source: links to Congressman

links to Magazine
range: magazine
comment: Relazione tra Administrative Region e Magazine @it
type: ObjectProperty
sub property of: work
comment: Relation between Administrative Region and Magazine
domain: administrative region

links to Ice Hockey Player
type: ObjectProperty
domain: administrative region
range: ice hockey player
comment: Relation between Administrative Region and Ice Hockey Player
sub property of: person
comment: Relazione tra Administrative Region e Ice Hockey Player @it

continent
label: ήπειρος @el
type: Class

links to Cyclist
domain: administrative region
type: ObjectProperty
range: cyclist
sub property of: person
comment: Relation between Administrative Region and Cyclist
comment: Relazione tra Administrative Region e Cyclist @it

figure skater
type: Class
label: patineur artistique @fr

links to Ship
comment: Relation between Administrative Region and Ship
domain: administrative region
comment: Relazione tra Administrative Region e Ship @it
type: ObjectProperty
sub property of: mean of transportation
range: ship

cricket league
type: Class
label: ligue de cricket @fr

links to Judge
sub property of: person
comment: Relation between Administrative Region and Judge
comment: Relazione tra Administrative Region e Judge @it
type: ObjectProperty
range: judge
domain: administrative region

links to Automobile
comment: Relation between Administrative Region and Automobile
domain: administrative region
comment: Relazione tra Administrative Region e Automobile @it
sub property of: mean of transportation
type: ObjectProperty
range: automobile

links to Figure Skater
sub property of: person
comment: Relazione tra Administrative Region e Figure Skater @it
domain: administrative region
comment: Relation between Administrative Region and Figure Skater
type: ObjectProperty
range: figure skater

links to Election
type: ObjectProperty
domain: administrative region
comment: Relation between Administrative Region and Election
sub property of: event
range: Election
comment: Relazione tra Administrative Region e Election @it

person
label: personne @fr
label: pessoa @pt
type: ObjectProperty
label: Person @de

links to Christian Bishop
comment: Relation between Administrative Region and Christian Bishop
domain: administrative region
sub property of: person
range: Christian Bishop
type: ObjectProperty
comment: Relazione tra Administrative Region e Christian Bishop @it

canadian football team
type: Class
label: équipe canadienne de football américain @fr

music genre
type: Class
label: género musical @pt
type: ObjectProperty
label: genre musical @fr

writer
type: Class
label: écrivain @fr

record label
label: label discographique @fr
type: Class

architect
label: architecte @fr
type: Class

model
type: Class
label: mannequin @fr

ambassador
label: ambassadeur @fr
type: Class

Axiom
dbpedia infobox matching weight: 100.0
annotated source: links to Office Holder
annotated target: namedFor
annotated property: relatedMatch

Grand Prix
label: grand prix @fr
type: Class

links to Protected Area
comment: Relazione tra Administrative Region e Protected Area @it
comment: Relation between Administrative Region and Protected Area
type: ObjectProperty
range: protected area
domain: administrative region
sub property of: place

chancellor
label: chancelier @fr
type: Class

links to Speedway League
type: ObjectProperty
sub property of: organisation
domain: administrative region
comment: Relation between Administrative Region and Speedway League
range: speedway league
comment: Relazione tra Administrative Region e Speedway League @it

comics creator
type: Class
label: créateur de bandes dessinées @fr

links to Fungus
range: fungus
comment: Relazione tra Administrative Region e Fungus @it
domain: administrative region
comment: Relation between Administrative Region and Fungus
type: ObjectProperty
sub property of: species

hockey team
label: équipe de hockey @fr
type: Class

links to Shopping Mall
range: shopping mall
type: ObjectProperty
sub property of: place
domain: administrative region
comment: Relation between Administrative Region and Shopping Mall
comment: Relazione tra Administrative Region e Shopping Mall @it

club moss
label: lycopodiopsida @fr
type: Class

soccer player
type: Class
label: joueur de football @fr

links to Lake
type: NamedIndividual
type: ObjectProperty
domain: administrative region
comment: Relation between Administrative Region and Lake
comment: Relazione tra Administrative Region e Lake @it
range: lake
related match: label
related match: east
sub property of: place

reptile
type: Class

cave
type: Class
label: grotte @fr

links to Historic Place
domain: administrative region
sub property of: place
type: ObjectProperty
comment: Relation between Administrative Region and Historic Place
comment: Relazione tra Administrative Region e Historic Place @it
range: historic place

congressman
label: membre du Congrès @fr
type: Class

activity
label: activité @fr
label: Aktivität @de
type: ObjectProperty

Gnetophytes
type: Class
label: gnétophytes @fr

links to Soccer Player
type: ObjectProperty
comment: Relazione tra Administrative Region e Soccer Player @it
comment: Relation between Administrative Region and Soccer Player
sub property of: person
domain: administrative region
range: soccer player

journalist
label: journaliste @fr
type: Class

links to Film
domain: administrative region
comment: Relazione tra Administrative Region e Film @it
type: ObjectProperty
range: film
comment: Relation between Administrative Region and Film
sub property of: work

links to Ambassador
domain: administrative region
comment: Relazione tra Administrative Region e Ambassador @it
range: ambassador
comment: Relation between Administrative Region and Ambassador
type: ObjectProperty
sub property of: person

links to Model
type: ObjectProperty
domain: administrative region
sub property of: person
range: model
comment: Relazione tra Administrative Region e Model @it
comment: Relation between Administrative Region and Model

links to Road
range: road
domain: administrative region
comment: Relation between Administrative Region and Road
comment: Relazione tra Administrative Region e Road @it
type: ObjectProperty
sub property of: infrastructure

american football team
type: Class
label: équipe américaine de football américain @fr

links to Military Unit
comment: Relazione tra Administrative Region e Military Unit @it
range: military unit
sub property of: organisation
comment: Relation between Administrative Region and Military Unit
type: ObjectProperty
domain: administrative region

chemical compound
type: Class
type: ObjectProperty
label: produit chimique @fr

bird
type: Class
label: oiseau @fr

links to World Heritage Site
sub property of: place
comment: Relazione tra Administrative Region e World Heritage Site @it
domain: administrative region
comment: Relation between Administrative Region and World Heritage Site
type: ObjectProperty
range: World Heritage Site

power station
type: Class

fern
label: fougères @fr
type: Class

links to Olympic Result
range: olympic result
comment: Relazione tra Administrative Region e Olympic Result @it
type: ObjectProperty
domain: administrative region
comment: Relation between Administrative Region and Olympic Result
sub property of: olympic result

links to Mollusca
range: mollusca
comment: Relazione tra Administrative Region e Mollusca @it
domain: administrative region
comment: Relation between Administrative Region and Mollusca
sub property of: species
type: ObjectProperty

links to Broadcast
range: broadcast
type: ObjectProperty
sub property of: organisation
domain: administrative region
comment: Relazione tra Administrative Region e Broadcast @it
comment: Relation between Administrative Region and Broadcast

Axiom
dbpedia infobox matching weight: 100.0
annotated target: era
annotated property: relatedMatch
annotated source: links to Military Conflict

musical
label: musique @fr
type: Class

place
label: lugar @pt
label: lieu @fr
label: περιοχή @el
type: ObjectProperty

links to Island
type: ObjectProperty
comment: Relation between Administrative Region and Island
domain: administrative region
sub property of: place
range: island
comment: Relazione tra Administrative Region e Island @it

infrastructure
type: ObjectProperty

mountain
label: Βουνό @el
label: montagne @fr
type: Class

criminal
label: criminel @fr
type: Class

links to Canadian Football League
type: ObjectProperty
sub property of: organisation
comment: Relazione tra Administrative Region e Canadian Football League @it
domain: administrative region
comment: Relation between Administrative Region and Canadian Football League
range: canadian football league

space shuttle
type: Class
label: navette spatiale @fr

links to Tennis Player
range: tennis player
domain: administrative region
type: ObjectProperty
sub property of: person
comment: Relazione tra Administrative Region e Tennis Player @it
comment: Relation between Administrative Region and Tennis Player

links to Comedian
comment: Relazione tra Administrative Region e Comedian @it
sub property of: person
type: ObjectProperty
comment: Relation between Administrative Region and Comedian
domain: administrative region
range: comedian

comedian
label: comédien @fr
type: Class

links to Newspaper
type: ObjectProperty
sub property of: work
domain: administrative region
range: newspaper
comment: Relazione tra Administrative Region e Newspaper @it
comment: Relation between Administrative Region and Newspaper

Playboy Playmate
type: Class
label: playmate pour Playboy @fr

bacteria
label: bactérie @fr
type: Class

Axiom
dbpedia infobox matching weight: 100.0
annotated property: relatedMatch
annotated source: links to Member Of Parliament
annotated target: mps

links to Cave
type: ObjectProperty
range: cave
sub property of: place
comment: Relation between Administrative Region and Cave
domain: administrative region
comment: Relazione tra Administrative Region e Cave @it

mollusca
label: mollusque @fr
type: Class

links to Arachnid
comment: Relazione tra Administrative Region e Arachnid @it
comment: Relation between Administrative Region and Arachnid
type: ObjectProperty
range: arachnid
domain: administrative region
sub property of: species

links to Hockey Team
range: hockey team
comment: Relation between Administrative Region and Hockey Team
comment: Relazione tra Administrative Region e Hockey Team @it
domain: administrative region
sub property of: organisation
type: ObjectProperty

drug
type: Class
label: médicament @fr
type: ObjectProperty

links to Power Station
comment: Relation between Administrative Region and Power Station
domain: administrative region
comment: Relazione tra Administrative Region e Power Station @it
range: power station
sub property of: infrastructure
type: ObjectProperty

magazine
type: Class
label: περιοδικό @el

links to Language
related match: fficialLanguages
sub property of: language
type: ObjectProperty
comment: Relazione tra Administrative Region e Language @it
comment: Relation between Administrative Region and Language
related match: officialLanguages
related match: officiallang
range: language
type: NamedIndividual
related match: language
related match: languages
domain: administrative region

links to Moss
sub property of: species
domain: administrative region
comment: Relazione tra Administrative Region e Moss @it
comment: Relation between Administrative Region and Moss
range: moss
type: ObjectProperty

links to Philosopher
comment: Relazione tra Administrative Region e Philosopher @it
sub property of: person
range: philosopher
comment: Relation between Administrative Region and Philosopher
domain: administrative region
type: ObjectProperty

canal
type: Class

links to College
comment: Relazione tra Administrative Region e College @it
sub property of: organisation
comment: Relation between Administrative Region and College
domain: administrative region
type: ObjectProperty
range: college

military person
type: Class
label: militaire @fr

Axiom
dbpedia infobox matching weight: 4.76
annotated property: relatedMatch
annotated target: administrativeCenter
annotated source: links to Town

links to Skyscraper
sub property of: place
comment: Relazione tra Administrative Region e Skyscraper @it
comment: Relation between Administrative Region and Skyscraper
type: ObjectProperty
range: skyscraper
domain: administrative region

award
type: Class
label: récompense @fr
type: ObjectProperty

locomotive
type: Class

links to Wine Region
comment: Relation between Administrative Region and Wine Region
type: ObjectProperty
domain: administrative region
comment: Relazione tra Administrative Region e Wine Region @it
sub property of: place
range: wine region

college
type: Class

anatomical structure
label: structure anatomique @fr
type: ObjectProperty

cricketer
type: Class
label: joueur de cricket @fr

single
type: Class

links to Drug
sub property of: drug
comment: Relazione tra Administrative Region e Drug @it
type: ObjectProperty
range: drug
domain: administrative region
comment: Relation between Administrative Region and Drug

links to Playboy Playmate
comment: Relazione tra Administrative Region e Playboy Playmate @it
range: Playboy Playmate
type: ObjectProperty
domain: administrative region
comment: Relation between Administrative Region and Playboy Playmate
sub property of: person

links to Astronaut
comment: Relation between Administrative Region and Astronaut
domain: administrative region
range: astronaut
comment: Relazione tra Administrative Region e Astronaut @it
type: ObjectProperty
sub property of: person

links to Mountain
comment: Relazione tra Administrative Region e Mountain @it
type: ObjectProperty
sub property of: place
domain: administrative region
comment: Relation between Administrative Region and Mountain
range: mountain

ethnic group
label: groupe ethnique @fr
type: ObjectProperty
type: Class

links to American Football League
comment: Relazione tra Administrative Region e American Football League @it
comment: Relation between Administrative Region and American Football League
range: american football league
sub property of: organisation
domain: administrative region
type: ObjectProperty

links to Musical Artist
domain: administrative region
comment: Relazione tra Administrative Region e Musical Artist @it
type: ObjectProperty
sub property of: person
range: musical artist
comment: Relation between Administrative Region and Musical Artist

Axiom
dbpedia infobox matching weight: 1.36
annotated property: relatedMatch
annotated source: links to Town
annotated target: muns

field hockey league
label: ligue d'hockey sur gazon @fr
type: Class

college coach
label: entraîneur universitaire @fr
type: Class

television episode
label: épisode télévisé @fr
type: Class

soccer club
type: Class
label: club de football @fr

historic building
type: Class
label: bâtiment historique @fr

Axiom
dbpedia infobox matching weight: 100.0
annotated source: links to Mountain Range
annotated property: relatedMatch
annotated target: highestpoint

military conflict
type: Class
label: conflit militaire @fr

links to Mountain Range
domain: administrative region
type: ObjectProperty
sub property of: place
range: mountain range
comment: Relation between Administrative Region and Mountain Range
comment: Relazione tra Administrative Region e Mountain Range @it
type: NamedIndividual
related match: highestpoint

links to Bridge
sub property of: place
comment: Relation between Administrative Region and Bridge
type: ObjectProperty
comment: Relazione tra Administrative Region e Bridge @it
range: bridge
domain: administrative region

links to Badminton Player
sub property of: person
range: badminton player
comment: Relation between Administrative Region and Badminton Player
type: ObjectProperty
domain: administrative region
comment: Relazione tra Administrative Region e Badminton Player @it

links to Town
type: ObjectProperty
domain: administrative region
related match: capital
comment: Relazione tra Administrative Region e Town @it
comment: Relation between Administrative Region and Town
related match: administrativeCenter
sub property of: place
related match: muns
type: NamedIndividual
related match: largestCity
range: town
related match: seat

links to Automobile Engine
sub property of: device
comment: Relation between Administrative Region and Automobile Engine
domain: administrative region
range: automobile engine
type: ObjectProperty
comment: Relazione tra Administrative Region e Automobile Engine @it

links to Golf League
comment: Relation between Administrative Region and Golf League
type: ObjectProperty
comment: Relazione tra Administrative Region e Golf League @it
domain: administrative region
range: golf league
sub property of: organisation

links to Airline
comment: Relation between Administrative Region and Airline
sub property of: organisation
domain: administrative region
range: airline
type: ObjectProperty
comment: Relazione tra Administrative Region e Airline @it

links to Aircraft
domain: administrative region
sub property of: mean of transportation
comment: Relazione tra Administrative Region e Aircraft @it
type: ObjectProperty
range: aircraft
comment: Relation between Administrative Region and Aircraft

Christian Bishop
type: Class
label: évêque chrétien @fr

mountain range
label: chaîne de montagne @fr
type: Class

links to Disease
type: ObjectProperty
domain: administrative region
comment: Relation between Administrative Region and Disease
comment: Relazione tra Administrative Region e Disease @it
sub property of: disease
range: disease

Axiom
dbpedia infobox matching weight: 50.0
annotated property: relatedMatch
annotated source: links to Fish
annotated target: fish

links to Award
range: award
type: ObjectProperty
comment: Relation between Administrative Region and Award
comment: Relazione tra Administrative Region e Award @it
sub property of: award
domain: administrative region

links to Canal
comment: Relazione tra Administrative Region e Canal @it
type: ObjectProperty
range: canal
domain: administrative region
comment: Relation between Administrative Region and Canal
sub property of: place

links to Journalist
range: journalist
comment: Relazione tra Administrative Region e Journalist @it
domain: administrative region
sub property of: person
type: ObjectProperty
comment: Relation between Administrative Region and Journalist

links to Ethnic Group
sub property of: ethnic group
domain: administrative region
range: ethnic group
type: ObjectProperty
comment: Relation between Administrative Region and Ethnic Group
comment: Relazione tra Administrative Region e Ethnic Group @it

links to River
range: river
domain: administrative region
type: ObjectProperty
sub property of: place
comment: Relazione tra Administrative Region e River @it
related match: east
type: NamedIndividual
comment: Relation between Administrative Region and River
related match: namedFor

links to Television Show
type: ObjectProperty
comment: Relation between Administrative Region and Television Show
comment: Relazione tra Administrative Region e Television Show @it
domain: administrative region
sub property of: work
range: television show

links to Member Of Parliament
type: NamedIndividual
related match: mps
type: ObjectProperty
sub property of: person
comment: Relation between Administrative Region and Member Of Parliament
domain: administrative region
range: member of parliament
comment: Relazione tra Administrative Region e Member Of Parliament @it

links to Criminal
range: criminal
comment: Relation between Administrative Region and Criminal
sub property of: person
comment: Relazione tra Administrative Region e Criminal @it
type: ObjectProperty
domain: administrative region

badminton player
type: Class
label: joueur de badminton @fr

organisation
label: Organisation @de
label: organização @pt
type: ObjectProperty

baseball league
type: Class
label: ligue de baseball @fr

Axiom
dbpedia infobox matching weight: 3.4
annotated property: relatedMatch
annotated source: links to Town
annotated target: seat

mammal
label: mammifère @fr
type: Class

links to University
comment: Relation between Administrative Region and University
type: ObjectProperty
comment: Relazione tra Administrative Region e University @it
sub property of: organisation
domain: administrative region
range: university

links to Ginkgo
comment: Relazione tra Administrative Region e Ginkgo @it
type: ObjectProperty
range: ginkgo
sub property of: species
domain: administrative region
comment: Relation between Administrative Region and Ginkgo

links to Wrestler
range: wrestler
comment: Relation between Administrative Region and Wrestler
comment: Relazione tra Administrative Region e Wrestler @it
sub property of: person
domain: administrative region
type: ObjectProperty