Axiom
dbpedia infobox matching weight: 36.36
annotated target: before
annotated property: relatedMatch
annotated source: links to Baseball Player

links to Bridge
sub property of: place
domain: american football player
comment: Relation between American Football Player and Bridge
comment: Relazione tra American Football Player e Bridge @it
type: ObjectProperty
range: bridge

television show
label: émission de télévision @fr
type: Class

links to Scientist
comment: Relation between American Football Player and Scientist
range: scientist
comment: Relazione tra American Football Player e Scientist @it
domain: american football player
type: ObjectProperty
sub property of: person

links to Basketball Player
related match: after
comment: Relazione tra American Football Player e Basketball Player @it
type: NamedIndividual
comment: Relation between American Football Player and Basketball Player
related match: years
type: ObjectProperty
domain: american football player
sub property of: person
range: basketball player
related match: before

disease
type: ObjectProperty
type: Class
label: maladie @fr

links to Supreme Court Of The United States Case
type: ObjectProperty
comment: Relation between American Football Player and Supreme Court Of The United States Case
domain: american football player
sub property of: Legal Case
comment: Relazione tra American Football Player e Supreme Court Of The United States Case @it
range: Supreme Court of the United States case

Axiom
dbpedia infobox matching weight: 84.21
annotated source: links to Award
annotated property: relatedMatch
annotated target: title

automobile
type: Class

links to Band
range: Band
domain: american football player
sub property of: organização
comment: Relation between American Football Player and Band
type: ObjectProperty
comment: Relazione tra American Football Player e Band @it

colour
type: Class
label: couleur @fr
label: χρώμα @el
type: ObjectProperty

Election
label: élection @fr
type: Class

links to Military Person
related match: after
comment: Relation between American Football Player and Military Person
domain: american football player
related match: years
comment: Relazione tra American Football Player e Military Person @it
type: ObjectProperty
type: NamedIndividual
related match: before
range: military person
sub property of: person

mean of transportation
label: moyen de transport @fr
type: ObjectProperty

american football player
type: Class
label: joueur de football américain @fr

Legal Case
type: ObjectProperty
label: cas juridique @fr

links to Single
comment: Relazione tra American Football Player e Single @it
type: ObjectProperty
range: single
domain: american football player
sub property of: work
comment: Relation between American Football Player and Single

links to Legislature
range: legislature
sub property of: organização
domain: american football player
comment: Relazione tra American Football Player e Legislature @it
type: ObjectProperty
comment: Relation between American Football Player and Legislature

links to Lacrosse League
type: ObjectProperty
sub property of: organização
domain: american football player
range: lacrosse league
comment: Relation between American Football Player and Lacrosse League
comment: Relazione tra American Football Player e Lacrosse League @it

stadium
label: stade @fr
type: Class

links to Nerve
comment: Relation between American Football Player and Nerve
domain: american football player
range: nerve
type: ObjectProperty
sub property of: anatomical structure
comment: Relazione tra American Football Player e Nerve @it

links to Village
comment: Relazione tra American Football Player e Village @it
sub property of: place
range: village
domain: american football player
comment: Relation between American Football Player and Village
type: ObjectProperty

soccer league
type: Class
label: ligue de football @fr

links to Baseball Player
related match: after
comment: Relazione tra American Football Player e Baseball Player @it
sub property of: person
domain: american football player
range: baseball player
related match: before
type: NamedIndividual
type: ObjectProperty
comment: Relation between American Football Player and Baseball Player

links to Airline
comment: Relazione tra American Football Player e Airline @it
type: ObjectProperty
sub property of: organização
range: airline
domain: american football player
comment: Relation between American Football Player and Airline

astronaut
label: astronaute @fr
label: Astronaut @de
type: Class

links to Canadian Football Team
type: NamedIndividual
related match: title
range: canadian football team
comment: Relazione tra American Football Player e Canadian Football Team @it
related match: teams
type: ObjectProperty
sub property of: organização
domain: american football player
comment: Relation between American Football Player and Canadian Football Team

links to Non- Profit Organisation
comment: Relation between American Football Player and Non- Profit Organisation
comment: Relazione tra American Football Player e Non- Profit Organisation @it
type: ObjectProperty
sub property of: organização
domain: american football player
range: non-profit organisation

links to Automobile
type: ObjectProperty
comment: Relation between American Football Player and Automobile
comment: Relazione tra American Football Player e Automobile @it
range: automobile
domain: american football player
sub property of: mean of transportation

links to Drug
range: drug
domain: american football player
sub property of: drug
comment: Relazione tra American Football Player e Drug @it
comment: Relation between American Football Player and Drug
type: ObjectProperty

wrestler
type: Class
label: lutteur @fr

mayor
type: Class
label: maire @fr

Axiom
dbpedia infobox matching weight: 100.0
annotated source: links to Cyclist
annotated property: relatedMatch
annotated target: before

pope
label: pape @fr
type: Class

Axiom
dbpedia infobox matching weight: 100.0
annotated property: relatedMatch
annotated source: links to Historic Place
annotated target: college

species
type: Class
label: espèce @fr
type: ObjectProperty

links to Bird
type: ObjectProperty
range: bird
comment: Relazione tra American Football Player e Bird @it
domain: american football player
sub property of: species
comment: Relation between American Football Player and Bird

newspaper
type: Class
label: journal @fr

protected area
label: aire protégée @fr
label: προστατευμένη περιοχή @el
type: Class

game
type: Class
label: jeu @fr

links to Television Show
domain: american football player
range: television show
comment: Relation between American Football Player and Television Show
sub property of: work
comment: Relazione tra American Football Player e Television Show @it
type: ObjectProperty

road
type: Class
label: route @fr

boxer
label: boxeur @fr
type: Class

judge
type: Class
label: juge @fr

links to Bone
comment: Relazione tra American Football Player e Bone @it
comment: Relation between American Football Player and Bone
sub property of: anatomical structure
range: bone
type: ObjectProperty
domain: american football player

links to Music Genre
comment: Relazione tra American Football Player e Music Genre @it
type: ObjectProperty
domain: american football player
sub property of: music genre
comment: Relation between American Football Player and Music Genre
range: music genre

World Heritage Site
type: Class
label: site du patrimoine mondial @fr

links to Continent
sub property of: place
comment: Relation between American Football Player and Continent
comment: Relazione tra American Football Player e Continent @it
range: continent
domain: american football player
type: ObjectProperty

Axiom
dbpedia infobox matching weight: 11.11
annotated property: relatedMatch
annotated target: title
annotated source: links to Canadian Football Team

language
type: ObjectProperty
label: langage @fr
type: Class

links to Astronaut
comment: Relazione tra American Football Player e Astronaut @it
type: ObjectProperty
domain: american football player
related match: before
range: astronaut
comment: Relation between American Football Player and Astronaut
related match: years
type: NamedIndividual
sub property of: person

Axiom
dbpedia infobox matching weight: 72.22
annotated source: links to College Coach
annotated property: relatedMatch
annotated target: after

lake
label: lac @fr
type: Class

links to World Heritage Site
comment: Relation between American Football Player and World Heritage Site
domain: american football player
type: ObjectProperty
comment: Relazione tra American Football Player e World Heritage Site @it
sub property of: place
range: World Heritage Site

governor
type: Class
label: gouverneur @fr

work
label: obra @pt
label: travail @fr
type: ObjectProperty

poker player
label: joueur de poker @fr
type: Class

river
type: Class
label: rivière @fr

links to Poker Player
comment: Relation between American Football Player and Poker Player
range: poker player
comment: Relazione tra American Football Player e Poker Player @it
type: ObjectProperty
sub property of: person
domain: american football player

links to Historic Building
range: historic building
domain: american football player
comment: Relazione tra American Football Player e Historic Building @it
sub property of: place
type: ObjectProperty
comment: Relation between American Football Player and Historic Building

lacrosse league
type: Class
label: ligue de crosse @fr

Axiom
dbpedia infobox matching weight: 10.0
annotated property: relatedMatch
annotated target: regent
annotated source: links to Office Holder

country
type: Class
label: χώρα @el
label: Staat @de
label: pays @fr

links to Video Game
domain: american football player
sub property of: work
comment: Relation between American Football Player and Video Game
type: ObjectProperty
comment: Relazione tra American Football Player e Video Game @it
range: video game
related match: title
type: NamedIndividual

ship
type: Class
label: navire @fr

museum
label: musée @fr
type: Class

fish
label: poisson @fr
type: Class

tennis player
label: joueur de tennis @fr
type: Class

video game
type: Class
label: jeux vidéo @fr

trade union
type: Class
label: syndicat professionnel @fr

links to Mountain
sub property of: place
comment: Relazione tra American Football Player e Mountain @it
domain: american football player
range: mountain
type: ObjectProperty
comment: Relation between American Football Player and Mountain

Axiom
dbpedia infobox matching weight: 22.22
annotated target: before
annotated source: links to National Collegiate Athletic Association Athlete
annotated property: relatedMatch

currency
type: ObjectProperty
type: Class
label: devise @fr

links to Film Festival
comment: Relation between American Football Player and Film Festival
type: ObjectProperty
domain: american football player
comment: Relazione tra American Football Player e Film Festival @it
sub property of: event
range: film festival

British royalty
type: Class
label: royauté Britannique @fr

prime minister
type: Class
label: premier ministre @fr

links to Skyscraper
type: ObjectProperty
comment: Relation between American Football Player and Skyscraper
domain: american football player
range: skyscraper
sub property of: place
comment: Relazione tra American Football Player e Skyscraper @it

links to Brain
domain: american football player
comment: Relation between American Football Player and Brain
range: brain
type: ObjectProperty
comment: Relazione tra American Football Player e Brain @it
sub property of: anatomical structure

links to Pope
sub property of: person
range: pope
comment: Relazione tra American Football Player e Pope @it
domain: american football player
comment: Relation between American Football Player and Pope
type: ObjectProperty

historic place
type: Class
label: site historique @fr

links to Senator
type: ObjectProperty
range: senator
sub property of: person
comment: Relazione tra American Football Player e Senator @it
domain: american football player
comment: Relation between American Football Player and Senator

hospital
label: hôpital @fr
type: Class

links to Golf Player
sub property of: person
domain: american football player
range: golf player
type: NamedIndividual
comment: Relazione tra American Football Player e Golf Player @it
comment: Relation between American Football Player and Golf Player
related match: before
related match: after
type: ObjectProperty

links to Mayor
comment: Relazione tra American Football Player e Mayor @it
comment: Relation between American Football Player and Mayor
type: ObjectProperty
sub property of: person
range: mayor
domain: american football player

links to Hockey Team
sub property of: organização
domain: american football player
type: ObjectProperty
range: hockey team
comment: Relazione tra American Football Player e Hockey Team @it
comment: Relation between American Football Player and Hockey Team

links to Wrestling Event
type: ObjectProperty
domain: american football player
range: wrestling event
comment: Relazione tra American Football Player e Wrestling Event @it
sub property of: event
comment: Relation between American Football Player and Wrestling Event

continent
type: Class
label: ήπειρος @el

links to Currency
range: currency
type: ObjectProperty
comment: Relation between American Football Player and Currency
domain: american football player
sub property of: currency
comment: Relazione tra American Football Player e Currency @it

links to Weapon
domain: american football player
range: weapon
sub property of: device
comment: Relazione tra American Football Player e Weapon @it
type: ObjectProperty
comment: Relation between American Football Player and Weapon

links to Rugby Player
range: rugby player
comment: Relazione tra American Football Player e Rugby Player @it
comment: Relation between American Football Player and Rugby Player
domain: american football player
type: ObjectProperty
sub property of: person

links to Soccer Player
range: soccer player
comment: Relazione tra American Football Player e Soccer Player @it
comment: Relation between American Football Player and Soccer Player
sub property of: person
type: ObjectProperty
domain: american football player

album
label: Album @de
type: Class

president
type: Class
label: président @fr

figure skater
type: Class
label: patineur artistique @fr

Axiom
dbpedia infobox matching weight: 50.0
annotated source: links to Tennis Player
annotated target: before
annotated property: relatedMatch

Axiom
dbpedia infobox matching weight: 100.0
annotated target: title
annotated property: relatedMatch
annotated source: links to Video Game

links to Prime Minister
domain: american football player
type: ObjectProperty
range: prime minister
comment: Relation between American Football Player and Prime Minister
sub property of: person
comment: Relazione tra American Football Player e Prime Minister @it

links to Wrestler
comment: Relation between American Football Player and Wrestler
range: wrestler
type: ObjectProperty
sub property of: person
domain: american football player
comment: Relazione tra American Football Player e Wrestler @it
related match: after
type: NamedIndividual

person
label: Person @de
type: ObjectProperty
label: pessoa @pt
label: personne @fr

military unit
label: unité militaire @fr
type: Class

soccer manager
label: entraîneur de football @fr
type: Class

basketball team
type: Class

links to Soccer Club
comment: Relation between American Football Player and Soccer Club
comment: Relazione tra American Football Player e Soccer Club @it
range: soccer club
sub property of: organização
domain: american football player
type: ObjectProperty

canadian football team
type: Class
label: équipe canadienne de football américain @fr

AmericanFootballPlayer.owl
has author: Valentina Presutti
has author: Aldo Gangemi
type: Ontology
comment: AmericanFootballPlayer Encyclopedic Knowledge Pattern
has author: Andrea Giovanni Nuzzolese
extracted from: dbpedia.org
imports: cpannotationschema.owl
extracted from: en.wikipedia.org
imports: dbpediainfoboxmatchingweight.owl
has intent: To represent the encyclopedic knowledge expressed by an object typed as AmericanFootballPlayer

music genre
label: genre musical @fr
type: ObjectProperty
label: género musical @pt
type: Class

writer
label: écrivain @fr
type: Class

record label
label: label discographique @fr
type: Class

architect
type: Class
label: architecte @fr

links to Gaelic Games Player
comment: Relazione tra American Football Player e Gaelic Games Player @it
type: ObjectProperty
range: Gaelic games player
domain: american football player
sub property of: person
comment: Relation between American Football Player and Gaelic Games Player

model
label: mannequin @fr
type: Class

Axiom
dbpedia infobox matching weight: 27.78
annotated property: relatedMatch
annotated source: links to College Coach
annotated target: before

links to College
type: ObjectProperty
sub property of: organização
domain: american football player
range: college
comment: Relation between American Football Player and College
comment: Relazione tra American Football Player e College @it

links to Writer
comment: Relazione tra American Football Player e Writer @it
range: writer
sub property of: person
comment: Relation between American Football Player and Writer
domain: american football player
type: ObjectProperty

Axiom
dbpedia infobox matching weight: 27.78
annotated target: years
annotated source: links to Basketball Player
annotated property: relatedMatch

links to Formula One Racer
comment: Relazione tra American Football Player e Formula One Racer @it
domain: american football player
comment: Relation between American Football Player and Formula One Racer
range: Formula One racer
sub property of: person
type: ObjectProperty

links to Nascar Driver
comment: Relation between American Football Player and Nascar Driver
type: ObjectProperty
range: nascar driver
domain: american football player
comment: Relazione tra American Football Player e Nascar Driver @it
sub property of: person

links to Artery
domain: american football player
type: ObjectProperty
range: artery
sub property of: anatomical structure
comment: Relazione tra American Football Player e Artery @it
comment: Relation between American Football Player and Artery

film festival
type: Class
label: festival du film @fr

Axiom
dbpedia infobox matching weight: 30.0
annotated target: after
annotated property: relatedMatch
annotated source: links to Office Holder

links to Newspaper
sub property of: work
comment: Relation between American Football Player and Newspaper
domain: american football player
range: newspaper
type: ObjectProperty
comment: Relazione tra American Football Player e Newspaper @it

links to Basketball Team
domain: american football player
sub property of: organização
comment: Relazione tra American Football Player e Basketball Team @it
range: basketball team
comment: Relation between American Football Player and Basketball Team
type: ObjectProperty

Grand Prix
label: grand prix @fr
type: Class

links to Ski Area
comment: Relazione tra American Football Player e Ski Area @it
range: ski area
type: ObjectProperty
comment: Relation between American Football Player and Ski Area
domain: american football player
sub property of: place

links to Album
comment: Relation between American Football Player and Album
type: ObjectProperty
sub property of: work
range: album
domain: american football player
comment: Relazione tra American Football Player e Album @it

Axiom
dbpedia infobox matching weight: 100.0
annotated property: relatedMatch
annotated source: links to Canadian Football League
annotated target: teams

links to Restaurant
type: ObjectProperty
comment: Relation between American Football Player and Restaurant
domain: american football player
sub property of: place
range: restaurant
comment: Relazione tra American Football Player e Restaurant @it

links to Boxer
type: ObjectProperty
domain: american football player
range: boxer
comment: Relation between American Football Player and Boxer
sub property of: person
comment: Relazione tra American Football Player e Boxer @it

links to Canadian Football League
related match: teams
type: NamedIndividual
sub property of: organização
domain: american football player
comment: Relation between American Football Player and Canadian Football League
comment: Relazione tra American Football Player e Canadian Football League @it
range: canadian football league
type: ObjectProperty

links to Music Festival
sub property of: event
range: music festival
comment: Relazione tra American Football Player e Music Festival @it
comment: Relation between American Football Player and Music Festival
type: ObjectProperty
domain: american football player

links to Military Conflict
comment: Relation between American Football Player and Military Conflict
sub property of: event
comment: Relazione tra American Football Player e Military Conflict @it
type: ObjectProperty
range: military conflict
domain: american football player

aircraft
label: avion @fr
type: Class
label: αεροσκάφος @el

Axiom
dbpedia infobox matching weight: 40.0
annotated target: years
annotated property: relatedMatch
annotated source: links to Office Holder

links to Soccer Manager
range: soccer manager
domain: american football player
type: ObjectProperty
sub property of: person
comment: Relation between American Football Player and Soccer Manager
comment: Relazione tra American Football Player e Soccer Manager @it

links to Office Holder
comment: Relation between American Football Player and Office Holder
range: office holder
type: NamedIndividual
related match: years
related match: after
sub property of: person
comment: Relazione tra American Football Player e Office Holder @it
related match: regent
type: ObjectProperty
domain: american football player
related match: before

hockey team
type: Class
label: équipe de hockey @fr

links to Tennis Player
sub property of: person
range: tennis player
type: ObjectProperty
comment: Relazione tra American Football Player e Tennis Player @it
type: NamedIndividual
related match: years
domain: american football player
comment: Relation between American Football Player and Tennis Player
related match: before

soccer player
label: joueur de football @fr
type: Class

reptile
type: Class

legislature
type: Class
label: pouvoir législatif @fr

airline
type: Class
label: compagnie aérienne @fr

links to Aircraft
comment: Relation between American Football Player and Aircraft
range: aircraft
domain: american football player
sub property of: mean of transportation
comment: Relazione tra American Football Player e Aircraft @it
type: ObjectProperty

congressman
type: Class
label: membre du Congrès @fr

golf player
type: Class
label: golfeur @fr

activity
type: ObjectProperty
label: Aktivität @de
label: activité @fr

nascar driver
label: pilote de la nascar @fr
type: Class

links to Beverage
type: ObjectProperty
domain: american football player
range: beverage
comment: Relazione tra American Football Player e Beverage @it
comment: Relation between American Football Player and Beverage
sub property of: beverage

journalist
label: journaliste @fr
type: Class

space mission
label: mission spatiale @fr
label: διαστημική αποστολή @el
type: Class

links to Website
sub property of: website
range: website
type: ObjectProperty
domain: american football player
comment: Relazione tra American Football Player e Website @it
comment: Relation between American Football Player and Website

Axiom
dbpedia infobox matching weight: 100.0
annotated property: relatedMatch
annotated target: countryofbirth
annotated source: links to Island

links to Fish
domain: american football player
type: ObjectProperty
sub property of: species
comment: Relation between American Football Player and Fish
comment: Relazione tra American Football Player e Fish @it
range: fish

insect
label: insecte @fr
type: Class

film
type: Class
label: ταινία @el

links to National Collegiate Athletic Association Athlete
sub property of: person
type: NamedIndividual
related match: after
domain: american football player
comment: Relazione tra American Football Player e National Collegiate Athletic Association Athlete @it
type: ObjectProperty
comment: Relation between American Football Player and National Collegiate Athletic Association Athlete
related match: before
range: national collegiate athletic association athlete

links to Town
type: ObjectProperty
domain: american football player
comment: Relazione tra American Football Player e Town @it
sub property of: place
comment: Relation between American Football Player and Town
range: town
type: NamedIndividual
related match: birthplace

Axiom
dbpedia infobox matching weight: 50.0
annotated property: relatedMatch
annotated target: before
annotated source: links to Astronaut

Supreme Court of the United States case
label: cas juridique de la Cour suprême des États-Unis @fr
type: Class

chemical compound
label: produit chimique @fr
type: ObjectProperty
type: Class

bird
label: oiseau @fr
type: Class

Gaelic games player
label: joueur de sports gaéliques @fr
type: Class

musical artist
label: artista musical @pt
type: Class
label: musicien @fr

Axiom
dbpedia infobox matching weight: 60.0
annotated source: links to Congressman
annotated target: after
annotated property: relatedMatch

links to Mixed Martial Arts Event
sub property of: event
type: ObjectProperty
domain: american football player
range: mixed martial arts event
comment: Relazione tra American Football Player e Mixed Martial Arts Event @it
comment: Relation between American Football Player and Mixed Martial Arts Event

links to Language
comment: Relazione tra American Football Player e Language @it
sub property of: language
domain: american football player
range: language
comment: Relation between American Football Player and Language
type: ObjectProperty

brain
type: Class
label: cerveau @fr

links to Congressman
domain: american football player
type: ObjectProperty
sub property of: person
comment: Relation between American Football Player and Congressman
range: congressman
comment: Relazione tra American Football Player e Congressman @it
related match: after
type: NamedIndividual
related match: before

rugby player
type: Class
label: joueur de rugby @fr

links to Cricketer
comment: Relation between American Football Player and Cricketer
domain: american football player
type: ObjectProperty
sub property of: person
range: cricketer
comment: Relazione tra American Football Player e Cricketer @it

links to Reptile
comment: Relazione tra American Football Player e Reptile @it
type: ObjectProperty
comment: Relation between American Football Player and Reptile
domain: american football player
sub property of: species
range: reptile

musical
label: musique @fr
type: Class

Axiom
dbpedia infobox matching weight: 28.57
annotated source: links to Military Person
annotated property: relatedMatch
annotated target: after

links to Country
range: country
type: ObjectProperty
comment: Relazione tra American Football Player e Country @it
domain: american football player
sub property of: place
comment: Relation between American Football Player and Country

cyclist
label: cycliste @fr
type: Class

place
label: lugar @pt
label: lieu @fr
label: περιοχή @el
type: ObjectProperty

Axiom
dbpedia infobox matching weight: 28.57
annotated property: relatedMatch
annotated source: links to Golf Player
annotated target: before

links to Military Unit
type: ObjectProperty
domain: american football player
comment: Relazione tra American Football Player e Military Unit @it
range: military unit
comment: Relation between American Football Player and Military Unit
sub property of: organização

national collegiate athletic association athlete
label: athlète de la national collegiate athletic association @fr
type: Class

links to Book
domain: american football player
range: book
sub property of: work
comment: Relation between American Football Player and Book
comment: Relazione tra American Football Player e Book @it
type: ObjectProperty

links to Grand Prix
comment: Relazione tra American Football Player e Grand Prix @it
range: Grand Prix
type: ObjectProperty
comment: Relation between American Football Player and Grand Prix
sub property of: event
domain: american football player

wrestling event
label: match de catch @fr
type: Class

infrastructure
type: ObjectProperty

basketball league
label: ligue de basketball @fr
type: Class

links to Journalist
sub property of: person
range: journalist
comment: Relazione tra American Football Player e Journalist @it
comment: Relation between American Football Player and Journalist
type: ObjectProperty
domain: american football player

mountain
type: Class
label: montagne @fr
label: Βουνό @el

criminal
type: Class
label: criminel @fr

links to Baseball League
sub property of: organização
comment: Relation between American Football Player and Baseball League
type: ObjectProperty
range: baseball league
domain: american football player
comment: Relazione tra American Football Player e Baseball League @it

links to Colour
comment: Relation between American Football Player and Colour
comment: Relazione tra American Football Player e Colour @it
type: ObjectProperty
sub property of: colour
range: colour
domain: american football player

senator
type: Class
label: sénateur @fr

links to Shopping Mall
range: shopping mall
comment: Relation between American Football Player and Shopping Mall
comment: Relazione tra American Football Player e Shopping Mall @it
type: ObjectProperty
sub property of: place
domain: american football player

saint
type: Class

links to Basketball League
sub property of: organização
comment: Relation between American Football Player and Basketball League
domain: american football player
comment: Relazione tra American Football Player e Basketball League @it
range: basketball league
type: ObjectProperty

comedian
label: comédien @fr
type: Class

links to Island
type: ObjectProperty
comment: Relazione tra American Football Player e Island @it
comment: Relation between American Football Player and Island
sub property of: place
domain: american football player
range: island
related match: countryofbirth
type: NamedIndividual

Axiom
dbpedia infobox matching weight: 14.29
annotated target: years
annotated property: relatedMatch
annotated source: links to Military Person

song
type: Class
label: chanson @fr

Playboy Playmate
label: playmate pour Playboy @fr
type: Class

book
label: llibre @ca
label: książka @pl
label: βιβλίο @el
label: livre @fr
type: Class

Axiom
dbpedia infobox matching weight: 50.0
annotated source: links to Tennis Player
annotated property: relatedMatch
annotated target: years

links to Museum
range: museum
comment: Relation between American Football Player and Museum
comment: Relazione tra American Football Player e Museum @it
type: ObjectProperty
domain: american football player
sub property of: place

device
type: ObjectProperty
label: appareil @fr

shopping mall
type: Class
label: centre commercial @fr

links to Trade Union
domain: american football player
type: ObjectProperty
sub property of: organização
comment: Relation between American Football Player and Trade Union
range: trade union
comment: Relazione tra American Football Player e Trade Union @it

ski area
label: domaine skiable @fr
type: Class

non-profit organisation
label: organisation à but non lucratif @fr
type: Class

links to Space Mission
sub property of: event
comment: Relation between American Football Player and Space Mission
comment: Relazione tra American Football Player e Space Mission @it
domain: american football player
range: space mission
type: ObjectProperty

canadian football league
type: Class

links to Radio Station
range: radio station
sub property of: organização
domain: american football player
comment: Relation between American Football Player and Radio Station
comment: Relazione tra American Football Player e Radio Station @it
type: ObjectProperty

Axiom
dbpedia infobox matching weight: 50.0
annotated target: years
annotated source: links to Astronaut
annotated property: relatedMatch

weapon
type: Class
label: arme @fr

drug
type: Class
label: médicament @fr
type: ObjectProperty

links to Airport
domain: american football player
sub property of: place
comment: Relazione tra American Football Player e Airport @it
comment: Relation between American Football Player and Airport
type: ObjectProperty
range: airport

links to Grape
type: ObjectProperty
comment: Relazione tra American Football Player e Grape @it
domain: american football player
range: grape
comment: Relation between American Football Player and Grape
sub property of: species

Axiom
dbpedia infobox matching weight: 100.0
annotated property: relatedMatch
annotated source: links to Wrestler
annotated target: after

links to British Royalty
range: British royalty
comment: Relazione tra American Football Player e British Royalty @it
type: ObjectProperty
domain: american football player
comment: Relation between American Football Player and British Royalty
sub property of: person

links to President
sub property of: person
range: president
type: ObjectProperty
comment: Relazione tra American Football Player e President @it
comment: Relation between American Football Player and President
domain: american football player

magazine
label: περιοδικό @el
type: Class

links to Film
sub property of: work
comment: Relation between American Football Player and Film
range: film
domain: american football player
comment: Relazione tra American Football Player e Film @it
type: ObjectProperty

military person
type: Class
label: militaire @fr

award
type: ObjectProperty
label: récompense @fr
type: Class

Axiom
dbpedia infobox matching weight: 15.79
annotated target: highlights
annotated source: links to Award
annotated property: relatedMatch

college
type: Class

anatomical structure
type: ObjectProperty
label: structure anatomique @fr

links to Road
type: ObjectProperty
sub property of: infrastructure
range: road
comment: Relazione tra American Football Player e Road @it
domain: american football player
comment: Relation between American Football Player and Road

restaurant
type: Class

cricketer
type: Class
label: joueur de cricket @fr

single
type: Class

nerve
type: Class
label: nerf @fr

links to Chemical Compound
sub property of: chemical compound
type: ObjectProperty
domain: american football player
comment: Relazione tra American Football Player e Chemical Compound @it
comment: Relation between American Football Player and Chemical Compound
range: chemical compound

mixed martial arts event
label: évènement d'arts martiaux mixtes @fr
type: Class

links to Species
domain: american football player
comment: Relazione tra American Football Player e Species @it
sub property of: species
comment: Relation between American Football Player and Species
type: ObjectProperty
range: species

Band
label: banda @pt
label: Musikgruppe @de
type: Class
label: groupe de musique @fr

links to River
type: ObjectProperty
comment: Relation between American Football Player and River
domain: american football player
range: river
sub property of: place
comment: Relazione tra American Football Player e River @it

town
label: ville @fr
type: Class

Axiom
dbpedia infobox matching weight: 33.33
annotated property: relatedMatch
annotated source: links to Basketball Player
annotated target: before

links to Protected Area
comment: Relazione tra American Football Player e Protected Area @it
range: protected area
sub property of: place
domain: american football player
comment: Relation between American Football Player and Protected Area
type: ObjectProperty

protein
type: ObjectProperty
type: Class
label: protéine @fr

links to Comics Character
sub property of: person
comment: Relation between American Football Player and Comics Character
domain: american football player
comment: Relazione tra American Football Player e Comics Character @it
range: comics character
type: ObjectProperty

ethnic group
type: Class
type: ObjectProperty
label: groupe ethnique @fr

links to Muscle
type: ObjectProperty
domain: american football player
sub property of: anatomical structure
comment: Relation between American Football Player and Muscle
range: muscle
comment: Relazione tra American Football Player e Muscle @it

artery
label: artère @fr
type: Class
label: Arterie @de

links to Figure Skater
range: figure skater
type: ObjectProperty
sub property of: person
comment: Relazione tra American Football Player e Figure Skater @it
comment: Relation between American Football Player and Figure Skater
domain: american football player

music festival
type: Class
label: festival de musique @fr

links to Historic Place
type: NamedIndividual
related match: college
comment: Relazione tra American Football Player e Historic Place @it
domain: american football player
type: ObjectProperty
sub property of: place
comment: Relation between American Football Player and Historic Place
range: historic place

Axiom
dbpedia infobox matching weight: 20.0
annotated source: links to Office Holder
annotated target: before
annotated property: relatedMatch

college coach
type: Class
label: entraîneur universitaire @fr

television episode
type: Class
label: épisode télévisé @fr

links to College Coach
comment: Relation between American Football Player and College Coach
range: college coach
type: ObjectProperty
related match: before
comment: Relazione tra American Football Player e College Coach @it
type: NamedIndividual
sub property of: person
related match: after
domain: american football player

muscle
type: Class

village
label: χωριό @el
type: Class

ice hockey league
type: Class
label: ligue d'hockey sur glace @fr

soccer club
label: club de football @fr
type: Class

Axiom
dbpedia infobox matching weight: 57.14
annotated source: links to Military Person
annotated property: relatedMatch
annotated target: before

links to Ethnic Group
comment: Relazione tra American Football Player e Ethnic Group @it
range: ethnic group
comment: Relation between American Football Player and Ethnic Group
sub property of: ethnic group
type: ObjectProperty
domain: american football player

links to Architect
sub property of: person
comment: Relazione tra American Football Player e Architect @it
domain: american football player
type: ObjectProperty
comment: Relation between American Football Player and Architect
range: architect

links to Award
comment: Relazione tra American Football Player e Award @it
related match: title
range: award
related match: highlights
domain: american football player
type: ObjectProperty
type: NamedIndividual
comment: Relation between American Football Player and Award
sub property of: award

historic building
type: Class
label: bâtiment historique @fr

links to Musical
comment: Relazione tra American Football Player e Musical @it
sub property of: work
comment: Relation between American Football Player and Musical
range: musical
domain: american football player
type: ObjectProperty

links to Ship
comment: Relazione tra American Football Player e Ship @it
range: ship
domain: american football player
type: ObjectProperty
comment: Relation between American Football Player and Ship
sub property of: mean of transportation

office holder
label: titulaire @fr
label: Amtsinhaber @de
type: Class

baseball player
type: Class
label: joueur de baseball @fr

links to Saint
comment: Relazione tra American Football Player e Saint @it
domain: american football player
type: ObjectProperty
range: saint
comment: Relation between American Football Player and Saint
sub property of: person

military conflict
label: conflit militaire @fr
type: Class

website
type: ObjectProperty
type: Class
label: Ιστότοπος @el
label: site web @fr

grape
label: raisin @fr
type: Class

basketball player
type: Class
label: joueur de basketball @fr

adult actor
label: erwachsener Schauspieler @de
type: Class
label: acteur adulte @fr

links to Record Label
sub property of: organização
domain: american football player
comment: Relation between American Football Player and Record Label
comment: Relazione tra American Football Player e Record Label @it
range: record label
type: ObjectProperty

Axiom
dbpedia infobox matching weight: 88.89
annotated property: relatedMatch
annotated target: teams
annotated source: links to Canadian Football Team

ice hockey player
type: Class
label: joueur de hockey sur glace @fr

Axiom
dbpedia infobox matching weight: 77.78
annotated source: links to National Collegiate Athletic Association Athlete
annotated target: after
annotated property: relatedMatch

links to Model
domain: american football player
range: model
sub property of: person
comment: Relazione tra American Football Player e Model @it
comment: Relation between American Football Player and Model
type: ObjectProperty

links to Judge
domain: american football player
range: judge
sub property of: person
comment: Relation between American Football Player and Judge
type: ObjectProperty
comment: Relazione tra American Football Player e Judge @it

beverage
type: ObjectProperty
type: Class
label: boisson @fr

links to Stadium
type: ObjectProperty
comment: Relation between American Football Player and Stadium
domain: american football player
sub property of: place
range: stadium
comment: Relazione tra American Football Player e Stadium @it

links to Hospital
range: hospital
domain: american football player
comment: Relazione tra American Football Player e Hospital @it
sub property of: place
type: ObjectProperty
comment: Relation between American Football Player and Hospital

links to Adult Actor
domain: american football player
comment: Relation between American Football Player and Adult Actor
type: ObjectProperty
range: adult actor
sub property of: person
comment: Relazione tra American Football Player e Adult Actor @it

links to Ice Hockey League
comment: Relazione tra American Football Player e Ice Hockey League @it
type: ObjectProperty
comment: Relation between American Football Player and Ice Hockey League
sub property of: organização
domain: american football player
range: ice hockey league

links to Election
sub property of: event
range: Election
comment: Relazione tra American Football Player e Election @it
comment: Relation between American Football Player and Election
domain: american football player
type: ObjectProperty

links to Disease
domain: american football player
comment: Relation between American Football Player and Disease
type: ObjectProperty
range: disease
comment: Relazione tra American Football Player e Disease @it
sub property of: disease

links to Television Episode
type: ObjectProperty
range: television episode
comment: Relazione tra American Football Player e Television Episode @it
domain: american football player
comment: Relation between American Football Player and Television Episode
sub property of: work

Axiom
dbpedia infobox matching weight: 38.89
annotated property: relatedMatch
annotated source: links to Basketball Player
annotated target: after

links to Protein
comment: Relation between American Football Player and Protein
comment: Relazione tra American Football Player e Protein @it
range: protein
domain: american football player
type: ObjectProperty
sub property of: protein

scientist
label: scientifique @fr
type: Class
label: Wissenschaftler @de

links to Ice Hockey Player
range: ice hockey player
type: ObjectProperty
comment: Relazione tra American Football Player e Ice Hockey Player @it
comment: Relation between American Football Player and Ice Hockey Player
domain: american football player
sub property of: person

links to Lake
domain: american football player
sub property of: place
comment: Relazione tra American Football Player e Lake @it
range: lake
comment: Relation between American Football Player and Lake
type: ObjectProperty

links to Playboy Playmate
type: ObjectProperty
comment: Relation between American Football Player and Playboy Playmate
comment: Relazione tra American Football Player e Playboy Playmate @it
sub property of: person
domain: american football player
range: Playboy Playmate

links to Song
domain: american football player
sub property of: work
type: ObjectProperty
range: song
comment: Relazione tra American Football Player e Song @it
comment: Relation between American Football Player and Song

olympics
type: Class
label: Jeux Olympiques @fr

organização
type: ObjectProperty
label: organisation
label: Organisation @de

Axiom
dbpedia infobox matching weight: 100.0
annotated property: relatedMatch
annotated source: links to Town
annotated target: birthplace

baseball league
type: Class
label: ligue de baseball @fr

links to Governor
domain: american football player
comment: Relazione tra American Football Player e Governor @it
type: ObjectProperty
sub property of: person
comment: Relation between American Football Player and Governor
range: governor

links to Comedian
sub property of: person
range: comedian
domain: american football player
comment: Relazione tra American Football Player e Comedian @it
type: ObjectProperty
comment: Relation between American Football Player and Comedian

links to Mammal
comment: Relation between American Football Player and Mammal
domain: american football player
range: mammal
sub property of: species
type: ObjectProperty
comment: Relazione tra American Football Player e Mammal @it

bridge
label: pont @fr
type: Class

links to Cyclist
comment: Relation between American Football Player and Cyclist
domain: american football player
sub property of: person
range: cyclist
type: ObjectProperty
comment: Relazione tra American Football Player e Cyclist @it
related match: before
type: NamedIndividual

links to Soccer League
domain: american football player
type: ObjectProperty
sub property of: organização
comment: Relazione tra American Football Player e Soccer League @it
range: soccer league
comment: Relation between American Football Player and Soccer League

broadcast
label: Émission de télévision @fr
type: Class

links to Insect
comment: Relation between American Football Player and Insect
domain: american football player
type: ObjectProperty
comment: Relazione tra American Football Player e Insect @it
range: insect
sub property of: species

mammal
type: Class
label: mammifère @fr

links to Magazine
comment: Relation between American Football Player and Magazine
range: magazine
sub property of: work
type: ObjectProperty
domain: american football player
comment: Relazione tra American Football Player e Magazine @it

links to Olympics
range: olympics
comment: Relazione tra American Football Player e Olympics @it
sub property of: event
comment: Relation between American Football Player and Olympics
type: ObjectProperty
domain: american football player

island
type: Class
label: νησί @el
label: île @fr

Axiom
dbpedia infobox matching weight: 40.0
annotated property: relatedMatch
annotated target: before
annotated source: links to Congressman

comics character
label: personnage de bandes dessinées @fr
type: Class

event
type: ObjectProperty
label: évènement @fr

Formula One racer
type: Class
label: pilote de formule 1 @fr

skyscraper
label: gratte-ciel @fr
type: Class

links to Musical Artist
type: ObjectProperty
comment: Relazione tra American Football Player e Musical Artist @it
domain: american football player
range: musical artist
comment: Relation between American Football Player and Musical Artist
sub property of: person

links to Game
sub property of: activity
comment: Relazione tra American Football Player e Game @it
type: ObjectProperty
domain: american football player
comment: Relation between American Football Player and Game
range: game

radio station
type: Class
label: station de radio @fr

links to Broadcast
comment: Relation between American Football Player and Broadcast
type: ObjectProperty
sub property of: organização
domain: american football player
comment: Relazione tra American Football Player e Broadcast @it
range: broadcast

Axiom
dbpedia infobox matching weight: 71.43
annotated source: links to Golf Player
annotated target: after
annotated property: relatedMatch

bone
label: os @fr
label: Knochen @de
type: Class

Axiom
dbpedia infobox matching weight: 63.64
annotated property: relatedMatch
annotated source: links to Baseball Player
annotated target: after

airport
label: aéroport @fr
label: Flughafen @de
type: Class

links to Criminal
sub property of: person
domain: american football player
type: ObjectProperty
comment: Relation between American Football Player and Criminal
comment: Relazione tra American Football Player e Criminal @it
range: criminal