television show
type: Class
label: émission de télévision @fr

disease
label: maladie @fr
type: Class
type: ObjectProperty

Axiom
dbpedia infobox matching weight: 22.22
annotated source: links to American Football Player
annotated property: relatedMatch
annotated target: before

Axiom
dbpedia infobox matching weight: 100.0
annotated target: after
annotated source: links to Boxer
annotated property: relatedMatch

links to Space Mission
type: ObjectProperty
comment: Relazione tra Baseball Player e Space Mission @it
domain: baseball player
range: space mission
sub property of: event
comment: Relation between Baseball Player and Space Mission

links to Colour
range: colour
type: ObjectProperty
domain: baseball player
comment: Relation between Baseball Player and Colour
comment: Relazione tra Baseball Player e Colour @it
sub property of: colour

automobile
type: Class

colour
type: ObjectProperty
label: χρώμα @el
label: couleur @fr
type: Class

Election
label: élection @fr
type: Class

Axiom
dbpedia infobox matching weight: 80.0
annotated source: links to Senator
annotated target: after
annotated property: relatedMatch

links to Airline
sub property of: organização
range: airline
comment: Relation between Baseball Player and Airline
comment: Relazione tra Baseball Player e Airline @it
type: ObjectProperty
domain: baseball player

mean of transportation
label: moyen de transport @fr
type: ObjectProperty

american football player
label: joueur de football américain @fr
type: Class

Axiom
dbpedia infobox matching weight: 100.0
annotated property: relatedMatch
annotated target: after
annotated source: links to Basketball Player

Legal Case
label: cas juridique @fr
type: ObjectProperty

links to Golf League
type: ObjectProperty
domain: baseball player
comment: Relation between Baseball Player and Golf League
sub property of: organização
range: golf league
comment: Relazione tra Baseball Player e Golf League @it

soccer league
label: ligue de football @fr
type: Class

links to Muscle
type: ObjectProperty
comment: Relation between Baseball Player and Muscle
sub property of: anatomical structure
domain: baseball player
range: muscle
comment: Relazione tra Baseball Player e Muscle @it

astronaut
label: astronaute @fr
label: Astronaut @de
type: Class

links to Chemical Compound
type: ObjectProperty
range: chemical compound
comment: Relazione tra Baseball Player e Chemical Compound @it
domain: baseball player
comment: Relation between Baseball Player and Chemical Compound
sub property of: chemical compound

links to Mayor
comment: Relazione tra Baseball Player e Mayor @it
range: mayor
comment: Relation between Baseball Player and Mayor
domain: baseball player
type: ObjectProperty
sub property of: person

Axiom
dbpedia infobox matching weight: 25.0
annotated property: relatedMatch
annotated target: before
annotated source: links to College Coach

links to Rugby Player
sub property of: person
type: ObjectProperty
comment: Relazione tra Baseball Player e Rugby Player @it
range: rugby player
domain: baseball player
comment: Relation between Baseball Player and Rugby Player

wrestler
type: Class
label: lutteur @fr

mayor
type: Class
label: maire @fr

pope
label: pape @fr
type: Class

species
type: ObjectProperty
label: espèce @fr
type: Class

links to Comedian
domain: baseball player
comment: Relation between Baseball Player and Comedian
type: ObjectProperty
comment: Relazione tra Baseball Player e Comedian @it
sub property of: person
range: comedian

links to Currency
sub property of: currency
comment: Relation between Baseball Player and Currency
type: ObjectProperty
range: currency
domain: baseball player
comment: Relazione tra Baseball Player e Currency @it

newspaper
type: Class
label: journal @fr

Axiom
dbpedia infobox matching weight: 72.22
annotated source: links to American Football Player
annotated property: relatedMatch
annotated target: after

protected area
type: Class
label: προστατευμένη περιοχή @el
label: aire protégée @fr

game
type: Class
label: jeu @fr

road
label: route @fr
type: Class

boxer
type: Class
label: boxeur @fr

judge
label: juge @fr
type: Class

World Heritage Site
type: Class
label: site du patrimoine mondial @fr

Axiom
dbpedia infobox matching weight: 20.0
annotated target: before
annotated property: relatedMatch
annotated source: links to Senator

language
type: ObjectProperty
label: langage @fr
type: Class

links to Writer
comment: Relazione tra Baseball Player e Writer @it
domain: baseball player
type: ObjectProperty
comment: Relation between Baseball Player and Writer
range: writer
sub property of: person

station
type: Class

Axiom
dbpedia infobox matching weight: 100.0
annotated property: relatedMatch
annotated source: links to Office Holder
annotated target: after

lake
label: lac @fr
type: Class

links to Drug
sub property of: drug
domain: baseball player
comment: Relation between Baseball Player and Drug
range: drug
type: ObjectProperty
comment: Relazione tra Baseball Player e Drug @it

governor
type: Class
label: gouverneur @fr

links to Video Game
domain: baseball player
sub property of: work
comment: Relazione tra Baseball Player e Video Game @it
type: ObjectProperty
comment: Relation between Baseball Player and Video Game
range: video game

work
label: obra @pt
label: travail @fr
type: ObjectProperty

poker player
type: Class
label: joueur de poker @fr

river
label: rivière @fr
type: Class

Axiom
dbpedia infobox matching weight: 66.67
annotated source: links to Military Unit
annotated target: branch
annotated property: relatedMatch

links to Basketball League
domain: baseball player
comment: Relazione tra Baseball Player e Basketball League @it
range: basketball league
type: ObjectProperty
comment: Relation between Baseball Player and Basketball League
sub property of: organização

museum
type: Class
label: musée @fr

ship
type: Class
label: navire @fr

fish
label: poisson @fr
type: Class

tennis player
label: joueur de tennis @fr
type: Class

video game
type: Class
label: jeux vidéo @fr

links to Weapon
range: weapon
comment: Relazione tra Baseball Player e Weapon @it
domain: baseball player
comment: Relation between Baseball Player and Weapon
sub property of: device
type: ObjectProperty

trade union
type: Class
label: syndicat professionnel @fr

currency
label: devise @fr
type: Class
type: ObjectProperty

links to Canadian Football League
comment: Relation between Baseball Player and Canadian Football League
sub property of: organização
comment: Relazione tra Baseball Player e Canadian Football League @it
type: ObjectProperty
range: canadian football league
domain: baseball player

British royalty
label: royauté Britannique @fr
type: Class

prime minister
type: Class
label: premier ministre @fr

links to Magazine
range: magazine
comment: Relation between Baseball Player and Magazine
type: ObjectProperty
comment: Relazione tra Baseball Player e Magazine @it
domain: baseball player
sub property of: work
related match: title
type: NamedIndividual

historic place
type: Class
label: site historique @fr

hospital
label: hôpital @fr
type: Class

links to Island
comment: Relazione tra Baseball Player e Island @it
domain: baseball player
sub property of: place
comment: Relation between Baseball Player and Island
range: island
type: ObjectProperty
related match: birthplace
type: NamedIndividual

links to Basketball Team
comment: Relazione tra Baseball Player e Basketball Team @it
comment: Relation between Baseball Player and Basketball Team
type: ObjectProperty
range: basketball team
sub property of: organização
domain: baseball player

links to Comics Character
sub property of: person
comment: Relazione tra Baseball Player e Comics Character @it
comment: Relation between Baseball Player and Comics Character
type: ObjectProperty
range: comics character
domain: baseball player

links to Figure Skater
domain: baseball player
range: figure skater
comment: Relazione tra Baseball Player e Figure Skater @it
sub property of: person
comment: Relation between Baseball Player and Figure Skater
type: ObjectProperty

Axiom
dbpedia infobox matching weight: 33.33
annotated property: relatedMatch
annotated target: unit
annotated source: links to Military Unit

continent
type: Class
label: ήπειρος @el

links to Shopping Mall
range: shopping mall
type: ObjectProperty
domain: baseball player
comment: Relation between Baseball Player and Shopping Mall
comment: Relazione tra Baseball Player e Shopping Mall @it
sub property of: place

links to Film Festival
type: ObjectProperty
sub property of: event
comment: Relation between Baseball Player and Film Festival
range: film festival
comment: Relazione tra Baseball Player e Film Festival @it
domain: baseball player

album
label: Album @de
type: Class

president
type: Class
label: président @fr

links to Insect
type: ObjectProperty
comment: Relazione tra Baseball Player e Insect @it
domain: baseball player
comment: Relation between Baseball Player and Insect
range: insect
sub property of: species

figure skater
label: patineur artistique @fr
type: Class

links to Criminal
type: ObjectProperty
sub property of: person
comment: Relation between Baseball Player and Criminal
range: criminal
comment: Relazione tra Baseball Player e Criminal @it
domain: baseball player

links to Aircraft
type: ObjectProperty
domain: baseball player
comment: Relation between Baseball Player and Aircraft
range: aircraft
comment: Relazione tra Baseball Player e Aircraft @it
sub property of: mean of transportation

links to Musical Artist
sub property of: person
comment: Relation between Baseball Player and Musical Artist
domain: baseball player
range: musical artist
comment: Relazione tra Baseball Player e Musical Artist @it
type: ObjectProperty

links to Crustacean
comment: Relazione tra Baseball Player e Crustacean @it
range: crustacean
sub property of: species
domain: baseball player
type: ObjectProperty
comment: Relation between Baseball Player and Crustacean

person
label: personne @fr
label: pessoa @pt
type: ObjectProperty
label: Person @de

military unit
type: Class
label: unité militaire @fr

links to Philosopher
range: philosopher
sub property of: person
comment: Relazione tra Baseball Player e Philosopher @it
domain: baseball player
comment: Relation between Baseball Player and Philosopher
type: ObjectProperty

soccer manager
label: entraîneur de football @fr
type: Class

links to Prime Minister
domain: baseball player
comment: Relazione tra Baseball Player e Prime Minister @it
comment: Relation between Baseball Player and Prime Minister
type: ObjectProperty
range: prime minister
sub property of: person

links to River
type: ObjectProperty
comment: Relation between Baseball Player and River
range: river
domain: baseball player
comment: Relazione tra Baseball Player e River @it
sub property of: place

links to Protein
domain: baseball player
comment: Relazione tra Baseball Player e Protein @it
sub property of: protein
type: ObjectProperty
comment: Relation between Baseball Player and Protein
range: protein

Axiom
dbpedia infobox matching weight: 100.0
annotated source: links to Magazine
annotated property: relatedMatch
annotated target: title

links to Journalist
comment: Relation between Baseball Player and Journalist
comment: Relazione tra Baseball Player e Journalist @it
domain: baseball player
type: ObjectProperty
range: journalist
sub property of: person

basketball team
type: Class

links to American Football Team
range: american football team
domain: baseball player
type: ObjectProperty
comment: Relation between Baseball Player and American Football Team
sub property of: organização
comment: Relazione tra Baseball Player e American Football Team @it
related match: teams
type: NamedIndividual

links to Cardinal
range: cardinal
comment: Relation between Baseball Player and Cardinal
sub property of: person
domain: baseball player
comment: Relazione tra Baseball Player e Cardinal @it
type: ObjectProperty

music genre
label: genre musical @fr
type: ObjectProperty
label: género musical @pt
type: Class

writer
label: écrivain @fr
type: Class

record label
type: Class
label: label discographique @fr

architect
type: Class
label: architecte @fr

model
type: Class
label: mannequin @fr

ambassador
label: ambassadeur @fr
type: Class

links to Record Label
type: ObjectProperty
comment: Relation between Baseball Player and Record Label
range: record label
sub property of: organização
domain: baseball player
comment: Relazione tra Baseball Player e Record Label @it

olympic result
label: résultat de Jeux Olympiques @fr
type: Class
type: ObjectProperty

crustacean
type: Class
label: crustacés @fr

film festival
label: festival du film @fr
type: Class

links to Bridge
type: ObjectProperty
comment: Relazione tra Baseball Player e Bridge @it
comment: Relation between Baseball Player and Bridge
sub property of: place
range: bridge
domain: baseball player

links to Airport
related match: birthplace
type: NamedIndividual
domain: baseball player
comment: Relation between Baseball Player and Airport
type: ObjectProperty
range: airport
comment: Relazione tra Baseball Player e Airport @it
sub property of: place

Axiom
dbpedia infobox matching weight: 100.0
annotated source: links to Ice Hockey Player
annotated target: after
annotated property: relatedMatch

links to Song
range: song
type: ObjectProperty
comment: Relation between Baseball Player and Song
domain: baseball player
comment: Relazione tra Baseball Player e Song @it
sub property of: work

links to Monarch
domain: baseball player
comment: Relazione tra Baseball Player e Monarch @it
type: ObjectProperty
comment: Relation between Baseball Player and Monarch
sub property of: person
range: monarch

links to Species
sub property of: species
comment: Relazione tra Baseball Player e Species @it
comment: Relation between Baseball Player and Species
type: ObjectProperty
range: species
domain: baseball player

links to American Football League
range: american football league
domain: baseball player
comment: Relation between Baseball Player and American Football League
type: ObjectProperty
sub property of: organização
comment: Relazione tra Baseball Player e American Football League @it

links to British Royalty
comment: Relazione tra Baseball Player e British Royalty @it
sub property of: person
type: ObjectProperty
comment: Relation between Baseball Player and British Royalty
range: British royalty
domain: baseball player

comics creator
type: Class
label: créateur de bandes dessinées @fr

aircraft
label: avion @fr
type: Class
label: αεροσκάφος @el

links to Ship
type: ObjectProperty
range: ship
sub property of: mean of transportation
domain: baseball player
comment: Relation between Baseball Player and Ship
comment: Relazione tra Baseball Player e Ship @it

links to Soccer Club
range: soccer club
comment: Relazione tra Baseball Player e Soccer Club @it
type: ObjectProperty
domain: baseball player
comment: Relation between Baseball Player and Soccer Club
sub property of: organização

hockey team
type: Class
label: équipe de hockey @fr

soccer player
label: joueur de football @fr
type: Class

links to Election
type: ObjectProperty
comment: Relation between Baseball Player and Election
range: Election
comment: Relazione tra Baseball Player e Election @it
domain: baseball player
sub property of: event

links to Olympics
type: ObjectProperty
comment: Relation between Baseball Player and Olympics
comment: Relazione tra Baseball Player e Olympics @it
range: olympics
domain: baseball player
sub property of: event

reptile
type: Class

legislature
label: pouvoir législatif @fr
type: Class

links to World Heritage Site
domain: baseball player
sub property of: place
comment: Relation between Baseball Player and World Heritage Site
type: ObjectProperty
range: World Heritage Site
comment: Relazione tra Baseball Player e World Heritage Site @it

airline
type: Class
label: compagnie aérienne @fr

Axiom
dbpedia infobox matching weight: 100.0
annotated property: relatedMatch
annotated source: links to Airport
annotated target: birthplace

links to Village
sub property of: place
range: village
type: ObjectProperty
comment: Relation between Baseball Player and Village
comment: Relazione tra Baseball Player e Village @it
domain: baseball player

monarch
type: Class
label: monarque @fr

links to Adult Actor
range: adult actor
comment: Relazione tra Baseball Player e Adult Actor @it
domain: baseball player
type: ObjectProperty
comment: Relation between Baseball Player and Adult Actor
sub property of: person

congressman
type: Class
label: membre du Congrès @fr

links to Radio Station
sub property of: organização
range: radio station
comment: Relazione tra Baseball Player e Radio Station @it
domain: baseball player
comment: Relation between Baseball Player and Radio Station
type: ObjectProperty

golf player
type: Class
label: golfeur @fr

activity
type: ObjectProperty
label: Aktivität @de
label: activité @fr

nascar driver
type: Class
label: pilote de la nascar @fr

links to Award
type: NamedIndividual
related match: title
sub property of: award
comment: Relazione tra Baseball Player e Award @it
range: award
domain: baseball player
comment: Relation between Baseball Player and Award
type: ObjectProperty

journalist
type: Class
label: journaliste @fr

space mission
type: Class
label: διαστημική αποστολή @el
label: mission spatiale @fr

links to Town
type: NamedIndividual
related match: birthplace
domain: baseball player
type: ObjectProperty
comment: Relazione tra Baseball Player e Town @it
comment: Relation between Baseball Player and Town
sub property of: place
range: town

links to Station
type: ObjectProperty
range: station
comment: Relazione tra Baseball Player e Station @it
domain: baseball player
comment: Relation between Baseball Player and Station
sub property of: place

insect
label: insecte @fr
type: Class

film
label: ταινία @el
type: Class

links to Ethnic Group
type: ObjectProperty
comment: Relazione tra Baseball Player e Ethnic Group @it
domain: baseball player
comment: Relation between Baseball Player and Ethnic Group
sub property of: ethnic group
range: ethnic group

links to Ice Hockey Player
comment: Relazione tra Baseball Player e Ice Hockey Player @it
comment: Relation between Baseball Player and Ice Hockey Player
range: ice hockey player
sub property of: person
type: ObjectProperty
domain: baseball player
related match: after
type: NamedIndividual

links to Grape
range: grape
comment: Relation between Baseball Player and Grape
domain: baseball player
type: ObjectProperty
comment: Relazione tra Baseball Player e Grape @it
sub property of: species

american football team
label: équipe américaine de football américain @fr
type: Class

links to Tennis Player
type: NamedIndividual
related match: after
domain: baseball player
sub property of: person
comment: Relation between Baseball Player and Tennis Player
comment: Relazione tra Baseball Player e Tennis Player @it
type: ObjectProperty
range: tennis player

Supreme Court of the United States case
type: Class
label: cas juridique de la Cour suprême des États-Unis @fr

links to Bird
type: ObjectProperty
comment: Relazione tra Baseball Player e Bird @it
range: bird
domain: baseball player
comment: Relation between Baseball Player and Bird
sub property of: species

chemical compound
type: Class
type: ObjectProperty
label: produit chimique @fr

bird
label: oiseau @fr
type: Class

Axiom
dbpedia infobox matching weight: 100.0
annotated source: links to Tennis Player
annotated target: after
annotated property: relatedMatch

links to Album
range: album
comment: Relazione tra Baseball Player e Album @it
type: ObjectProperty
domain: baseball player
comment: Relation between Baseball Player and Album
sub property of: work

links to Soccer League
comment: Relation between Baseball Player and Soccer League
sub property of: organização
range: soccer league
domain: baseball player
type: ObjectProperty
comment: Relazione tra Baseball Player e Soccer League @it

links to Artery
type: ObjectProperty
sub property of: anatomical structure
range: artery
comment: Relazione tra Baseball Player e Artery @it
comment: Relation between Baseball Player and Artery
domain: baseball player

links to American Football Player
related match: before
sub property of: person
comment: Relation between Baseball Player and American Football Player
comment: Relazione tra Baseball Player e American Football Player @it
type: NamedIndividual
domain: baseball player
related match: after
type: ObjectProperty
related match: years
range: american football player

fungus
label: fungi @fr
type: Class

links to National Collegiate Athletic Association Athlete
domain: baseball player
comment: Relation between Baseball Player and National Collegiate Athletic Association Athlete
comment: Relazione tra Baseball Player e National Collegiate Athletic Association Athlete @it
sub property of: person
type: ObjectProperty
range: national collegiate athletic association athlete

musical artist
label: artista musical @pt
type: Class
label: musicien @fr

links to Website
comment: Relazione tra Baseball Player e Website @it
domain: baseball player
range: website
type: ObjectProperty
sub property of: website
comment: Relation between Baseball Player and Website

links to Cricketer
comment: Relation between Baseball Player and Cricketer
range: cricketer
comment: Relazione tra Baseball Player e Cricketer @it
domain: baseball player
type: ObjectProperty
sub property of: person

links to Wrestling Event
sub property of: event
comment: Relazione tra Baseball Player e Wrestling Event @it
domain: baseball player
comment: Relation between Baseball Player and Wrestling Event
type: ObjectProperty
range: wrestling event

links to Military Person
comment: Relation between Baseball Player and Military Person
domain: baseball player
range: military person
type: ObjectProperty
sub property of: person
comment: Relazione tra Baseball Player e Military Person @it
type: NamedIndividual
related match: after

park
label: parc @fr
type: Class

links to Scientist
range: scientist
comment: Relazione tra Baseball Player e Scientist @it
domain: baseball player
sub property of: person
comment: Relation between Baseball Player and Scientist
type: ObjectProperty

cardinal
type: Class

rugby player
type: Class
label: joueur de rugby @fr

links to Golf Player
comment: Relation between Baseball Player and Golf Player
domain: baseball player
sub property of: person
type: ObjectProperty
range: golf player
comment: Relazione tra Baseball Player e Golf Player @it
related match: after
type: NamedIndividual

links to Skyscraper
domain: baseball player
comment: Relazione tra Baseball Player e Skyscraper @it
type: ObjectProperty
sub property of: place
range: skyscraper
comment: Relation between Baseball Player and Skyscraper

american football league
type: Class

links to Road
comment: Relation between Baseball Player and Road
range: road
sub property of: infrastructure
domain: baseball player
comment: Relazione tra Baseball Player e Road @it
type: ObjectProperty

links to Nerve
domain: baseball player
range: nerve
sub property of: anatomical structure
type: ObjectProperty
comment: Relation between Baseball Player and Nerve
comment: Relazione tra Baseball Player e Nerve @it

musical
type: Class
label: musique @fr

links to Military Conflict
type: ObjectProperty
comment: Relazione tra Baseball Player e Military Conflict @it
domain: baseball player
sub property of: event
comment: Relation between Baseball Player and Military Conflict
range: military conflict

links to Beverage
sub property of: beverage
domain: baseball player
type: ObjectProperty
comment: Relazione tra Baseball Player e Beverage @it
comment: Relation between Baseball Player and Beverage
range: beverage

links to Film
range: film
sub property of: work
comment: Relation between Baseball Player and Film
type: ObjectProperty
comment: Relazione tra Baseball Player e Film @it
domain: baseball player

links to Legislature
type: ObjectProperty
sub property of: organização
range: legislature
domain: baseball player
comment: Relation between Baseball Player and Legislature
comment: Relazione tra Baseball Player e Legislature @it

cyclist
label: cycliste @fr
type: Class

place
type: ObjectProperty
label: περιοχή @el
label: lieu @fr
label: lugar @pt

national collegiate athletic association athlete
label: athlète de la national collegiate athletic association @fr
type: Class

wrestling event
label: match de catch @fr
type: Class

infrastructure
type: ObjectProperty

links to Bone
range: bone
comment: Relation between Baseball Player and Bone
domain: baseball player
type: ObjectProperty
comment: Relazione tra Baseball Player e Bone @it
sub property of: anatomical structure

links to Book
sub property of: work
domain: baseball player
range: book
comment: Relazione tra Baseball Player e Book @it
comment: Relation between Baseball Player and Book
type: ObjectProperty

links to Governor
type: ObjectProperty
comment: Relazione tra Baseball Player e Governor @it
range: governor
domain: baseball player
sub property of: person
comment: Relation between Baseball Player and Governor

basketball league
label: ligue de basketball @fr
type: Class

links to Newspaper
comment: Relazione tra Baseball Player e Newspaper @it
type: ObjectProperty
domain: baseball player
comment: Relation between Baseball Player and Newspaper
range: newspaper
sub property of: work

links to Automobile
comment: Relazione tra Baseball Player e Automobile @it
comment: Relation between Baseball Player and Automobile
range: automobile
type: ObjectProperty
sub property of: mean of transportation
domain: baseball player

links to Television Episode
comment: Relation between Baseball Player and Television Episode
sub property of: work
comment: Relazione tra Baseball Player e Television Episode @it
type: ObjectProperty
range: television episode
domain: baseball player

criminal
label: criminel @fr
type: Class

links to Cyclist
comment: Relazione tra Baseball Player e Cyclist @it
type: ObjectProperty
range: cyclist
comment: Relation between Baseball Player and Cyclist
domain: baseball player
sub property of: person

Axiom
dbpedia infobox matching weight: 5.56
annotated source: links to American Football Player
annotated target: years
annotated property: relatedMatch

senator
label: sénateur @fr
type: Class

saint
type: Class

comedian
type: Class
label: comédien @fr

links to Language
comment: Relation between Baseball Player and Language
range: language
comment: Relazione tra Baseball Player e Language @it
sub property of: language
type: ObjectProperty
domain: baseball player

song
type: Class
label: chanson @fr

links to Television Show
comment: Relation between Baseball Player and Television Show
domain: baseball player
range: television show
comment: Relazione tra Baseball Player e Television Show @it
sub property of: work
type: ObjectProperty

Playboy Playmate
type: Class
label: playmate pour Playboy @fr

book
label: książka @pl
label: llibre @ca
label: βιβλίο @el
label: livre @fr
type: Class

links to Ambassador
comment: Relazione tra Baseball Player e Ambassador @it
sub property of: person
comment: Relation between Baseball Player and Ambassador
type: ObjectProperty
range: ambassador
domain: baseball player

links to Pope
type: ObjectProperty
domain: baseball player
sub property of: person
comment: Relazione tra Baseball Player e Pope @it
range: pope
comment: Relation between Baseball Player and Pope

links to Supreme Court Of The United States Case
comment: Relation between Baseball Player and Supreme Court Of The United States Case
comment: Relazione tra Baseball Player e Supreme Court Of The United States Case @it
range: Supreme Court of the United States case
sub property of: Legal Case
type: ObjectProperty
domain: baseball player

device
type: ObjectProperty
label: appareil @fr

shopping mall
label: centre commercial @fr
type: Class

links to Soccer Manager
domain: baseball player
type: ObjectProperty
sub property of: person
comment: Relation between Baseball Player and Soccer Manager
comment: Relazione tra Baseball Player e Soccer Manager @it
range: soccer manager

links to Olympic Result
comment: Relazione tra Baseball Player e Olympic Result @it
domain: baseball player
range: olympic result
comment: Relation between Baseball Player and Olympic Result
sub property of: olympic result
type: ObjectProperty

Axiom
dbpedia infobox matching weight: 100.0
annotated source: links to Golf Player
annotated property: relatedMatch
annotated target: after

non-profit organisation
label: organisation à but non lucratif @fr
type: Class

links to Trade Union
sub property of: organização
range: trade union
domain: baseball player
comment: Relazione tra Baseball Player e Trade Union @it
comment: Relation between Baseball Player and Trade Union
type: ObjectProperty

canadian football league
type: Class

links to Ice Hockey League
type: ObjectProperty
domain: baseball player
comment: Relation between Baseball Player and Ice Hockey League
comment: Relazione tra Baseball Player e Ice Hockey League @it
sub property of: organização
range: ice hockey league

links to Musical
range: musical
type: ObjectProperty
comment: Relazione tra Baseball Player e Musical @it
domain: baseball player
sub property of: work
comment: Relation between Baseball Player and Musical

weapon
type: Class
label: arme @fr

drug
type: ObjectProperty
label: médicament @fr
type: Class

links to Basketball Player
type: NamedIndividual
related match: after
sub property of: person
type: ObjectProperty
domain: baseball player
range: basketball player
comment: Relation between Baseball Player and Basketball Player
comment: Relazione tra Baseball Player e Basketball Player @it

links to Wrestler
type: ObjectProperty
range: wrestler
comment: Relazione tra Baseball Player e Wrestler @it
comment: Relation between Baseball Player and Wrestler
sub property of: person
domain: baseball player

magazine
type: Class
label: περιοδικό @el

links to Game
sub property of: activity
comment: Relation between Baseball Player and Game
domain: baseball player
type: ObjectProperty
range: game
comment: Relazione tra Baseball Player e Game @it

Axiom
dbpedia infobox matching weight: 100.0
annotated property: relatedMatch
annotated source: links to Town
annotated target: birthplace

military person
type: Class
label: militaire @fr

philosopher
label: philosophe @fr
type: Class

award
type: Class
label: récompense @fr
type: ObjectProperty

links to College Coach
comment: Relation between Baseball Player and College Coach
range: college coach
related match: after
domain: baseball player
type: ObjectProperty
comment: Relazione tra Baseball Player e College Coach @it
related match: before
type: NamedIndividual
sub property of: person

links to Museum
range: museum
comment: Relation between Baseball Player and Museum
sub property of: place
type: ObjectProperty
comment: Relazione tra Baseball Player e Museum @it
domain: baseball player

links to Continent
range: continent
domain: baseball player
comment: Relazione tra Baseball Player e Continent @it
comment: Relation between Baseball Player and Continent
type: ObjectProperty
sub property of: place

links to Lake
domain: baseball player
range: lake
comment: Relation between Baseball Player and Lake
type: ObjectProperty
sub property of: place
comment: Relazione tra Baseball Player e Lake @it

BaseballPlayer.owl
has intent: To represent the encyclopedic knowledge expressed by an object typed as BaseballPlayer
comment: BaseballPlayer Encyclopedic Knowledge Pattern
extracted from: dbpedia.org
imports: cpannotationschema.owl
has author: Andrea Giovanni Nuzzolese
has author: Valentina Presutti
extracted from: en.wikipedia.org
imports: dbpediainfoboxmatchingweight.owl
has author: Aldo Gangemi
type: Ontology

anatomical structure
type: ObjectProperty
label: structure anatomique @fr

cricketer
label: joueur de cricket @fr
type: Class

single
type: Class

nerve
type: Class
label: nerf @fr

mixed martial arts event
label: évènement d'arts martiaux mixtes @fr
type: Class

Band
label: banda @pt
label: Musikgruppe @de
type: Class
label: groupe de musique @fr

town
type: Class
label: ville @fr

links to Astronaut
domain: baseball player
type: ObjectProperty
range: astronaut
sub property of: person
comment: Relazione tra Baseball Player e Astronaut @it
comment: Relation between Baseball Player and Astronaut

protein
type: ObjectProperty
type: Class
label: protéine @fr

ethnic group
label: groupe ethnique @fr
type: ObjectProperty
type: Class

links to Mixed Martial Arts Event
sub property of: event
domain: baseball player
comment: Relazione tra Baseball Player e Mixed Martial Arts Event @it
comment: Relation between Baseball Player and Mixed Martial Arts Event
type: ObjectProperty
range: mixed martial arts event

links to Office Holder
related match: after
type: NamedIndividual
comment: Relation between Baseball Player and Office Holder
type: ObjectProperty
comment: Relazione tra Baseball Player e Office Holder @it
range: office holder
domain: baseball player
sub property of: person

artery
label: Arterie @de
type: Class
label: artère @fr

links to Comics Creator
domain: baseball player
comment: Relation between Baseball Player and Comics Creator
comment: Relazione tra Baseball Player e Comics Creator @it
range: comics creator
type: ObjectProperty
sub property of: person

links to Judge
range: judge
domain: baseball player
sub property of: person
comment: Relazione tra Baseball Player e Judge @it
type: ObjectProperty
comment: Relation between Baseball Player and Judge

links to Vein
type: ObjectProperty
sub property of: anatomical structure
comment: Relazione tra Baseball Player e Vein @it
domain: baseball player
range: vein
comment: Relation between Baseball Player and Vein

links to Mountain Range
domain: baseball player
comment: Relation between Baseball Player and Mountain Range
comment: Relazione tra Baseball Player e Mountain Range @it
type: ObjectProperty
sub property of: place
range: mountain range

links to Planet
domain: baseball player
comment: Relation between Baseball Player and Planet
sub property of: planet
type: ObjectProperty
range: planet
comment: Relazione tra Baseball Player e Planet @it

links to Broadcast
domain: baseball player
sub property of: organização
comment: Relation between Baseball Player and Broadcast
type: ObjectProperty
comment: Relazione tra Baseball Player e Broadcast @it
range: broadcast

links to Poker Player
comment: Relation between Baseball Player and Poker Player
sub property of: person
range: poker player
domain: baseball player
comment: Relazione tra Baseball Player e Poker Player @it
type: ObjectProperty

college coach
type: Class
label: entraîneur universitaire @fr

links to Senator
comment: Relation between Baseball Player and Senator
domain: baseball player
range: senator
type: ObjectProperty
comment: Relazione tra Baseball Player e Senator @it
sub property of: person
related match: before
type: NamedIndividual
related match: after

television episode
type: Class
label: épisode télévisé @fr

muscle
type: Class

village
label: χωριό @el
type: Class

ice hockey league
label: ligue d'hockey sur glace @fr
type: Class

Axiom
dbpedia infobox matching weight: 75.0
annotated property: relatedMatch
annotated source: links to College Coach
annotated target: after

soccer club
label: club de football @fr
type: Class

Axiom
dbpedia infobox matching weight: 100.0
annotated source: links to American Football Team
annotated target: teams
annotated property: relatedMatch

historic building
type: Class
label: bâtiment historique @fr

links to Hockey Team
comment: Relazione tra Baseball Player e Hockey Team @it
domain: baseball player
range: hockey team
comment: Relation between Baseball Player and Hockey Team
type: ObjectProperty
sub property of: organização

links to Soccer Player
type: ObjectProperty
comment: Relation between Baseball Player and Soccer Player
sub property of: person
domain: baseball player
range: soccer player
comment: Relazione tra Baseball Player e Soccer Player @it

office holder
label: Amtsinhaber @de
type: Class
label: titulaire @fr

links to Music Genre
type: ObjectProperty
comment: Relazione tra Baseball Player e Music Genre @it
domain: baseball player
range: music genre
comment: Relation between Baseball Player and Music Genre
sub property of: music genre

baseball player
type: Class
label: joueur de baseball @fr

military conflict
type: Class
label: conflit militaire @fr

website
type: ObjectProperty
type: Class
label: Ιστότοπος @el
label: site web @fr

grape
type: Class
label: raisin @fr

links to Mammal
comment: Relation between Baseball Player and Mammal
sub property of: species
range: mammal
type: ObjectProperty
domain: baseball player
comment: Relazione tra Baseball Player e Mammal @it

links to Saint
comment: Relazione tra Baseball Player e Saint @it
comment: Relation between Baseball Player and Saint
type: ObjectProperty
sub property of: person
domain: baseball player
range: saint

links to Disease
range: disease
type: ObjectProperty
comment: Relazione tra Baseball Player e Disease @it
comment: Relation between Baseball Player and Disease
domain: baseball player
sub property of: disease

basketball player
label: joueur de basketball @fr
type: Class

adult actor
label: erwachsener Schauspieler @de
type: Class
label: acteur adulte @fr

links to Formula One Racer
sub property of: person
comment: Relation between Baseball Player and Formula One Racer
comment: Relazione tra Baseball Player e Formula One Racer @it
type: ObjectProperty
domain: baseball player
range: Formula One racer

links to President
comment: Relazione tra Baseball Player e President @it
sub property of: person
type: ObjectProperty
domain: baseball player
range: president
comment: Relation between Baseball Player and President

ice hockey player
label: joueur de hockey sur glace @fr
type: Class

links to Single
type: ObjectProperty
range: single
comment: Relation between Baseball Player and Single
domain: baseball player
comment: Relazione tra Baseball Player e Single @it
sub property of: work

links to Hospital
type: ObjectProperty
comment: Relation between Baseball Player and Hospital
sub property of: place
range: hospital
domain: baseball player
comment: Relazione tra Baseball Player e Hospital @it

links to Non- Profit Organisation
comment: Relation between Baseball Player and Non- Profit Organisation
range: non-profit organisation
type: ObjectProperty
sub property of: organização
comment: Relazione tra Baseball Player e Non- Profit Organisation @it
domain: baseball player

links to Fish
comment: Relation between Baseball Player and Fish
range: fish
domain: baseball player
sub property of: species
comment: Relazione tra Baseball Player e Fish @it
type: ObjectProperty

mountain range
type: Class
label: chaîne de montagne @fr

Axiom
dbpedia infobox matching weight: 100.0
annotated target: title
annotated property: relatedMatch
annotated source: links to Award

beverage
label: boisson @fr
type: Class
type: ObjectProperty

links to Historic Place
sub property of: place
comment: Relazione tra Baseball Player e Historic Place @it
comment: Relation between Baseball Player and Historic Place
type: ObjectProperty
domain: baseball player
range: historic place

links to Protected Area
sub property of: place
comment: Relation between Baseball Player and Protected Area
domain: baseball player
range: protected area
comment: Relazione tra Baseball Player e Protected Area @it
type: ObjectProperty

links to Boxer
comment: Relazione tra Baseball Player e Boxer @it
range: boxer
type: ObjectProperty
sub property of: person
comment: Relation between Baseball Player and Boxer
domain: baseball player
type: NamedIndividual
related match: after

planet
type: ObjectProperty
label: planète @fr
type: Class

links to Congressman
comment: Relation between Baseball Player and Congressman
comment: Relazione tra Baseball Player e Congressman @it
range: congressman
sub property of: person
type: ObjectProperty
domain: baseball player

links to Park
domain: baseball player
range: park
type: ObjectProperty
comment: Relazione tra Baseball Player e Park @it
sub property of: place
comment: Relation between Baseball Player and Park

scientist
label: Wissenschaftler @de
type: Class
label: scientifique @fr

links to Military Unit
comment: Relation between Baseball Player and Military Unit
sub property of: organização
related match: branch
domain: baseball player
comment: Relazione tra Baseball Player e Military Unit @it
related match: unit
range: military unit
type: NamedIndividual
type: ObjectProperty

golf league
type: Class
label: ligue de golf @fr

links to Nascar Driver
range: nascar driver
comment: Relazione tra Baseball Player e Nascar Driver @it
type: ObjectProperty
sub property of: person
domain: baseball player
comment: Relation between Baseball Player and Nascar Driver

olympics
type: Class
label: Jeux Olympiques @fr

organização
type: ObjectProperty
label: organisation
label: Organisation @de

Axiom
dbpedia infobox matching weight: 100.0
annotated target: birthplace
annotated source: links to Island
annotated property: relatedMatch

bridge
type: Class
label: pont @fr

links to Architect
comment: Relazione tra Baseball Player e Architect @it
type: ObjectProperty
comment: Relation between Baseball Player and Architect
sub property of: person
range: architect
domain: baseball player

broadcast
type: Class
label: Émission de télévision @fr

vein
type: Class
label: veine @fr

mammal
type: Class
label: mammifère @fr

links to Model
comment: Relation between Baseball Player and Model
type: ObjectProperty
domain: baseball player
sub property of: person
comment: Relazione tra Baseball Player e Model @it
range: model

island
type: Class
label: νησί @el
label: île @fr

links to Historic Building
comment: Relation between Baseball Player and Historic Building
sub property of: place
type: ObjectProperty
comment: Relazione tra Baseball Player e Historic Building @it
range: historic building
domain: baseball player

comics character
type: Class
label: personnage de bandes dessinées @fr

event
type: ObjectProperty
label: évènement @fr

Formula One racer
label: pilote de formule 1 @fr
type: Class

links to Playboy Playmate
domain: baseball player
sub property of: person
comment: Relazione tra Baseball Player e Playboy Playmate @it
range: Playboy Playmate
comment: Relation between Baseball Player and Playboy Playmate
type: ObjectProperty

skyscraper
type: Class
label: gratte-ciel @fr

radio station
type: Class
label: station de radio @fr

links to Reptile
comment: Relazione tra Baseball Player e Reptile @it
sub property of: species
range: reptile
type: ObjectProperty
comment: Relation between Baseball Player and Reptile
domain: baseball player

bone
label: os @fr
label: Knochen @de
type: Class

links to Band
comment: Relation between Baseball Player and Band
range: Band
domain: baseball player
comment: Relazione tra Baseball Player e Band @it
type: ObjectProperty
sub property of: organização

links to Fungus
range: fungus
comment: Relation between Baseball Player and Fungus
type: ObjectProperty
sub property of: species
comment: Relazione tra Baseball Player e Fungus @it
domain: baseball player

airport
label: aéroport @fr
label: Flughafen @de
type: Class

Axiom
dbpedia infobox matching weight: 100.0
annotated target: after
annotated source: links to Military Person
annotated property: relatedMatch