links to Legislature
comment: Relation between Basketball Player and Legislature
comment: Relazione tra Basketball Player e Legislature @it
type: ObjectProperty
range: legislature
sub property of: organisation
domain: basketball player

television show
type: Class
label: émission de télévision @fr

disease
label: maladie @fr
type: Class
type: ObjectProperty

links to Non- Profit Organisation
comment: Relazione tra Basketball Player e Non- Profit Organisation @it
domain: basketball player
range: non-profit organisation
comment: Relation between Basketball Player and Non- Profit Organisation
type: ObjectProperty
sub property of: organisation

links to Golf Player
range: golf player
comment: Relazione tra Basketball Player e Golf Player @it
domain: basketball player
sub property of: person
comment: Relation between Basketball Player and Golf Player
type: ObjectProperty
type: NamedIndividual
related match: after

Axiom
dbpedia infobox matching weight: 100.0
annotated property: relatedMatch
annotated source: links to Golf Player
annotated target: after

automobile
type: Class

links to Book
range: book
type: ObjectProperty
domain: basketball player
sub property of: work
comment: Relation between Basketball Player and Book
comment: Relazione tra Basketball Player e Book @it

Election
type: Class
label: élection @fr

mean of transportation
label: moyen de transport @fr
type: ObjectProperty

american football player
label: joueur de football américain @fr
type: Class

stadium
label: stade @fr
type: Class

soccer league
label: ligue de football @fr
type: Class

links to Stadium
type: ObjectProperty
comment: Relazione tra Basketball Player e Stadium @it
domain: basketball player
comment: Relation between Basketball Player and Stadium
range: stadium
sub property of: place

links to Single
range: single
comment: Relation between Basketball Player and Single
sub property of: work
type: ObjectProperty
domain: basketball player
comment: Relazione tra Basketball Player e Single @it

wrestler
type: Class
label: lutteur @fr

mayor
type: Class
label: maire @fr

Axiom
dbpedia infobox matching weight: 33.33
annotated source: links to Office Holder
annotated target: after
annotated property: relatedMatch

species
type: Class
label: espèce @fr
type: ObjectProperty

links to Chemical Compound
type: ObjectProperty
comment: Relazione tra Basketball Player e Chemical Compound @it
sub property of: chemical compound
range: chemical compound
domain: basketball player
comment: Relation between Basketball Player and Chemical Compound

links to Wrestling Event
sub property of: event
domain: basketball player
comment: Relazione tra Basketball Player e Wrestling Event @it
comment: Relation between Basketball Player and Wrestling Event
type: ObjectProperty
range: wrestling event

newspaper
label: journal @fr
type: Class

game
type: Class
label: jeu @fr

road
type: Class
label: route @fr

links to Writer
comment: Relation between Basketball Player and Writer
comment: Relazione tra Basketball Player e Writer @it
range: writer
domain: basketball player
sub property of: person
type: ObjectProperty

boxer
label: boxeur @fr
type: Class

links to Town
comment: Relazione tra Basketball Player e Town @it
sub property of: place
type: ObjectProperty
domain: basketball player
comment: Relation between Basketball Player and Town
range: town

World Heritage Site
label: site du patrimoine mondial @fr
type: Class

station
type: Class

language
type: ObjectProperty
label: langage @fr
type: Class

Axiom
dbpedia infobox matching weight: 100.0
annotated property: relatedMatch
annotated target: title
annotated source: links to Award

links to Park
comment: Relazione tra Basketball Player e Park @it
type: ObjectProperty
domain: basketball player
comment: Relation between Basketball Player and Park
range: park
sub property of: place

lake
type: Class
label: lac @fr

Axiom
dbpedia infobox matching weight: 42.86
annotated property: relatedMatch
annotated target: before
annotated source: links to National Collegiate Athletic Association Athlete

links to Bird
comment: Relazione tra Basketball Player e Bird @it
sub property of: species
type: ObjectProperty
range: bird
comment: Relation between Basketball Player and Bird
domain: basketball player

governor
label: gouverneur @fr
type: Class

links to Continent
comment: Relazione tra Basketball Player e Continent @it
type: ObjectProperty
sub property of: place
domain: basketball player
comment: Relation between Basketball Player and Continent
range: continent

links to Weapon
comment: Relazione tra Basketball Player e Weapon @it
comment: Relation between Basketball Player and Weapon
domain: basketball player
sub property of: device
type: ObjectProperty
range: weapon

work
type: ObjectProperty
label: travail @fr
label: obra @pt

river
label: rivière @fr
type: Class

links to Skyscraper
type: ObjectProperty
range: skyscraper
sub property of: place
comment: Relazione tra Basketball Player e Skyscraper @it
comment: Relation between Basketball Player and Skyscraper
domain: basketball player

lacrosse league
label: ligue de crosse @fr
type: Class

fish
type: Class
label: poisson @fr

museum
type: Class
label: musée @fr

links to Language
sub property of: language
comment: Relazione tra Basketball Player e Language @it
domain: basketball player
range: language
type: ObjectProperty
comment: Relation between Basketball Player and Language

links to Historic Place
comment: Relation between Basketball Player and Historic Place
comment: Relazione tra Basketball Player e Historic Place @it
domain: basketball player
sub property of: place
range: historic place
type: ObjectProperty

tennis player
label: joueur de tennis @fr
type: Class

links to World Heritage Site
comment: Relazione tra Basketball Player e World Heritage Site @it
domain: basketball player
type: ObjectProperty
sub property of: place
comment: Relation between Basketball Player and World Heritage Site
range: World Heritage Site

links to Website
sub property of: website
comment: Relation between Basketball Player and Website
domain: basketball player
comment: Relazione tra Basketball Player e Website @it
range: website
type: ObjectProperty

video game
label: jeux vidéo @fr
type: Class

trade union
label: syndicat professionnel @fr
type: Class

currency
type: ObjectProperty
type: Class
label: devise @fr

prime minister
type: Class
label: premier ministre @fr

links to Mayor
comment: Relazione tra Basketball Player e Mayor @it
type: ObjectProperty
range: mayor
comment: Relation between Basketball Player and Mayor
sub property of: person
domain: basketball player

Axiom
dbpedia infobox matching weight: 100.0
annotated property: relatedMatch
annotated target: years
annotated source: links to Olympics

historic place
label: site historique @fr
type: Class

links to Artery
sub property of: anatomical structure
type: ObjectProperty
comment: Relation between Basketball Player and Artery
domain: basketball player
range: artery
comment: Relazione tra Basketball Player e Artery @it

hospital
type: Class
label: hôpital @fr

BasketballPlayer.owl
has author: Andrea Giovanni Nuzzolese
extracted from: en.wikipedia.org
comment: BasketballPlayer Encyclopedic Knowledge Pattern
imports: dbpediainfoboxmatchingweight.owl
extracted from: dbpedia.org
has author: Aldo Gangemi
imports: cpannotationschema.owl
has author: Valentina Presutti
has intent: To represent the encyclopedic knowledge expressed by an object typed as BasketballPlayer
type: Ontology

links to Film Festival
comment: Relation between Basketball Player and Film Festival
range: film festival
type: ObjectProperty
domain: basketball player
comment: Relazione tra Basketball Player e Film Festival @it
sub property of: event

links to Model
sub property of: person
type: ObjectProperty
comment: Relazione tra Basketball Player e Model @it
comment: Relation between Basketball Player and Model
domain: basketball player
range: model

links to American Football Team
comment: Relazione tra Basketball Player e American Football Team @it
range: american football team
type: ObjectProperty
domain: basketball player
sub property of: organisation
comment: Relation between Basketball Player and American Football Team

continent
type: Class
label: ήπειρος @el

links to Muscle
domain: basketball player
comment: Relation between Basketball Player and Muscle
range: muscle
comment: Relazione tra Basketball Player e Muscle @it
sub property of: anatomical structure
type: ObjectProperty

links to Canadian Football League
domain: basketball player
type: ObjectProperty
sub property of: organisation
comment: Relation between Basketball Player and Canadian Football League
comment: Relazione tra Basketball Player e Canadian Football League @it
range: canadian football league

president
type: Class
label: président @fr

album
label: Album @de
type: Class

links to Lake
comment: Relation between Basketball Player and Lake
sub property of: place
range: lake
type: ObjectProperty
domain: basketball player
comment: Relazione tra Basketball Player e Lake @it

links to Comedian
domain: basketball player
type: ObjectProperty
comment: Relation between Basketball Player and Comedian
range: comedian
comment: Relazione tra Basketball Player e Comedian @it
sub property of: person

links to Station
comment: Relation between Basketball Player and Station
sub property of: place
domain: basketball player
type: ObjectProperty
comment: Relazione tra Basketball Player e Station @it
range: station

person
label: Person @de
type: ObjectProperty
label: pessoa @pt
label: personne @fr

links to Fish
comment: Relazione tra Basketball Player e Fish @it
domain: basketball player
type: ObjectProperty
range: fish
comment: Relation between Basketball Player and Fish
sub property of: species

military unit
type: Class
label: unité militaire @fr

links to Wrestler
type: ObjectProperty
range: wrestler
sub property of: person
comment: Relation between Basketball Player and Wrestler
comment: Relazione tra Basketball Player e Wrestler @it
domain: basketball player

links to Award
type: NamedIndividual
related match: title
range: award
sub property of: award
type: ObjectProperty
domain: basketball player
comment: Relazione tra Basketball Player e Award @it
comment: Relation between Basketball Player and Award

soccer manager
type: Class
label: entraîneur de football @fr

Axiom
dbpedia infobox matching weight: 38.46
annotated property: relatedMatch
annotated source: links to American Football Player
annotated target: years

music genre
label: genre musical @fr
type: ObjectProperty
label: género musical @pt
type: Class

links to Prime Minister
range: prime minister
comment: Relation between Basketball Player and Prime Minister
sub property of: person
domain: basketball player
comment: Relazione tra Basketball Player e Prime Minister @it
type: ObjectProperty

links to Album
sub property of: work
type: ObjectProperty
range: album
comment: Relation between Basketball Player and Album
comment: Relazione tra Basketball Player e Album @it
domain: basketball player

links to Village
domain: basketball player
comment: Relation between Basketball Player and Village
range: village
comment: Relazione tra Basketball Player e Village @it
sub property of: place
type: ObjectProperty

links to Music Genre
sub property of: music genre
comment: Relazione tra Basketball Player e Music Genre @it
type: ObjectProperty
range: music genre
comment: Relation between Basketball Player and Music Genre
domain: basketball player

Axiom
dbpedia infobox matching weight: 50.0
annotated property: relatedMatch
annotated source: links to Military Person
annotated target: before

writer
type: Class
label: écrivain @fr

record label
label: label discographique @fr
type: Class

model
type: Class
label: mannequin @fr

links to Crustacean
comment: Relazione tra Basketball Player e Crustacean @it
comment: Relation between Basketball Player and Crustacean
sub property of: species
range: crustacean
type: ObjectProperty
domain: basketball player

crustacean
label: crustacés @fr
type: Class

links to Museum
range: museum
comment: Relation between Basketball Player and Museum
domain: basketball player
type: ObjectProperty
sub property of: place
comment: Relazione tra Basketball Player e Museum @it

links to Baseball League
comment: Relazione tra Basketball Player e Baseball League @it
domain: basketball player
type: ObjectProperty
comment: Relation between Basketball Player and Baseball League
sub property of: organisation
range: baseball league

links to Ethnic Group
type: ObjectProperty
domain: basketball player
sub property of: ethnic group
range: ethnic group
comment: Relazione tra Basketball Player e Ethnic Group @it
comment: Relation between Basketball Player and Ethnic Group

links to Television Show
sub property of: work
comment: Relazione tra Basketball Player e Television Show @it
type: ObjectProperty
comment: Relation between Basketball Player and Television Show
range: television show
domain: basketball player

film festival
label: festival du film @fr
type: Class

links to Tennis Player
related match: after
type: NamedIndividual
range: tennis player
type: ObjectProperty
domain: basketball player
comment: Relazione tra Basketball Player e Tennis Player @it
sub property of: person
comment: Relation between Basketball Player and Tennis Player

Axiom
dbpedia infobox matching weight: 33.33
annotated target: years
annotated property: relatedMatch
annotated source: links to Office Holder

links to Flowering Plant
type: ObjectProperty
comment: Relazione tra Basketball Player e Flowering Plant @it
sub property of: species
domain: basketball player
comment: Relation between Basketball Player and Flowering Plant
range: flowering plant

links to Beverage
comment: Relation between Basketball Player and Beverage
comment: Relazione tra Basketball Player e Beverage @it
type: ObjectProperty
range: beverage
sub property of: beverage
domain: basketball player

links to Baseball Player
comment: Relation between Basketball Player and Baseball Player
type: ObjectProperty
range: baseball player
comment: Relazione tra Basketball Player e Baseball Player @it
domain: basketball player
sub property of: person

Axiom
dbpedia infobox matching weight: 100.0
annotated property: relatedMatch
annotated source: links to Soccer Club
annotated target: teams

hockey team
label: équipe de hockey @fr
type: Class

links to American Football Player
range: american football player
type: NamedIndividual
domain: basketball player
comment: Relazione tra Basketball Player e American Football Player @it
related match: years
related match: after
type: ObjectProperty
sub property of: person
comment: Relation between Basketball Player and American Football Player
related match: before

links to Soccer Player
sub property of: person
range: soccer player
comment: Relation between Basketball Player and Soccer Player
type: ObjectProperty
comment: Relazione tra Basketball Player e Soccer Player @it
domain: basketball player

soccer player
label: joueur de football @fr
type: Class

links to Newspaper
domain: basketball player
type: ObjectProperty
sub property of: work
comment: Relation between Basketball Player and Newspaper
range: newspaper
comment: Relazione tra Basketball Player e Newspaper @it

links to Election
sub property of: event
range: Election
comment: Relazione tra Basketball Player e Election @it
type: ObjectProperty
comment: Relation between Basketball Player and Election
domain: basketball player

links to Island
sub property of: place
comment: Relazione tra Basketball Player e Island @it
type: ObjectProperty
domain: basketball player
comment: Relation between Basketball Player and Island
range: island

reptile
type: Class

legislature
type: Class
label: pouvoir législatif @fr

links to Philosopher
type: ObjectProperty
comment: Relazione tra Basketball Player e Philosopher @it
range: philosopher
sub property of: person
domain: basketball player
comment: Relation between Basketball Player and Philosopher

links to Bone
range: bone
sub property of: anatomical structure
comment: Relazione tra Basketball Player e Bone @it
domain: basketball player
comment: Relation between Basketball Player and Bone
type: ObjectProperty

airline
label: compagnie aérienne @fr
type: Class

links to Musical Artist
comment: Relation between Basketball Player and Musical Artist
sub property of: person
domain: basketball player
type: ObjectProperty
comment: Relazione tra Basketball Player e Musical Artist @it
range: musical artist

links to Boxer
comment: Relazione tra Basketball Player e Boxer @it
domain: basketball player
range: boxer
type: ObjectProperty
comment: Relation between Basketball Player and Boxer
sub property of: person

links to Journalist
range: journalist
comment: Relation between Basketball Player and Journalist
domain: basketball player
sub property of: person
type: ObjectProperty
comment: Relazione tra Basketball Player e Journalist @it

congressman
type: Class
label: membre du Congrès @fr

links to Road
type: ObjectProperty
range: road
comment: Relation between Basketball Player and Road
domain: basketball player
comment: Relazione tra Basketball Player e Road @it
sub property of: infrastructure

Axiom
dbpedia infobox matching weight: 100.0
annotated target: after
annotated property: relatedMatch
annotated source: links to Congressman

golf player
type: Class
label: golfeur @fr

nascar driver
label: pilote de la nascar @fr
type: Class

activity
type: ObjectProperty
label: Aktivität @de
label: activité @fr

links to Game
type: ObjectProperty
domain: basketball player
comment: Relazione tra Basketball Player e Game @it
comment: Relation between Basketball Player and Game
range: game
sub property of: activity

journalist
type: Class
label: journaliste @fr

links to Television Episode
domain: basketball player
comment: Relation between Basketball Player and Television Episode
type: ObjectProperty
comment: Relazione tra Basketball Player e Television Episode @it
sub property of: work
range: television episode

Axiom
dbpedia infobox matching weight: 57.14
annotated property: relatedMatch
annotated target: after
annotated source: links to National Collegiate Athletic Association Athlete

links to River
range: river
type: ObjectProperty
comment: Relazione tra Basketball Player e River @it
comment: Relation between Basketball Player and River
sub property of: place
domain: basketball player

film
type: Class
label: ταινία @el

links to Soccer Club
type: NamedIndividual
related match: teams
comment: Relation between Basketball Player and Soccer Club
comment: Relazione tra Basketball Player e Soccer Club @it
sub property of: organisation
domain: basketball player
type: ObjectProperty
range: soccer club

links to Scientist
domain: basketball player
type: ObjectProperty
range: scientist
comment: Relation between Basketball Player and Scientist
sub property of: person
comment: Relazione tra Basketball Player e Scientist @it

american football team
label: équipe américaine de football américain @fr
type: Class

bird
label: oiseau @fr
type: Class

chemical compound
label: produit chimique @fr
type: ObjectProperty
type: Class

musical artist
label: musicien @fr
type: Class
label: artista musical @pt

Axiom
dbpedia infobox matching weight: 100.0
annotated property: relatedMatch
annotated target: after
annotated source: links to Tennis Player

links to Reptile
type: ObjectProperty
sub property of: species
range: reptile
comment: Relazione tra Basketball Player e Reptile @it
domain: basketball player
comment: Relation between Basketball Player and Reptile

links to Airline
domain: basketball player
type: ObjectProperty
sub property of: organisation
comment: Relazione tra Basketball Player e Airline @it
range: airline
comment: Relation between Basketball Player and Airline

links to Governor
type: ObjectProperty
comment: Relation between Basketball Player and Governor
range: governor
sub property of: person
domain: basketball player
comment: Relazione tra Basketball Player e Governor @it

park
label: parc @fr
type: Class

links to Military Unit
range: military unit
comment: Relazione tra Basketball Player e Military Unit @it
comment: Relation between Basketball Player and Military Unit
sub property of: organisation
domain: basketball player
type: ObjectProperty

rugby player
type: Class
label: joueur de rugby @fr

links to Actor
domain: basketball player
type: ObjectProperty
comment: Relation between Basketball Player and Actor
sub property of: person
comment: Relazione tra Basketball Player e Actor @it
range: actor

links to Trade Union
sub property of: organisation
domain: basketball player
comment: Relation between Basketball Player and Trade Union
range: trade union
comment: Relazione tra Basketball Player e Trade Union @it
type: ObjectProperty

links to Hospital
domain: basketball player
sub property of: place
type: ObjectProperty
comment: Relation between Basketball Player and Hospital
range: hospital
comment: Relazione tra Basketball Player e Hospital @it

american football league
type: Class

links to Nascar Driver
type: ObjectProperty
domain: basketball player
comment: Relazione tra Basketball Player e Nascar Driver @it
range: nascar driver
comment: Relation between Basketball Player and Nascar Driver
sub property of: person

actor
label: Schauspieler @de
type: Class
label: acteur @fr

cyclist
label: cycliste @fr
type: Class

place
label: lugar @pt
label: lieu @fr
label: περιοχή @el
type: ObjectProperty

national collegiate athletic association athlete
type: Class
label: athlète de la national collegiate athletic association @fr

links to Mammal
sub property of: species
range: mammal
domain: basketball player
comment: Relation between Basketball Player and Mammal
comment: Relazione tra Basketball Player e Mammal @it
type: ObjectProperty

wrestling event
type: Class
label: match de catch @fr

links to Airport
domain: basketball player
range: airport
comment: Relation between Basketball Player and Airport
comment: Relazione tra Basketball Player e Airport @it
type: ObjectProperty
sub property of: place

infrastructure
type: ObjectProperty

links to College
range: college
comment: Relation between Basketball Player and College
domain: basketball player
type: ObjectProperty
sub property of: organisation
comment: Relazione tra Basketball Player e College @it

links to Hockey Team
type: ObjectProperty
domain: basketball player
range: hockey team
comment: Relation between Basketball Player and Hockey Team
comment: Relazione tra Basketball Player e Hockey Team @it
sub property of: organisation

flowering plant
type: Class
label: angiospermes @fr

links to Congressman
domain: basketball player
type: ObjectProperty
range: congressman
comment: Relation between Basketball Player and Congressman
comment: Relazione tra Basketball Player e Congressman @it
sub property of: person
related match: after
type: NamedIndividual

senator
type: Class
label: sénateur @fr

links to Species
range: species
comment: Relazione tra Basketball Player e Species @it
domain: basketball player
comment: Relation between Basketball Player and Species
sub property of: species
type: ObjectProperty

comedian
type: Class
label: comédien @fr

links to Senator
comment: Relation between Basketball Player and Senator
comment: Relazione tra Basketball Player e Senator @it
sub property of: person
range: senator
domain: basketball player
type: ObjectProperty

Playboy Playmate
label: playmate pour Playboy @fr
type: Class

book
label: książka @pl
label: llibre @ca
label: βιβλίο @el
label: livre @fr
type: Class

device
type: ObjectProperty
label: appareil @fr

shopping mall
type: Class
label: centre commercial @fr

links to Mixed Martial Arts Event
sub property of: event
range: mixed martial arts event
comment: Relazione tra Basketball Player e Mixed Martial Arts Event @it
domain: basketball player
type: ObjectProperty
comment: Relation between Basketball Player and Mixed Martial Arts Event

links to Military Conflict
type: ObjectProperty
comment: Relazione tra Basketball Player e Military Conflict @it
domain: basketball player
range: military conflict
comment: Relation between Basketball Player and Military Conflict
sub property of: event

non-profit organisation
type: Class
label: organisation à but non lucratif @fr

links to Soccer League
comment: Relazione tra Basketball Player e Soccer League @it
range: soccer league
type: ObjectProperty
sub property of: organisation
comment: Relation between Basketball Player and Soccer League
domain: basketball player

links to Shopping Mall
range: shopping mall
comment: Relation between Basketball Player and Shopping Mall
type: ObjectProperty
domain: basketball player
comment: Relazione tra Basketball Player e Shopping Mall @it
sub property of: place

canadian football league
type: Class

links to Comics Character
comment: Relation between Basketball Player and Comics Character
domain: basketball player
range: comics character
type: ObjectProperty
sub property of: person
comment: Relazione tra Basketball Player e Comics Character @it

weapon
type: Class
label: arme @fr

links to Playboy Playmate
type: ObjectProperty
range: Playboy Playmate
domain: basketball player
sub property of: person
comment: Relazione tra Basketball Player e Playboy Playmate @it
comment: Relation between Basketball Player and Playboy Playmate

drug
type: Class
label: médicament @fr
type: ObjectProperty

links to Currency
comment: Relation between Basketball Player and Currency
sub property of: currency
domain: basketball player
comment: Relazione tra Basketball Player e Currency @it
range: currency
type: ObjectProperty

magazine
label: περιοδικό @el
type: Class

links to Ice Hockey League
comment: Relation between Basketball Player and Ice Hockey League
comment: Relazione tra Basketball Player e Ice Hockey League @it
sub property of: organisation
domain: basketball player
range: ice hockey league
type: ObjectProperty

military person
type: Class
label: militaire @fr

philosopher
label: philosophe @fr
type: Class

award
type: Class
label: récompense @fr
type: ObjectProperty

links to Automobile
range: automobile
type: ObjectProperty
comment: Relation between Basketball Player and Automobile
sub property of: mean of transportation
domain: basketball player
comment: Relazione tra Basketball Player e Automobile @it

links to Film
sub property of: work
comment: Relation between Basketball Player and Film
type: ObjectProperty
domain: basketball player
comment: Relazione tra Basketball Player e Film @it
range: film

college
type: Class

anatomical structure
label: structure anatomique @fr
type: ObjectProperty

single
type: Class

mixed martial arts event
label: évènement d'arts martiaux mixtes @fr
type: Class

Band
label: banda @pt
label: Musikgruppe @de
type: Class
label: groupe de musique @fr

town
label: ville @fr
type: Class

links to Lacrosse League
comment: Relation between Basketball Player and Lacrosse League
range: lacrosse league
comment: Relazione tra Basketball Player e Lacrosse League @it
sub property of: organisation
type: ObjectProperty
domain: basketball player

links to Formula One Racer
domain: basketball player
type: ObjectProperty
range: Formula One racer
sub property of: person
comment: Relazione tra Basketball Player e Formula One Racer @it
comment: Relation between Basketball Player and Formula One Racer

links to Member Of Parliament
comment: Relation between Basketball Player and Member Of Parliament
comment: Relazione tra Basketball Player e Member Of Parliament @it
domain: basketball player
range: member of parliament
sub property of: person
type: ObjectProperty

ethnic group
label: groupe ethnique @fr
type: ObjectProperty
type: Class

links to Olympics
related match: years
type: NamedIndividual
type: ObjectProperty
sub property of: event
comment: Relation between Basketball Player and Olympics
comment: Relazione tra Basketball Player e Olympics @it
domain: basketball player
range: olympics

artery
label: artère @fr
type: Class
label: Arterie @de

links to Radio Station
range: radio station
sub property of: organisation
comment: Relation between Basketball Player and Radio Station
domain: basketball player
comment: Relazione tra Basketball Player e Radio Station @it
type: ObjectProperty

television episode
type: Class
label: épisode télévisé @fr

Axiom
dbpedia infobox matching weight: 23.08
annotated property: relatedMatch
annotated source: links to American Football Player
annotated target: before

muscle
type: Class

links to Magazine
domain: basketball player
sub property of: work
type: ObjectProperty
comment: Relazione tra Basketball Player e Magazine @it
range: magazine
comment: Relation between Basketball Player and Magazine

village
type: Class
label: χωριό @el

ice hockey league
type: Class
label: ligue d'hockey sur glace @fr

links to Band
range: Band
domain: basketball player
comment: Relation between Basketball Player and Band
sub property of: organisation
type: ObjectProperty
comment: Relazione tra Basketball Player e Band @it

links to Record Label
sub property of: organisation
comment: Relation between Basketball Player and Record Label
domain: basketball player
type: ObjectProperty
comment: Relazione tra Basketball Player e Record Label @it
range: record label

soccer club
label: club de football @fr
type: Class

links to President
sub property of: person
domain: basketball player
comment: Relation between Basketball Player and President
comment: Relazione tra Basketball Player e President @it
type: ObjectProperty
range: president

links to Cyclist
comment: Relation between Basketball Player and Cyclist
range: cyclist
comment: Relazione tra Basketball Player e Cyclist @it
sub property of: person
domain: basketball player
type: ObjectProperty

office holder
type: Class
label: Amtsinhaber @de
label: titulaire @fr

baseball player
type: Class
label: joueur de baseball @fr

military conflict
type: Class
label: conflit militaire @fr

website
label: Ιστότοπος @el
label: site web @fr
type: Class
type: ObjectProperty

links to Disease
comment: Relazione tra Basketball Player e Disease @it
comment: Relation between Basketball Player and Disease
sub property of: disease
domain: basketball player
range: disease
type: ObjectProperty

links to American Football League
type: ObjectProperty
range: american football league
comment: Relazione tra Basketball Player e American Football League @it
comment: Relation between Basketball Player and American Football League
domain: basketball player
sub property of: organisation

links to Soccer Manager
comment: Relazione tra Basketball Player e Soccer Manager @it
type: ObjectProperty
domain: basketball player
comment: Relation between Basketball Player and Soccer Manager
range: soccer manager
sub property of: person

basketball player
label: joueur de basketball @fr
type: Class

links to National Collegiate Athletic Association Athlete
type: ObjectProperty
related match: after
comment: Relazione tra Basketball Player e National Collegiate Athletic Association Athlete @it
related match: before
range: national collegiate athletic association athlete
comment: Relation between Basketball Player and National Collegiate Athletic Association Athlete
sub property of: person
type: NamedIndividual
domain: basketball player

links to Military Person
comment: Relation between Basketball Player and Military Person
related match: before
range: military person
type: ObjectProperty
domain: basketball player
type: NamedIndividual
sub property of: person
comment: Relazione tra Basketball Player e Military Person @it
related match: years

ice hockey player
label: joueur de hockey sur glace @fr
type: Class

beverage
type: ObjectProperty
type: Class
label: boisson @fr

scientist
type: Class
label: Wissenschaftler @de
label: scientifique @fr

links to Broadcast
range: broadcast
type: ObjectProperty
sub property of: organisation
domain: basketball player
comment: Relation between Basketball Player and Broadcast
comment: Relazione tra Basketball Player e Broadcast @it

Axiom
dbpedia infobox matching weight: 33.33
annotated property: relatedMatch
annotated source: links to Office Holder
annotated target: before

links to Video Game
type: ObjectProperty
sub property of: work
domain: basketball player
range: video game
comment: Relazione tra Basketball Player e Video Game @it
comment: Relation between Basketball Player and Video Game

Axiom
dbpedia infobox matching weight: 50.0
annotated target: years
annotated property: relatedMatch
annotated source: links to Military Person

olympics
type: Class
label: Jeux Olympiques @fr

organisation
label: Organisation @de
label: organização @pt
type: ObjectProperty

baseball league
label: ligue de baseball @fr
type: Class

broadcast
type: Class
label: Émission de télévision @fr

mammal
label: mammifère @fr
type: Class

links to Office Holder
comment: Relazione tra Basketball Player e Office Holder @it
sub property of: person
comment: Relation between Basketball Player and Office Holder
related match: before
type: ObjectProperty
related match: after
domain: basketball player
type: NamedIndividual
related match: years
range: office holder

island
type: Class
label: νησί @el
label: île @fr

links to Drug
type: ObjectProperty
domain: basketball player
comment: Relation between Basketball Player and Drug
comment: Relazione tra Basketball Player e Drug @it
sub property of: drug
range: drug

comics character
label: personnage de bandes dessinées @fr
type: Class

links to Rugby Player
comment: Relazione tra Basketball Player e Rugby Player @it
sub property of: person
domain: basketball player
type: ObjectProperty
comment: Relation between Basketball Player and Rugby Player
range: rugby player

event
label: évènement @fr
type: ObjectProperty

skyscraper
type: Class
label: gratte-ciel @fr

Formula One racer
type: Class
label: pilote de formule 1 @fr

Axiom
dbpedia infobox matching weight: 38.46
annotated target: after
annotated source: links to American Football Player
annotated property: relatedMatch

radio station
label: station de radio @fr
type: Class

bone
type: Class
label: Knochen @de
label: os @fr

member of parliament
label: membre du Parlement @fr
type: Class

airport
label: aéroport @fr
label: Flughafen @de
type: Class

links to Ice Hockey Player
range: ice hockey player
type: ObjectProperty
domain: basketball player
sub property of: person
comment: Relazione tra Basketball Player e Ice Hockey Player @it
comment: Relation between Basketball Player and Ice Hockey Player