links to Comics Character
sub property of: person
domain: British royalty
comment: Relation between British Royalty and Comics Character
type: ObjectProperty
range: comics character
comment: Relazione tra British Royalty e Comics Character @it

television show
label: émission de télévision @fr
type: Class

Axiom
dbpedia infobox matching weight: 42.11
annotated source: links to Saint
annotated target: issue
annotated property: relatedMatch

links to Canal
domain: British royalty
comment: Relation between British Royalty and Canal
comment: Relazione tra British Royalty e Canal @it
range: canal
type: ObjectProperty
sub property of: place

links to Currency
comment: Relation between British Royalty and Currency
sub property of: currency
comment: Relazione tra British Royalty e Currency @it
type: ObjectProperty
range: currency
domain: British royalty

Axiom
dbpedia infobox matching weight: 100.0
annotated property: relatedMatch
annotated source: links to Olympics
annotated target: years

Axiom
dbpedia infobox matching weight: 7.14
annotated property: relatedMatch
annotated target: before
annotated source: links to President

links to Chemical Compound
comment: Relation between British Royalty and Chemical Compound
comment: Relazione tra British Royalty e Chemical Compound @it
type: ObjectProperty
domain: British royalty
sub property of: chemical compound
range: chemical compound

automobile
type: Class

colour
type: Class
label: couleur @fr
label: χρώμα @el
type: ObjectProperty

Election
type: Class
label: élection @fr

Axiom
dbpedia infobox matching weight: 57.14
annotated source: links to President
annotated target: after
annotated property: relatedMatch

links to School
type: ObjectProperty
range: school
comment: Relation between British Royalty and School
sub property of: organização
domain: British royalty
comment: Relazione tra British Royalty e School @it

links to Saint
domain: British royalty
type: NamedIndividual
related match: before
related match: after
range: saint
sub property of: person
related match: regent
related match: spouses
comment: Relation between British Royalty and Saint
related match: issue
comment: Relazione tra British Royalty e Saint @it
type: ObjectProperty

mean of transportation
type: ObjectProperty
label: moyen de transport @fr

stadium
label: stade @fr
type: Class

soccer league
type: Class
label: ligue de football @fr

links to Lake
comment: Relation between British Royalty and Lake
comment: Relazione tra British Royalty e Lake @it
range: lake
type: ObjectProperty
domain: British royalty
sub property of: place

links to Grape
comment: Relazione tra British Royalty e Grape @it
comment: Relation between British Royalty and Grape
type: ObjectProperty
domain: British royalty
range: grape
sub property of: species

links to Airport
domain: British royalty
range: airport
type: ObjectProperty
sub property of: place
comment: Relation between British Royalty and Airport
comment: Relazione tra British Royalty e Airport @it

links to Crustacean
comment: Relation between British Royalty and Crustacean
range: crustacean
domain: British royalty
sub property of: species
type: ObjectProperty
comment: Relazione tra British Royalty e Crustacean @it

Axiom
dbpedia infobox matching weight: 34.62
annotated source: links to Military Person
annotated property: relatedMatch
annotated target: after

Axiom
dbpedia infobox matching weight: 10.53
annotated source: links to Saint
annotated target: regent
annotated property: relatedMatch

Axiom
dbpedia infobox matching weight: 100.0
annotated source: links to World Heritage Site
annotated target: placeOfBurial
annotated property: relatedMatch

Site of Special Scientific Interest
label: site d'intérêt scientifique particulier @fr
type: Class

mayor
type: Class
label: maire @fr

links to Ski Area
comment: Relazione tra British Royalty e Ski Area @it
sub property of: place
range: ski area
type: ObjectProperty
comment: Relation between British Royalty and Ski Area
domain: British royalty

pope
label: pape @fr
type: Class

species
type: Class
label: espèce @fr
type: ObjectProperty

links to Continent
sub property of: place
range: continent
comment: Relazione tra British Royalty e Continent @it
domain: British royalty
type: ObjectProperty
comment: Relation between British Royalty and Continent

newspaper
type: Class
label: journal @fr

links to Site Of Special Scientific Interest
sub property of: place
comment: Relazione tra British Royalty e Site Of Special Scientific Interest @it
range: Site of Special Scientific Interest
comment: Relation between British Royalty and Site Of Special Scientific Interest
domain: British royalty
type: ObjectProperty

protected area
label: aire protégée @fr
label: προστατευμένη περιοχή @el
type: Class

game
type: Class
label: jeu @fr

road
label: route @fr
type: Class

ginkgo
type: Class

judge
label: juge @fr
type: Class

Axiom
dbpedia infobox matching weight: 5.26
annotated source: links to Saint
annotated property: relatedMatch
annotated target: spouses

World Heritage Site
type: Class
label: site du patrimoine mondial @fr

Axiom
dbpedia infobox matching weight: 33.33
annotated target: predecessor
annotated source: links to Prime Minister
annotated property: relatedMatch

Axiom
dbpedia infobox matching weight: 50.0
annotated property: relatedMatch
annotated source: links to Scientist
annotated target: issue

station
type: Class

links to Drug
comment: Relazione tra British Royalty e Drug @it
type: ObjectProperty
range: drug
sub property of: drug
comment: Relation between British Royalty and Drug
domain: British royalty

lake
type: Class
label: lac @fr

links to Historic Building
comment: Relation between British Royalty and Historic Building
domain: British royalty
type: ObjectProperty
range: historic building
sub property of: place
comment: Relazione tra British Royalty e Historic Building @it

links to Ambassador
comment: Relation between British Royalty and Ambassador
type: ObjectProperty
range: ambassador
comment: Relazione tra British Royalty e Ambassador @it
sub property of: person
domain: British royalty

links to Criminal
type: ObjectProperty
comment: Relation between British Royalty and Criminal
sub property of: person
domain: British royalty
comment: Relazione tra British Royalty e Criminal @it
range: criminal

links to Comics Creator
type: ObjectProperty
comment: Relazione tra British Royalty e Comics Creator @it
comment: Relation between British Royalty and Comics Creator
domain: British royalty
range: comics creator
sub property of: person

links to Stadium
range: stadium
sub property of: place
comment: Relation between British Royalty and Stadium
type: ObjectProperty
comment: Relazione tra British Royalty e Stadium @it
domain: British royalty

links to Automobile
comment: Relation between British Royalty and Automobile
comment: Relazione tra British Royalty e Automobile @it
sub property of: mean of transportation
domain: British royalty
type: ObjectProperty
range: automobile

governor
type: Class
label: gouverneur @fr

work
type: ObjectProperty
label: travail @fr
label: obra @pt

links to Philosopher
comment: Relation between British Royalty and Philosopher
sub property of: person
domain: British royalty
range: philosopher
type: ObjectProperty
comment: Relazione tra British Royalty e Philosopher @it

river
label: rivière @fr
type: Class

Axiom
dbpedia infobox matching weight: 7.14
annotated property: relatedMatch
annotated target: primeMinisters
annotated source: links to President

school
label: école @fr
type: Class

museum
type: Class
label: musée @fr

ship
type: Class
label: navire @fr

fish
label: poisson @fr
type: Class

tennis player
label: joueur de tennis @fr
type: Class

links to Baseball Player
sub property of: person
type: ObjectProperty
range: baseball player
comment: Relazione tra British Royalty e Baseball Player @it
domain: British royalty
comment: Relation between British Royalty and Baseball Player

video game
label: jeux vidéo @fr
type: Class

trade union
label: syndicat professionnel @fr
type: Class

currency
type: ObjectProperty
label: devise @fr
type: Class

British royalty
type: Class
label: royauté Britannique @fr

prime minister
type: Class
label: premier ministre @fr

Axiom
dbpedia infobox matching weight: 19.23
annotated target: before
annotated property: relatedMatch
annotated source: links to Military Person

historic place
label: site historique @fr
type: Class

hospital
label: hôpital @fr
type: Class

links to Senator
comment: Relazione tra British Royalty e Senator @it
sub property of: person
type: ObjectProperty
range: senator
comment: Relation between British Royalty and Senator
domain: British royalty

lunar crater
type: Class
label: cratère lunaire @fr

links to Book
type: NamedIndividual
related match: novels
domain: British royalty
comment: Relazione tra British Royalty e Book @it
range: book
type: ObjectProperty
sub property of: work
comment: Relation between British Royalty and Book

links to Scientist
related match: after
comment: Relazione tra British Royalty e Scientist @it
comment: Relation between British Royalty and Scientist
related match: issue
type: ObjectProperty
domain: British royalty
type: NamedIndividual
sub property of: person
range: scientist

links to Nascar Driver
comment: Relazione tra British Royalty e Nascar Driver @it
type: ObjectProperty
sub property of: person
range: nascar driver
comment: Relation between British Royalty and Nascar Driver
domain: British royalty

links to Film Festival
domain: British royalty
comment: Relazione tra British Royalty e Film Festival @it
sub property of: event
comment: Relation between British Royalty and Film Festival
type: ObjectProperty
range: film festival

links to Mollusca
domain: British royalty
sub property of: species
comment: Relation between British Royalty and Mollusca
type: ObjectProperty
comment: Relazione tra British Royalty e Mollusca @it
range: mollusca

continent
label: ήπειρος @el
type: Class

links to Mayor
comment: Relation between British Royalty and Mayor
domain: British royalty
sub property of: person
range: mayor
comment: Relazione tra British Royalty e Mayor @it
type: ObjectProperty

album
label: Album @de
type: Class

president
type: Class
label: président @fr

figure skater
label: patineur artistique @fr
type: Class

links to Species
range: species
comment: Relazione tra British Royalty e Species @it
domain: British royalty
comment: Relation between British Royalty and Species
sub property of: species
type: ObjectProperty

links to Music Genre
sub property of: music genre
comment: Relazione tra British Royalty e Music Genre @it
comment: Relation between British Royalty and Music Genre
domain: British royalty
type: ObjectProperty
range: music genre

Axiom
dbpedia infobox matching weight: 33.33
annotated target: before
annotated source: links to Prime Minister
annotated property: relatedMatch

Axiom
dbpedia infobox matching weight: 3.85
annotated property: relatedMatch
annotated target: father
annotated source: links to Military Person

Axiom
dbpedia infobox matching weight: 50.0
annotated property: relatedMatch
annotated target: after
annotated source: links to Scientist

links to College
comment: Relation between British Royalty and College
sub property of: organização
domain: British royalty
comment: Relazione tra British Royalty e College @it
range: college
type: ObjectProperty

person
label: Person @de
type: ObjectProperty
label: pessoa @pt
label: personne @fr

links to Beverage
domain: British royalty
range: beverage
sub property of: beverage
type: ObjectProperty
comment: Relazione tra British Royalty e Beverage @it
comment: Relation between British Royalty and Beverage

links to Comedian
type: ObjectProperty
comment: Relazione tra British Royalty e Comedian @it
sub property of: person
range: comedian
comment: Relation between British Royalty and Comedian
domain: British royalty

military unit
label: unité militaire @fr
type: Class

soccer manager
type: Class
label: entraîneur de football @fr

Axiom
dbpedia infobox matching weight: 50.0
annotated target: before
annotated source: links to Governor
annotated property: relatedMatch

links to Website
sub property of: website
domain: British royalty
comment: Relazione tra British Royalty e Website @it
range: website
comment: Relation between British Royalty and Website
type: ObjectProperty

links to Lunar Crater
type: ObjectProperty
sub property of: place
comment: Relation between British Royalty and Lunar Crater
range: lunar crater
domain: British royalty
comment: Relazione tra British Royalty e Lunar Crater @it

links to Video Game
comment: Relazione tra British Royalty e Video Game @it
sub property of: work
range: video game
type: ObjectProperty
comment: Relation between British Royalty and Video Game
domain: British royalty

links to Congressman
comment: Relation between British Royalty and Congressman
sub property of: person
domain: British royalty
range: congressman
type: ObjectProperty
comment: Relazione tra British Royalty e Congressman @it

music genre
label: genre musical @fr
type: ObjectProperty
label: género musical @pt
type: Class

writer
type: Class
label: écrivain @fr

architect
label: architecte @fr
type: Class

model
type: Class
label: mannequin @fr

ambassador
type: Class
label: ambassadeur @fr

olympic result
label: résultat de Jeux Olympiques @fr
type: Class
type: ObjectProperty

crustacean
type: Class
label: crustacés @fr

links to Rugby Player
sub property of: person
range: rugby player
type: ObjectProperty
domain: British royalty
comment: Relazione tra British Royalty e Rugby Player @it
comment: Relation between British Royalty and Rugby Player

links to Legislature
comment: Relazione tra British Royalty e Legislature @it
comment: Relation between British Royalty and Legislature
domain: British royalty
range: legislature
type: ObjectProperty
sub property of: organização

Axiom
dbpedia infobox matching weight: 7.69
annotated target: spouse
annotated source: links to Military Person
annotated property: relatedMatch

Axiom
dbpedia infobox matching weight: 100.0
annotated property: relatedMatch
annotated target: issue
annotated source: links to Christian Bishop

Axiom
dbpedia infobox matching weight: 7.14
annotated target: next
annotated source: links to President
annotated property: relatedMatch

film festival
type: Class
label: festival du film @fr

BritishRoyalty.owl
has intent: To represent the encyclopedic knowledge expressed by an object typed as BritishRoyalty
comment: BritishRoyalty Encyclopedic Knowledge Pattern
has author: Aldo Gangemi
has author: Andrea Giovanni Nuzzolese
imports: dbpediainfoboxmatchingweight.owl
has author: Valentina Presutti
type: Ontology
extracted from: en.wikipedia.org
extracted from: dbpedia.org
imports: cpannotationschema.owl

links to Music Festival
range: music festival
comment: Relazione tra British Royalty e Music Festival @it
domain: British royalty
type: ObjectProperty
comment: Relation between British Royalty and Music Festival
sub property of: event

links to Television Episode
comment: Relation between British Royalty and Television Episode
sub property of: work
range: television episode
comment: Relazione tra British Royalty e Television Episode @it
type: ObjectProperty
domain: British royalty

Axiom
dbpedia infobox matching weight: 100.0
annotated target: spouse
annotated property: relatedMatch
annotated source: links to Writer

links to Non- Profit Organisation
type: ObjectProperty
range: non-profit organisation
domain: British royalty
comment: Relation between British Royalty and Non- Profit Organisation
comment: Relazione tra British Royalty e Non- Profit Organisation @it
sub property of: organização

Grand Prix
label: grand prix @fr
type: Class

links to Governor
type: ObjectProperty
domain: British royalty
type: NamedIndividual
comment: Relazione tra British Royalty e Governor @it
comment: Relation between British Royalty and Governor
related match: issue
sub property of: person
related match: before
range: governor

chancellor
label: chancelier @fr
type: Class

comics creator
type: Class
label: créateur de bandes dessinées @fr

aircraft
label: avion @fr
type: Class
label: αεροσκάφος @el

links to President
related match: primeMinisters
range: president
related match: reason
related match: next
comment: Relation between British Royalty and President
related match: after
comment: Relazione tra British Royalty e President @it
type: ObjectProperty
domain: British royalty
related match: issue
sub property of: person
related match: before
type: NamedIndividual

links to Historic Place
sub property of: place
comment: Relazione tra British Royalty e Historic Place @it
comment: Relation between British Royalty and Historic Place
domain: British royalty
range: historic place
type: ObjectProperty

links to Trade Union
type: ObjectProperty
comment: Relazione tra British Royalty e Trade Union @it
range: trade union
domain: British royalty
sub property of: organização
comment: Relation between British Royalty and Trade Union

Axiom
dbpedia infobox matching weight: 26.32
annotated target: after
annotated property: relatedMatch
annotated source: links to Saint

links to Reptile
comment: Relazione tra British Royalty e Reptile @it
type: ObjectProperty
sub property of: species
domain: British royalty
comment: Relation between British Royalty and Reptile
range: reptile

soccer player
type: Class
label: joueur de football @fr

links to Aircraft
sub property of: mean of transportation
comment: Relazione tra British Royalty e Aircraft @it
type: ObjectProperty
domain: British royalty
comment: Relation between British Royalty and Aircraft
range: aircraft

reptile
type: Class

legislature
type: Class
label: pouvoir législatif @fr

Axiom
dbpedia infobox matching weight: 34.62
annotated source: links to Military Person
annotated property: relatedMatch
annotated target: issue

Axiom
dbpedia infobox matching weight: 100.0
annotated source: links to Military Unit
annotated target: title
annotated property: relatedMatch

airline
type: Class
label: compagnie aérienne @fr

links to Hospital
comment: Relation between British Royalty and Hospital
type: ObjectProperty
sub property of: place
comment: Relazione tra British Royalty e Hospital @it
domain: British royalty
range: hospital

congressman
label: membre du Congrès @fr
type: Class

activity
label: activité @fr
label: Aktivität @de
type: ObjectProperty

nascar driver
type: Class
label: pilote de la nascar @fr

journalist
type: Class
label: journaliste @fr

links to Writer
comment: Relation between British Royalty and Writer
sub property of: person
range: writer
comment: Relazione tra British Royalty e Writer @it
domain: British royalty
type: ObjectProperty
related match: spouse
type: NamedIndividual

links to Game
sub property of: activity
type: ObjectProperty
domain: British royalty
comment: Relation between British Royalty and Game
range: game
comment: Relazione tra British Royalty e Game @it

insect
type: Class
label: insecte @fr

links to Album
type: ObjectProperty
range: album
sub property of: work
domain: British royalty
comment: Relazione tra British Royalty e Album @it
comment: Relation between British Royalty and Album

film
label: ταινία @el
type: Class

Axiom
dbpedia infobox matching weight: 100.0
annotated source: links to University
annotated property: relatedMatch
annotated target: title

links to Hotel
range: hotel
sub property of: place
domain: British royalty
comment: Relazione tra British Royalty e Hotel @it
type: ObjectProperty
comment: Relation between British Royalty and Hotel

links to Mountain
comment: Relazione tra British Royalty e Mountain @it
domain: British royalty
sub property of: place
comment: Relation between British Royalty and Mountain
range: mountain
type: ObjectProperty

Axiom
dbpedia infobox matching weight: 16.67
annotated target: after
annotated source: links to Prime Minister
annotated property: relatedMatch

Axiom
dbpedia infobox matching weight: 50.0
annotated property: relatedMatch
annotated target: issue
annotated source: links to Governor

links to Award
domain: British royalty
range: award
type: ObjectProperty
comment: Relation between British Royalty and Award
comment: Relazione tra British Royalty e Award @it
sub property of: award

links to Television Show
comment: Relation between British Royalty and Television Show
range: television show
domain: British royalty
sub property of: work
comment: Relazione tra British Royalty e Television Show @it
type: ObjectProperty

links to Single
range: single
comment: Relazione tra British Royalty e Single @it
sub property of: work
comment: Relation between British Royalty and Single
type: ObjectProperty
domain: British royalty

links to Adult Actor
comment: Relazione tra British Royalty e Adult Actor @it
domain: British royalty
type: ObjectProperty
range: adult actor
comment: Relation between British Royalty and Adult Actor
sub property of: person

links to Artery
comment: Relation between British Royalty and Artery
sub property of: anatomical structure
comment: Relazione tra British Royalty e Artery @it
domain: British royalty
range: artery
type: ObjectProperty

links to Bird
sub property of: species
comment: Relation between British Royalty and Bird
range: bird
domain: British royalty
comment: Relazione tra British Royalty e Bird @it
type: ObjectProperty

Axiom
dbpedia infobox matching weight: 100.0
annotated property: relatedMatch
annotated target: novels
annotated source: links to Book

chemical compound
label: produit chimique @fr
type: ObjectProperty
type: Class

bird
type: Class
label: oiseau @fr

links to Shopping Mall
type: ObjectProperty
sub property of: place
range: shopping mall
domain: British royalty
comment: Relazione tra British Royalty e Shopping Mall @it
comment: Relation between British Royalty and Shopping Mall

links to Military Unit
type: NamedIndividual
related match: title
domain: British royalty
comment: Relazione tra British Royalty e Military Unit @it
type: ObjectProperty
range: military unit
sub property of: organização
comment: Relation between British Royalty and Military Unit

links to Colour
domain: British royalty
comment: Relazione tra British Royalty e Colour @it
type: ObjectProperty
range: colour
sub property of: colour
comment: Relation between British Royalty and Colour

links to Grand Prix
sub property of: event
domain: British royalty
comment: Relation between British Royalty and Grand Prix
range: Grand Prix
comment: Relazione tra British Royalty e Grand Prix @it
type: ObjectProperty

links to Election
sub property of: event
type: ObjectProperty
range: Election
comment: Relazione tra British Royalty e Election @it
domain: British royalty
comment: Relation between British Royalty and Election

musical artist
label: artista musical @pt
type: Class
label: musicien @fr

fern
label: fougères @fr
type: Class

links to Band
comment: Relazione tra British Royalty e Band @it
domain: British royalty
sub property of: organização
type: ObjectProperty
comment: Relation between British Royalty and Band
range: Band

park
type: Class
label: parc @fr

links to Soccer Manager
sub property of: person
type: ObjectProperty
domain: British royalty
comment: Relation between British Royalty and Soccer Manager
comment: Relazione tra British Royalty e Soccer Manager @it
range: soccer manager

cardinal
type: Class

rugby player
type: Class
label: joueur de rugby @fr

links to Airline
comment: Relazione tra British Royalty e Airline @it
domain: British royalty
type: ObjectProperty
comment: Relation between British Royalty and Airline
range: airline
sub property of: organização

links to World Heritage Site
comment: Relazione tra British Royalty e World Heritage Site @it
type: ObjectProperty
sub property of: place
comment: Relation between British Royalty and World Heritage Site
domain: British royalty
range: World Heritage Site
related match: placeOfBurial
type: NamedIndividual

links to Skyscraper
sub property of: place
range: skyscraper
comment: Relazione tra British Royalty e Skyscraper @it
domain: British royalty
type: ObjectProperty
comment: Relation between British Royalty and Skyscraper

links to Olympic Result
range: olympic result
domain: British royalty
sub property of: olympic result
comment: Relazione tra British Royalty e Olympic Result @it
comment: Relation between British Royalty and Olympic Result
type: ObjectProperty

links to Road
range: road
type: ObjectProperty
comment: Relation between British Royalty and Road
domain: British royalty
sub property of: infrastructure
comment: Relazione tra British Royalty e Road @it

musical
type: Class
label: musique @fr

Axiom
dbpedia infobox matching weight: 7.14
annotated source: links to President
annotated property: relatedMatch
annotated target: reason

links to Newspaper
domain: British royalty
type: ObjectProperty
comment: Relation between British Royalty and Newspaper
sub property of: work
range: newspaper
comment: Relazione tra British Royalty e Newspaper @it

links to Cricketer
comment: Relazione tra British Royalty e Cricketer @it
domain: British royalty
sub property of: person
comment: Relation between British Royalty and Cricketer
range: cricketer
type: ObjectProperty

place
label: lugar @pt
label: lieu @fr
label: περιοχή @el
type: ObjectProperty

links to Museum
type: ObjectProperty
comment: Relazione tra British Royalty e Museum @it
domain: British royalty
sub property of: place
range: museum
comment: Relation between British Royalty and Museum

links to Island
comment: Relazione tra British Royalty e Island @it
type: ObjectProperty
range: island
domain: British royalty
comment: Relation between British Royalty and Island
sub property of: place

infrastructure
type: ObjectProperty

links to Formula One Racer
comment: Relazione tra British Royalty e Formula One Racer @it
domain: British royalty
type: ObjectProperty
range: Formula One racer
sub property of: person
comment: Relation between British Royalty and Formula One Racer

mountain
type: Class
label: montagne @fr
label: Βουνό @el

links to Planet
comment: Relazione tra British Royalty e Planet @it
range: planet
comment: Relation between British Royalty and Planet
sub property of: planet
type: ObjectProperty
domain: British royalty

links to Insect
comment: Relation between British Royalty and Insect
sub property of: species
comment: Relazione tra British Royalty e Insect @it
domain: British royalty
type: ObjectProperty
range: insect

criminal
label: criminel @fr
type: Class

links to Station
domain: British royalty
sub property of: place
type: ObjectProperty
comment: Relation between British Royalty and Station
comment: Relazione tra British Royalty e Station @it
range: station

senator
type: Class
label: sénateur @fr

links to Soccer Club
range: soccer club
domain: British royalty
sub property of: organização
comment: Relazione tra British Royalty e Soccer Club @it
comment: Relation between British Royalty and Soccer Club
type: ObjectProperty

saint
type: Class

Axiom
dbpedia infobox matching weight: 14.29
annotated target: issue
annotated property: relatedMatch
annotated source: links to President

links to Musical Artist
range: musical artist
domain: British royalty
type: ObjectProperty
comment: Relazione tra British Royalty e Musical Artist @it
sub property of: person
comment: Relation between British Royalty and Musical Artist

valley
type: Class
label: vallée @fr

comedian
type: Class
label: comédien @fr

links to Weapon
range: weapon
sub property of: device
comment: Relazione tra British Royalty e Weapon @it
domain: British royalty
comment: Relation between British Royalty and Weapon
type: ObjectProperty

links to Ethnic Group
range: ethnic group
sub property of: ethnic group
comment: Relation between British Royalty and Ethnic Group
type: ObjectProperty
comment: Relazione tra British Royalty e Ethnic Group @it
domain: British royalty

links to Magazine
domain: British royalty
range: magazine
comment: Relation between British Royalty and Magazine
comment: Relazione tra British Royalty e Magazine @it
type: ObjectProperty
sub property of: work

links to Park
domain: British royalty
comment: Relazione tra British Royalty e Park @it
comment: Relation between British Royalty and Park
range: park
type: ObjectProperty
sub property of: place

book
label: książka @pl
label: llibre @ca
label: βιβλίο @el
label: livre @fr
type: Class

links to Pope
domain: British royalty
comment: Relazione tra British Royalty e Pope @it
sub property of: person
type: ObjectProperty
range: pope
comment: Relation between British Royalty and Pope

device
type: ObjectProperty
label: appareil @fr

shopping mall
type: Class
label: centre commercial @fr

ski area
type: Class
label: domaine skiable @fr

space station
type: Class
label: station spatiale @fr

non-profit organisation
type: Class
label: organisation à but non lucratif @fr

links to Member Of Parliament
comment: Relazione tra British Royalty e Member Of Parliament @it
comment: Relation between British Royalty and Member Of Parliament
type: ObjectProperty
sub property of: person
domain: British royalty
range: member of parliament

links to Military Person
related match: father
range: military person
related match: issue
comment: Relation between British Royalty and Military Person
related match: before
related match: after
domain: British royalty
sub property of: person
type: ObjectProperty
related match: spouse
comment: Relazione tra British Royalty e Military Person @it
type: NamedIndividual

mollusca
label: mollusque @fr
type: Class

links to Fern
comment: Relation between British Royalty and Fern
comment: Relazione tra British Royalty e Fern @it
domain: British royalty
range: fern
sub property of: species
type: ObjectProperty

links to Olympics
comment: Relation between British Royalty and Olympics
domain: British royalty
range: olympics
comment: Relazione tra British Royalty e Olympics @it
sub property of: event
type: ObjectProperty
type: NamedIndividual
related match: years

wine region
label: région viticole @fr
type: Class

links to Protected Area
domain: British royalty
sub property of: place
type: ObjectProperty
comment: Relazione tra British Royalty e Protected Area @it
range: protected area
comment: Relation between British Royalty and Protected Area

weapon
type: Class
label: arme @fr

links to Soccer League
range: soccer league
domain: British royalty
comment: Relation between British Royalty and Soccer League
comment: Relazione tra British Royalty e Soccer League @it
sub property of: organização
type: ObjectProperty

drug
type: ObjectProperty
label: médicament @fr
type: Class

links to Ice Hockey League
type: ObjectProperty
sub property of: organização
domain: British royalty
comment: Relazione tra British Royalty e Ice Hockey League @it
comment: Relation between British Royalty and Ice Hockey League
range: ice hockey league

magazine
type: Class
label: περιοδικό @el

canal
type: Class

military person
label: militaire @fr
type: Class

philosopher
label: philosophe @fr
type: Class

award
type: ObjectProperty
label: récompense @fr
type: Class

links to Space Station
type: ObjectProperty
domain: British royalty
range: space station
sub property of: mean of transportation
comment: Relation between British Royalty and Space Station
comment: Relazione tra British Royalty e Space Station @it

links to Christian Bishop
related match: issue
type: NamedIndividual
domain: British royalty
sub property of: person
range: Christian Bishop
comment: Relazione tra British Royalty e Christian Bishop @it
comment: Relation between British Royalty and Christian Bishop
type: ObjectProperty

college
type: Class

anatomical structure
label: structure anatomique @fr
type: ObjectProperty

sport
type: Class

cricketer
label: joueur de cricket @fr
type: Class

single
type: Class

links to Sport
comment: Relazione tra British Royalty e Sport @it
sub property of: activity
range: sport
domain: British royalty
comment: Relation between British Royalty and Sport
type: ObjectProperty

Band
label: groupe de musique @fr
type: Class
label: Musikgruppe @de
label: banda @pt

links to Tennis Player
range: tennis player
comment: Relazione tra British Royalty e Tennis Player @it
sub property of: person
type: ObjectProperty
domain: British royalty
comment: Relation between British Royalty and Tennis Player

links to Chancellor
range: chancellor
sub property of: person
comment: Relazione tra British Royalty e Chancellor @it
comment: Relation between British Royalty and Chancellor
type: ObjectProperty
domain: British royalty

university
type: Class
label: université @fr
label: πανεπιστήμιο @el

links to Ship
type: ObjectProperty
sub property of: mean of transportation
range: ship
domain: British royalty
comment: Relation between British Royalty and Ship
comment: Relazione tra British Royalty e Ship @it

ethnic group
type: Class
type: ObjectProperty
label: groupe ethnique @fr

links to University
type: NamedIndividual
related match: title
type: ObjectProperty
domain: British royalty
comment: Relation between British Royalty and University
comment: Relazione tra British Royalty e University @it
range: university
sub property of: organização

links to Film
domain: British royalty
range: film
comment: Relazione tra British Royalty e Film @it
type: ObjectProperty
comment: Relation between British Royalty and Film
sub property of: work

artery
label: artère @fr
type: Class
label: Arterie @de

links to Fish
domain: British royalty
comment: Relazione tra British Royalty e Fish @it
type: ObjectProperty
range: fish
comment: Relation between British Royalty and Fish
sub property of: species

hotel
type: Class
label: hôtel @fr

music festival
label: festival de musique @fr
type: Class

television episode
type: Class
label: épisode télévisé @fr

links to Journalist
comment: Relation between British Royalty and Journalist
domain: British royalty
comment: Relazione tra British Royalty e Journalist @it
type: ObjectProperty
range: journalist
sub property of: person

links to Bone
type: ObjectProperty
domain: British royalty
comment: Relazione tra British Royalty e Bone @it
sub property of: anatomical structure
range: bone
comment: Relation between British Royalty and Bone

village
label: χωριό @el
type: Class

ice hockey league
type: Class
label: ligue d'hockey sur glace @fr

links to Mammal
domain: British royalty
comment: Relazione tra British Royalty e Mammal @it
range: mammal
type: ObjectProperty
comment: Relation between British Royalty and Mammal
sub property of: species

Axiom
dbpedia infobox matching weight: 16.67
annotated target: successor
annotated property: relatedMatch
annotated source: links to Prime Minister

soccer club
label: club de football @fr
type: Class

historic building
label: bâtiment historique @fr
type: Class

links to Conifer
comment: Relazione tra British Royalty e Conifer @it
sub property of: species
domain: British royalty
range: conifer
type: ObjectProperty
comment: Relation between British Royalty and Conifer

baseball player
label: joueur de baseball @fr
type: Class

grape
label: raisin @fr
type: Class

website
label: site web @fr
label: Ιστότοπος @el
type: Class
type: ObjectProperty

links to River
type: ObjectProperty
range: river
comment: Relation between British Royalty and River
sub property of: place
comment: Relazione tra British Royalty e River @it
domain: British royalty

links to Judge
comment: Relazione tra British Royalty e Judge @it
domain: British royalty
sub property of: person
range: judge
comment: Relation between British Royalty and Judge
type: ObjectProperty

links to Ginkgo
domain: British royalty
type: ObjectProperty
sub property of: species
comment: Relation between British Royalty and Ginkgo
comment: Relazione tra British Royalty e Ginkgo @it
range: ginkgo

adult actor
label: acteur adulte @fr
type: Class
label: erwachsener Schauspieler @de

Axiom
dbpedia infobox matching weight: 15.79
annotated source: links to Saint
annotated property: relatedMatch
annotated target: before

links to Radio Station
type: ObjectProperty
comment: Relazione tra British Royalty e Radio Station @it
domain: British royalty
range: radio station
comment: Relation between British Royalty and Radio Station
sub property of: organização

Christian Bishop
label: évêque chrétien @fr
type: Class

mountain range
type: Class
label: chaîne de montagne @fr

beverage
label: boisson @fr
type: Class
type: ObjectProperty

links to Valley
range: valley
domain: British royalty
sub property of: place
type: ObjectProperty
comment: Relazione tra British Royalty e Valley @it
comment: Relation between British Royalty and Valley

planet
type: Class
label: planète @fr
type: ObjectProperty

links to Figure Skater
type: ObjectProperty
comment: Relazione tra British Royalty e Figure Skater @it
domain: British royalty
sub property of: person
comment: Relation between British Royalty and Figure Skater
range: figure skater

scientist
label: scientifique @fr
label: Wissenschaftler @de
type: Class

links to Broadcast
type: ObjectProperty
sub property of: organização
range: broadcast
comment: Relazione tra British Royalty e Broadcast @it
domain: British royalty
comment: Relation between British Royalty and Broadcast

olympics
label: Jeux Olympiques @fr
type: Class

organização
type: ObjectProperty
label: organisation
label: Organisation @de

links to Cardinal
comment: Relation between British Royalty and Cardinal
sub property of: person
range: cardinal
domain: British royalty
comment: Relazione tra British Royalty e Cardinal @it
type: ObjectProperty

bridge
label: pont @fr
type: Class

links to Model
type: ObjectProperty
range: model
sub property of: person
domain: British royalty
comment: Relation between British Royalty and Model
comment: Relazione tra British Royalty e Model @it

links to Village
domain: British royalty
range: village
comment: Relation between British Royalty and Village
type: ObjectProperty
comment: Relazione tra British Royalty e Village @it
sub property of: place

broadcast
label: Émission de télévision @fr
type: Class

mammal
label: mammifère @fr
type: Class

links to Musical
range: musical
domain: British royalty
sub property of: work
comment: Relazione tra British Royalty e Musical @it
type: ObjectProperty
comment: Relation between British Royalty and Musical

island
label: île @fr
label: νησί @el
type: Class

comics character
label: personnage de bandes dessinées @fr
type: Class

event
type: ObjectProperty
label: évènement @fr

Formula One racer
type: Class
label: pilote de formule 1 @fr

skyscraper
type: Class
label: gratte-ciel @fr

radio station
type: Class
label: station de radio @fr

member of parliament
label: membre du Parlement @fr
type: Class

links to Wine Region
range: wine region
comment: Relazione tra British Royalty e Wine Region @it
comment: Relation between British Royalty and Wine Region
sub property of: place
domain: British royalty
type: ObjectProperty

bone
type: Class
label: Knochen @de
label: os @fr

links to Bridge
range: bridge
comment: Relation between British Royalty and Bridge
domain: British royalty
sub property of: place
type: ObjectProperty
comment: Relazione tra British Royalty e Bridge @it

links to Mountain Range
type: ObjectProperty
comment: Relation between British Royalty and Mountain Range
sub property of: place
range: mountain range
domain: British royalty
comment: Relazione tra British Royalty e Mountain Range @it

links to Soccer Player
type: ObjectProperty
domain: British royalty
sub property of: person
comment: Relazione tra British Royalty e Soccer Player @it
range: soccer player
comment: Relation between British Royalty and Soccer Player

conifer
label: conifères @fr
type: Class

links to Architect
range: architect
comment: Relation between British Royalty and Architect
comment: Relazione tra British Royalty e Architect @it
sub property of: person
type: ObjectProperty
domain: British royalty

airport
type: Class
label: Flughafen @de
label: aéroport @fr

links to Prime Minister
type: ObjectProperty
type: NamedIndividual
comment: Relation between British Royalty and Prime Minister
domain: British royalty
comment: Relazione tra British Royalty e Prime Minister @it
related match: predecessor
related match: after
range: prime minister
related match: before
sub property of: person
related match: successor