links to Colour
sub property of: colour
comment: Relazione tra College Coach e Colour @it
comment: Relation between College Coach and Colour
type: ObjectProperty
range: colour
domain: college coach
related match: coachteams
type: NamedIndividual

links to River
domain: college coach
range: river
comment: Relazione tra College Coach e River @it
type: ObjectProperty
sub property of: place
comment: Relation between College Coach and River

links to Television Episode
comment: Relazione tra College Coach e Television Episode @it
domain: college coach
comment: Relation between College Coach and Television Episode
type: ObjectProperty
sub property of: work
range: television episode

television show
label: émission de télévision @fr
type: Class

Axiom
dbpedia infobox matching weight: 100.0
annotated property: relatedMatch
annotated target: championships
annotated source: links to Basketball League

disease
type: ObjectProperty
type: Class
label: maladie @fr

links to Video Game
sub property of: work
comment: Relation between College Coach and Video Game
type: ObjectProperty
range: video game
comment: Relazione tra College Coach e Video Game @it
domain: college coach

colour
type: Class
label: couleur @fr
label: χρώμα @el
type: ObjectProperty

automobile
type: Class

links to Ethnic Group
comment: Relazione tra College Coach e Ethnic Group @it
sub property of: ethnic group
domain: college coach
type: ObjectProperty
range: ethnic group
comment: Relation between College Coach and Ethnic Group

links to Beverage
domain: college coach
type: ObjectProperty
comment: Relation between College Coach and Beverage
comment: Relazione tra College Coach e Beverage @it
sub property of: beverage
range: beverage

Election
type: Class
label: élection @fr

links to Journalist
type: ObjectProperty
range: journalist
comment: Relation between College Coach and Journalist
sub property of: person
comment: Relazione tra College Coach e Journalist @it
domain: college coach

links to Hospital
comment: Relation between College Coach and Hospital
type: ObjectProperty
sub property of: place
domain: college coach
range: hospital
comment: Relazione tra College Coach e Hospital @it

links to Military Person
sub property of: person
comment: Relazione tra College Coach e Military Person @it
type: ObjectProperty
comment: Relation between College Coach and Military Person
range: military person
domain: college coach
type: NamedIndividual
related match: after

Axiom
dbpedia infobox matching weight: 66.67
annotated source: links to Canadian Football League
annotated property: relatedMatch
annotated target: team

mean of transportation
type: ObjectProperty
label: moyen de transport @fr

Legal Case
label: cas juridique @fr
type: ObjectProperty

stadium
type: Class
label: stade @fr

soccer league
label: ligue de football @fr
type: Class

links to Fungus
sub property of: species
comment: Relation between College Coach and Fungus
type: ObjectProperty
range: fungus
comment: Relazione tra College Coach e Fungus @it
domain: college coach

astronaut
type: Class
label: Astronaut @de
label: astronaute @fr

links to Olympic Result
range: olympic result
domain: college coach
sub property of: olympic result
comment: Relation between College Coach and Olympic Result
comment: Relazione tra College Coach e Olympic Result @it
type: ObjectProperty

wrestler
label: lutteur @fr
type: Class

mayor
type: Class
label: maire @fr

Axiom
dbpedia infobox matching weight: 100.0
annotated property: relatedMatch
annotated source: links to Astronaut
annotated target: before

links to Film
type: ObjectProperty
range: film
comment: Relation between College Coach and Film
domain: college coach
comment: Relazione tra College Coach e Film @it
sub property of: work

links to Mammal
domain: college coach
comment: Relazione tra College Coach e Mammal @it
type: ObjectProperty
sub property of: species
comment: Relation between College Coach and Mammal
range: mammal

links to Airport
range: airport
domain: college coach
comment: Relazione tra College Coach e Airport @it
sub property of: place
type: ObjectProperty
comment: Relation between College Coach and Airport
type: NamedIndividual
related match: coachteams

links to World Heritage Site
sub property of: place
type: ObjectProperty
range: World Heritage Site
comment: Relation between College Coach and World Heritage Site
comment: Relazione tra College Coach e World Heritage Site @it
domain: college coach

species
type: ObjectProperty
label: espèce @fr

links to Airline
range: airline
sub property of: organização
comment: Relation between College Coach and Airline
type: ObjectProperty
comment: Relazione tra College Coach e Airline @it
domain: college coach

links to Soccer Player
type: ObjectProperty
domain: college coach
sub property of: person
comment: Relation between College Coach and Soccer Player
range: soccer player
comment: Relazione tra College Coach e Soccer Player @it

links to Television Show
comment: Relation between College Coach and Television Show
domain: college coach
range: television show
sub property of: work
type: ObjectProperty
comment: Relazione tra College Coach e Television Show @it

links to Drug
domain: college coach
comment: Relation between College Coach and Drug
comment: Relazione tra College Coach e Drug @it
sub property of: drug
range: drug
type: ObjectProperty

Axiom
dbpedia infobox matching weight: 88.89
annotated source: links to Historic Place
annotated target: coachteams
annotated property: relatedMatch

links to Soccer League
domain: college coach
range: soccer league
comment: Relation between College Coach and Soccer League
type: ObjectProperty
sub property of: organização
comment: Relazione tra College Coach e Soccer League @it

newspaper
type: Class
label: journal @fr

protected area
type: Class
label: προστατευμένη περιοχή @el
label: aire protégée @fr

road
type: Class
label: route @fr

boxer
type: Class
label: boxeur @fr

links to Award
comment: Relazione tra College Coach e Award @it
comment: Relation between College Coach and Award
sub property of: award
range: award
type: ObjectProperty
domain: college coach
type: NamedIndividual
related match: awards

links to Softball League
type: ObjectProperty
comment: Relazione tra College Coach e Softball League @it
domain: college coach
sub property of: organização
range: softball league
comment: Relation between College Coach and Softball League

World Heritage Site
type: Class
label: site du patrimoine mondial @fr

CollegeCoach.owl
has author: Andrea Giovanni Nuzzolese
has author: Aldo Gangemi
imports: dbpediainfoboxmatchingweight.owl
type: Ontology
has author: Valentina Presutti
extracted from: dbpedia.org
has intent: To represent the encyclopedic knowledge expressed by an object typed as CollegeCoach
comment: CollegeCoach Encyclopedic Knowledge Pattern
extracted from: en.wikipedia.org
imports: cpannotationschema.owl

links to Disease
type: ObjectProperty
range: disease
comment: Relation between College Coach and Disease
domain: college coach
comment: Relazione tra College Coach e Disease @it
sub property of: disease

language
type: Class
label: langage @fr
type: ObjectProperty

tennis league
type: Class
label: ligue de tennis @fr

links to Website
sub property of: website
comment: Relation between College Coach and Website
domain: college coach
range: website
comment: Relazione tra College Coach e Website @it
type: ObjectProperty

links to Book
sub property of: work
range: book
comment: Relation between College Coach and Book
type: ObjectProperty
comment: Relazione tra College Coach e Book @it
domain: college coach

lake
type: Class
label: lac @fr

Axiom
dbpedia infobox matching weight: 100.0
annotated property: relatedMatch
annotated source: links to Military Unit
annotated target: unit

governor
label: gouverneur @fr
type: Class

poker player
label: joueur de poker @fr
type: Class

work
type: ObjectProperty
label: travail @fr
label: obra @pt

river
type: Class
label: rivière @fr

links to Protected Area
type: ObjectProperty
comment: Relation between College Coach and Protected Area
sub property of: place
domain: college coach
comment: Relazione tra College Coach e Protected Area @it
range: protected area

links to Senator
type: ObjectProperty
range: senator
sub property of: person
domain: college coach
comment: Relation between College Coach and Senator
comment: Relazione tra College Coach e Senator @it

lacrosse league
type: Class
label: ligue de crosse @fr

ship
type: Class
label: navire @fr

museum
type: Class
label: musée @fr

tennis player
type: Class
label: joueur de tennis @fr

links to Ski Area
comment: Relation between College Coach and Ski Area
domain: college coach
range: ski area
type: ObjectProperty
comment: Relazione tra College Coach e Ski Area @it
sub property of: place

video game
label: jeux vidéo @fr
type: Class

links to Canadian Football Team
type: ObjectProperty
related match: coachteams
domain: college coach
comment: Relation between College Coach and Canadian Football Team
related match: team
type: NamedIndividual
comment: Relazione tra College Coach e Canadian Football Team @it
range: canadian football team
sub property of: organização

trade union
type: Class
label: syndicat professionnel @fr

currency
type: ObjectProperty
type: Class
label: devise @fr

links to Ice Hockey League
range: ice hockey league
type: ObjectProperty
comment: Relazione tra College Coach e Ice Hockey League @it
sub property of: organização
domain: college coach
comment: Relation between College Coach and Ice Hockey League

links to Astronaut
related match: before
type: NamedIndividual
range: astronaut
sub property of: person
comment: Relazione tra College Coach e Astronaut @it
type: ObjectProperty
comment: Relation between College Coach and Astronaut
domain: college coach

historic place
type: Class
label: site historique @fr

softball league
type: Class
label: ligue de softball @fr

hospital
label: hôpital @fr
type: Class

links to Ship
comment: Relation between College Coach and Ship
domain: college coach
comment: Relazione tra College Coach e Ship @it
sub property of: mean of transportation
type: ObjectProperty
range: ship

links to Scientist
comment: Relazione tra College Coach e Scientist @it
sub property of: person
comment: Relation between College Coach and Scientist
range: scientist
type: ObjectProperty
domain: college coach
related match: after
type: NamedIndividual

links to Supreme Court Of The United States Case
comment: Relazione tra College Coach e Supreme Court Of The United States Case @it
range: Supreme Court of the United States case
domain: college coach
sub property of: Legal Case
comment: Relation between College Coach and Supreme Court Of The United States Case
type: ObjectProperty

Axiom
dbpedia infobox matching weight: 25.0
annotated target: before
annotated property: relatedMatch
annotated source: links to Basketball Player

links to Automobile
type: ObjectProperty
sub property of: mean of transportation
comment: Relation between College Coach and Automobile
domain: college coach
comment: Relazione tra College Coach e Automobile @it
range: automobile

continent
label: ήπειρος @el
type: Class

president
label: président @fr
type: Class

links to Poker Player
comment: Relazione tra College Coach e Poker Player @it
type: ObjectProperty
comment: Relation between College Coach and Poker Player
domain: college coach
range: poker player
sub property of: person

links to Boxer
range: boxer
comment: Relazione tra College Coach e Boxer @it
domain: college coach
sub property of: person
type: ObjectProperty
comment: Relation between College Coach and Boxer

Axiom
dbpedia infobox matching weight: 58.0
annotated source: links to American Football Team
annotated property: relatedMatch
annotated target: coachteams

person
label: Person @de
type: ObjectProperty
label: pessoa @pt
label: personne @fr

military unit
label: unité militaire @fr
type: Class

Axiom
dbpedia infobox matching weight: 100.0
annotated property: relatedMatch
annotated target: years
annotated source: links to Actor

soccer manager
type: Class
label: entraîneur de football @fr

links to Stadium
comment: Relazione tra College Coach e Stadium @it
type: ObjectProperty
comment: Relation between College Coach and Stadium
range: stadium
domain: college coach
sub property of: place

basketball team
type: Class

links to Philosopher
domain: college coach
sub property of: person
type: ObjectProperty
comment: Relazione tra College Coach e Philosopher @it
comment: Relation between College Coach and Philosopher
range: philosopher

canadian football team
label: équipe canadienne de football américain @fr
type: Class

Axiom
dbpedia infobox matching weight: 100.0
annotated property: relatedMatch
annotated source: links to National Collegiate Athletic Association Athlete
annotated target: after

Axiom
dbpedia infobox matching weight: 40.0
annotated property: relatedMatch
annotated target: team
annotated source: links to American Football League

writer
label: écrivain @fr
type: Class

olympic result
type: ObjectProperty
type: Class
label: résultat de Jeux Olympiques @fr

links to Canadian Football League
range: canadian football league
related match: team
comment: Relazione tra College Coach e Canadian Football League @it
comment: Relation between College Coach and Canadian Football League
domain: college coach
sub property of: organização
type: ObjectProperty
related match: coachteams
type: NamedIndividual

Axiom
dbpedia infobox matching weight: 100.0
annotated target: coachteams
annotated source: links to Colour
annotated property: relatedMatch

Axiom
dbpedia infobox matching weight: 100.0
annotated property: relatedMatch
annotated source: links to Scientist
annotated target: after

links to Governor
range: governor
comment: Relation between College Coach and Governor
type: ObjectProperty
comment: Relazione tra College Coach e Governor @it
domain: college coach
sub property of: person

Axiom
dbpedia infobox matching weight: 100.0
annotated target: awards
annotated property: relatedMatch
annotated source: links to Museum

links to Member Of Parliament
domain: college coach
range: member of parliament
type: ObjectProperty
comment: Relazione tra College Coach e Member Of Parliament @it
sub property of: person
comment: Relation between College Coach and Member Of Parliament

Axiom
dbpedia infobox matching weight: 100.0
annotated target: before
annotated property: relatedMatch
annotated source: links to Congressman

comics creator
label: créateur de bandes dessinées @fr
type: Class

aircraft
label: αεροσκάφος @el
type: Class
label: avion @fr

links to Basketball Player
comment: Relation between College Coach and Basketball Player
sub property of: person
domain: college coach
related match: before
range: basketball player
type: ObjectProperty
related match: after
type: NamedIndividual
comment: Relazione tra College Coach e Basketball Player @it

Axiom
dbpedia infobox matching weight: 22.58
annotated target: team
annotated property: relatedMatch
annotated source: links to Canadian Football Team

hockey team
label: équipe de hockey @fr
type: Class

links to Baseball League
domain: college coach
sub property of: organização
comment: Relazione tra College Coach e Baseball League @it
type: ObjectProperty
comment: Relation between College Coach and Baseball League
range: baseball league

Axiom
dbpedia infobox matching weight: 100.0
annotated target: after
annotated source: links to Writer
annotated property: relatedMatch

soccer player
type: Class
label: joueur de football @fr

reptile
type: Class

legislature
type: Class
label: pouvoir législatif @fr

links to Museum
comment: Relazione tra College Coach e Museum @it
range: museum
comment: Relation between College Coach and Museum
sub property of: place
domain: college coach
type: ObjectProperty
type: NamedIndividual
related match: awards

links to Mountain
comment: Relazione tra College Coach e Mountain @it
type: ObjectProperty
range: mountain
sub property of: place
domain: college coach
comment: Relation between College Coach and Mountain

Axiom
dbpedia infobox matching weight: 35.0
annotated source: links to American Football Team
annotated property: relatedMatch
annotated target: team

Axiom
dbpedia infobox matching weight: 100.0
annotated property: relatedMatch
annotated target: awards
annotated source: links to Award

airline
type: Class
label: compagnie aérienne @fr

links to Hotel
domain: college coach
range: hotel
sub property of: place
comment: Relazione tra College Coach e Hotel @it
comment: Relation between College Coach and Hotel
type: ObjectProperty

links to Flowering Plant
type: ObjectProperty
range: flowering plant
comment: Relation between College Coach and Flowering Plant
domain: college coach
sub property of: species
comment: Relazione tra College Coach e Flowering Plant @it

links to Comedian
type: ObjectProperty
comment: Relazione tra College Coach e Comedian @it
sub property of: person
comment: Relation between College Coach and Comedian
range: comedian
domain: college coach

Axiom
dbpedia infobox matching weight: 75.0
annotated source: links to Basketball Player
annotated target: after
annotated property: relatedMatch

links to Planet
comment: Relation between College Coach and Planet
comment: Relazione tra College Coach e Planet @it
range: planet
type: ObjectProperty
sub property of: planet
domain: college coach

monarch
type: Class
label: monarque @fr

congressman
label: membre du Congrès @fr
type: Class

links to Hockey Team
comment: Relazione tra College Coach e Hockey Team @it
sub property of: organização
type: ObjectProperty
comment: Relation between College Coach and Hockey Team
range: hockey team
domain: college coach

golf player
type: Class
label: golfeur @fr

links to Reptile
sub property of: species
range: reptile
type: ObjectProperty
comment: Relazione tra College Coach e Reptile @it
comment: Relation between College Coach and Reptile
domain: college coach

journalist
type: Class
label: journaliste @fr

Axiom
dbpedia infobox matching weight: 100.0
annotated source: links to Office Holder
annotated target: years
annotated property: relatedMatch

film
type: Class
label: ταινία @el

links to Golf Player
type: ObjectProperty
sub property of: person
comment: Relazione tra College Coach e Golf Player @it
range: golf player
comment: Relation between College Coach and Golf Player
domain: college coach

Axiom
dbpedia infobox matching weight: 60.0
annotated property: relatedMatch
annotated target: coachteams
annotated source: links to American Football League

american football team
type: Class
label: équipe américaine de football américain @fr

Supreme Court of the United States case
type: Class
label: cas juridique de la Cour suprême des États-Unis @fr

bird
type: Class
label: oiseau @fr

chemical compound
type: Class
type: ObjectProperty
label: produit chimique @fr

Axiom
dbpedia infobox matching weight: 11.11
annotated property: relatedMatch
annotated source: links to Historic Place
annotated target: name

links to Village
domain: college coach
sub property of: place
comment: Relation between College Coach and Village
comment: Relazione tra College Coach e Village @it
range: village
type: ObjectProperty

Axiom
dbpedia infobox matching weight: 100.0
annotated target: coachteams
annotated property: relatedMatch
annotated source: links to Soccer Club

fungus
type: Class
label: fungi @fr

musical artist
label: musicien @fr
type: Class
label: artista musical @pt

links to Band
sub property of: organização
comment: Relation between College Coach and Band
type: ObjectProperty
comment: Relazione tra College Coach e Band @it
range: Band
domain: college coach

links to Soccer Club
related match: coachteams
type: NamedIndividual
sub property of: organização
comment: Relazione tra College Coach e Soccer Club @it
comment: Relation between College Coach and Soccer Club
type: ObjectProperty
domain: college coach
range: soccer club

Axiom
dbpedia infobox matching weight: 12.5
annotated target: before
annotated property: relatedMatch
annotated source: links to Baseball Player

links to Chemical Compound
comment: Relazione tra College Coach e Chemical Compound @it
comment: Relation between College Coach and Chemical Compound
range: chemical compound
sub property of: chemical compound
domain: college coach
type: ObjectProperty

Axiom
dbpedia infobox matching weight: 41.07
annotated target: coachteams
annotated property: relatedMatch
annotated source: links to Basketball Team

links to Magazine
range: magazine
sub property of: work
comment: Relazione tra College Coach e Magazine @it
domain: college coach
type: ObjectProperty
comment: Relation between College Coach and Magazine

rugby player
label: joueur de rugby @fr
type: Class

links to Election
comment: Relazione tra College Coach e Election @it
type: ObjectProperty
range: Election
sub property of: event
domain: college coach
comment: Relation between College Coach and Election

Axiom
dbpedia infobox matching weight: 100.0
annotated target: coachteams
annotated source: links to Airport
annotated property: relatedMatch

american football league
type: Class

links to Mountain Range
domain: college coach
type: ObjectProperty
sub property of: place
comment: Relazione tra College Coach e Mountain Range @it
range: mountain range
comment: Relation between College Coach and Mountain Range

musical
type: Class
label: musique @fr

links to Radio Station
domain: college coach
range: radio station
sub property of: organização
comment: Relation between College Coach and Radio Station
comment: Relazione tra College Coach e Radio Station @it
type: ObjectProperty

actor
label: acteur @fr
type: Class
label: Schauspieler @de

Axiom
dbpedia infobox matching weight: 4.0
annotated source: links to American Football Team
annotated target: title
annotated property: relatedMatch

place
label: lugar @pt
label: lieu @fr
label: περιοχή @el
type: ObjectProperty

national collegiate athletic association athlete
type: Class
label: athlète de la national collegiate athletic association @fr

infrastructure
type: ObjectProperty

links to Musical
comment: Relation between College Coach and Musical
type: ObjectProperty
sub property of: work
domain: college coach
comment: Relazione tra College Coach e Musical @it
range: musical

basketball league
label: ligue de basketball @fr
type: Class

links to American Football League
related match: team
type: NamedIndividual
comment: Relazione tra College Coach e American Football League @it
related match: coachteams
range: american football league
type: ObjectProperty
comment: Relation between College Coach and American Football League
sub property of: organização
domain: college coach

mountain
type: Class
label: montagne @fr
label: Βουνό @el

criminal
label: criminel @fr
type: Class

links to Artery
type: ObjectProperty
range: artery
sub property of: anatomical structure
domain: college coach
comment: Relazione tra College Coach e Artery @it
comment: Relation between College Coach and Artery

flowering plant
type: Class
label: angiospermes @fr

senator
label: sénateur @fr
type: Class

comedian
label: comédien @fr
type: Class

valley
type: Class
label: vallée @fr

links to Canal
range: canal
domain: college coach
comment: Relation between College Coach and Canal
sub property of: place
comment: Relazione tra College Coach e Canal @it
type: ObjectProperty

links to Historic Place
comment: Relazione tra College Coach e Historic Place @it
domain: college coach
related match: coachteams
related match: name
range: historic place
type: ObjectProperty
comment: Relation between College Coach and Historic Place
sub property of: place
type: NamedIndividual

Axiom
dbpedia infobox matching weight: 100.0
annotated target: coachteams
annotated source: links to Town
annotated property: relatedMatch

Axiom
dbpedia infobox matching weight: 33.33
annotated target: coachteams
annotated property: relatedMatch
annotated source: links to Canadian Football League

links to Island
sub property of: place
comment: Relazione tra College Coach e Island @it
domain: college coach
type: ObjectProperty
range: island
comment: Relation between College Coach and Island

book
type: Class
label: livre @fr
label: βιβλίο @el
label: llibre @ca
label: książka @pl

links to American Football Team
type: ObjectProperty
related match: title
domain: college coach
related match: team
comment: Relation between College Coach and American Football Team
range: american football team
related match: teams
related match: coachteams
comment: Relazione tra College Coach e American Football Team @it
related match: awards
type: NamedIndividual
sub property of: organização

links to Tennis Player
comment: Relation between College Coach and Tennis Player
sub property of: person
range: tennis player
comment: Relazione tra College Coach e Tennis Player @it
type: ObjectProperty
domain: college coach

links to Monarch
domain: college coach
comment: Relazione tra College Coach e Monarch @it
sub property of: person
range: monarch
comment: Relation between College Coach and Monarch
type: ObjectProperty

ski area
type: Class
label: domaine skiable @fr

links to Military Conflict
sub property of: event
range: military conflict
domain: college coach
type: ObjectProperty
comment: Relation between College Coach and Military Conflict
comment: Relazione tra College Coach e Military Conflict @it

non-profit organisation
label: organisation à but non lucratif @fr
type: Class

links to Lake
comment: Relation between College Coach and Lake
comment: Relazione tra College Coach e Lake @it
domain: college coach
range: lake
sub property of: place
type: ObjectProperty

links to Non- Profit Organisation
comment: Relation between College Coach and Non- Profit Organisation
domain: college coach
sub property of: organização
comment: Relazione tra College Coach e Non- Profit Organisation @it
range: non-profit organisation
type: ObjectProperty

links to President
domain: college coach
comment: Relation between College Coach and President
type: ObjectProperty
comment: Relazione tra College Coach e President @it
range: president
sub property of: person

canadian football league
type: Class

links to Writer
related match: after
type: NamedIndividual
type: ObjectProperty
sub property of: person
comment: Relazione tra College Coach e Writer @it
domain: college coach
range: writer
comment: Relation between College Coach and Writer

Axiom
dbpedia infobox matching weight: 2.0
annotated property: relatedMatch
annotated source: links to American Football Team
annotated target: teams

drug
type: Class
label: médicament @fr
type: ObjectProperty

links to Basketball Team
related match: team
range: basketball team
comment: Relation between College Coach and Basketball Team
domain: college coach
type: NamedIndividual
type: ObjectProperty
sub property of: organização
related match: coachteams
related match: formerTeams
comment: Relazione tra College Coach e Basketball Team @it

Axiom
dbpedia infobox matching weight: 1.0
annotated property: relatedMatch
annotated source: links to American Football Team
annotated target: awards

links to Ice Hockey Player
domain: college coach
sub property of: person
comment: Relazione tra College Coach e Ice Hockey Player @it
range: ice hockey player
type: ObjectProperty
comment: Relation between College Coach and Ice Hockey Player

links to National Collegiate Athletic Association Athlete
related match: after
type: NamedIndividual
comment: Relation between College Coach and National Collegiate Athletic Association Athlete
type: ObjectProperty
range: national collegiate athletic association athlete
sub property of: person
domain: college coach
comment: Relazione tra College Coach e National Collegiate Athletic Association Athlete @it

magazine
type: Class
label: περιοδικό @el

canal
type: Class

military person
type: Class
label: militaire @fr

philosopher
label: philosophe @fr
type: Class

Axiom
dbpedia infobox matching weight: 87.5
annotated target: after
annotated source: links to Baseball Player
annotated property: relatedMatch

award
type: ObjectProperty
label: récompense @fr
type: Class

links to Tennis League
sub property of: organização
type: ObjectProperty
comment: Relation between College Coach and Tennis League
domain: college coach
range: tennis league
comment: Relazione tra College Coach e Tennis League @it

anatomical structure
label: structure anatomique @fr
type: ObjectProperty

cricketer
label: joueur de cricket @fr
type: Class

links to Olympics
range: olympics
sub property of: event
type: ObjectProperty
comment: Relation between College Coach and Olympics
domain: college coach
comment: Relazione tra College Coach e Olympics @it

Band
label: banda @pt
label: Musikgruppe @de
type: Class
label: groupe de musique @fr

links to Town
related match: coachteams
type: NamedIndividual
domain: college coach
comment: Relation between College Coach and Town
range: town
type: ObjectProperty
comment: Relazione tra College Coach e Town @it
sub property of: place

links to Wrestler
comment: Relation between College Coach and Wrestler
comment: Relazione tra College Coach e Wrestler @it
type: ObjectProperty
range: wrestler
domain: college coach
sub property of: person

Axiom
dbpedia infobox matching weight: 55.36
annotated property: relatedMatch
annotated source: links to Basketball Team
annotated target: team

town
type: Class
label: ville @fr

links to Legislature
type: ObjectProperty
comment: Relation between College Coach and Legislature
domain: college coach
sub property of: organização
comment: Relazione tra College Coach e Legislature @it
range: legislature

Axiom
dbpedia infobox matching weight: 3.57
annotated property: relatedMatch
annotated target: formerTeams
annotated source: links to Basketball Team

links to Cricketer
comment: Relation between College Coach and Cricketer
domain: college coach
type: ObjectProperty
sub property of: person
range: cricketer
comment: Relazione tra College Coach e Cricketer @it

ethnic group
label: groupe ethnique @fr
type: ObjectProperty
type: Class

links to Basketball League
type: ObjectProperty
domain: college coach
comment: Relazione tra College Coach e Basketball League @it
comment: Relation between College Coach and Basketball League
sub property of: organização
range: basketball league
type: NamedIndividual
related match: championships

artery
label: artère @fr
type: Class
label: Arterie @de

links to Trade Union
sub property of: organização
comment: Relazione tra College Coach e Trade Union @it
range: trade union
type: ObjectProperty
domain: college coach
comment: Relation between College Coach and Trade Union

hotel
type: Class
label: hôtel @fr

college coach
label: entraîneur universitaire @fr
type: Class

television episode
label: épisode télévisé @fr
type: Class

Axiom
dbpedia infobox matching weight: 100.0
annotated source: links to Military Person
annotated property: relatedMatch
annotated target: after

muscle
type: Class

village
type: Class
label: χωριό @el

ice hockey league
type: Class
label: ligue d'hockey sur glace @fr

links to Office Holder
sub property of: person
comment: Relazione tra College Coach e Office Holder @it
domain: college coach
comment: Relation between College Coach and Office Holder
type: ObjectProperty
range: office holder
related match: years
type: NamedIndividual

soccer club
label: club de football @fr
type: Class

links to Aircraft
sub property of: mean of transportation
type: ObjectProperty
comment: Relazione tra College Coach e Aircraft @it
domain: college coach
range: aircraft
comment: Relation between College Coach and Aircraft

links to Congressman
type: NamedIndividual
related match: before
comment: Relation between College Coach and Congressman
comment: Relazione tra College Coach e Congressman @it
range: congressman
domain: college coach
type: ObjectProperty
sub property of: person

baseball player
label: joueur de baseball @fr
type: Class

office holder
label: titulaire @fr
label: Amtsinhaber @de
type: Class

military conflict
label: conflit militaire @fr
type: Class

website
label: Ιστότοπος @el
label: site web @fr
type: Class
type: ObjectProperty

links to Lacrosse League
comment: Relazione tra College Coach e Lacrosse League @it
comment: Relation between College Coach and Lacrosse League
type: ObjectProperty
range: lacrosse league
sub property of: organização
domain: college coach

basketball player
label: joueur de basketball @fr
type: Class

Axiom
dbpedia infobox matching weight: 77.42
annotated target: coachteams
annotated property: relatedMatch
annotated source: links to Canadian Football Team

links to Broadcast
type: ObjectProperty
comment: Relazione tra College Coach e Broadcast @it
sub property of: organização
comment: Relation between College Coach and Broadcast
range: broadcast
domain: college coach

ice hockey player
type: Class
label: joueur de hockey sur glace @fr

links to Mayor
comment: Relazione tra College Coach e Mayor @it
type: ObjectProperty
comment: Relation between College Coach and Mayor
domain: college coach
range: mayor
sub property of: person

mountain range
label: chaîne de montagne @fr
type: Class

beverage
type: ObjectProperty
type: Class
label: boisson @fr

links to Military Unit
range: military unit
comment: Relazione tra College Coach e Military Unit @it
type: ObjectProperty
sub property of: organização
comment: Relation between College Coach and Military Unit
domain: college coach
type: NamedIndividual
related match: unit

planet
type: ObjectProperty
label: planète @fr
type: Class

links to Valley
domain: college coach
sub property of: place
range: valley
comment: Relazione tra College Coach e Valley @it
comment: Relation between College Coach and Valley
type: ObjectProperty

links to Language
comment: Relation between College Coach and Language
sub property of: language
domain: college coach
type: ObjectProperty
range: language
comment: Relazione tra College Coach e Language @it

links to Continent
comment: Relation between College Coach and Continent
domain: college coach
type: ObjectProperty
sub property of: place
comment: Relazione tra College Coach e Continent @it
range: continent

scientist
label: Wissenschaftler @de
type: Class
label: scientifique @fr

links to Golf League
comment: Relazione tra College Coach e Golf League @it
comment: Relation between College Coach and Golf League
domain: college coach
type: ObjectProperty
sub property of: organização
range: golf league

links to Actor
domain: college coach
range: actor
sub property of: person
type: ObjectProperty
comment: Relazione tra College Coach e Actor @it
comment: Relation between College Coach and Actor
type: NamedIndividual
related match: years

golf league
type: Class
label: ligue de golf @fr

links to Baseball Player
related match: after
comment: Relation between College Coach and Baseball Player
comment: Relazione tra College Coach e Baseball Player @it
related match: before
sub property of: person
type: ObjectProperty
domain: college coach
type: NamedIndividual
range: baseball player

links to Newspaper
comment: Relation between College Coach and Newspaper
range: newspaper
sub property of: work
type: ObjectProperty
comment: Relazione tra College Coach e Newspaper @it
domain: college coach

olympics
type: Class
label: Jeux Olympiques @fr

organização
type: ObjectProperty
label: organisation
label: Organisation @de

baseball league
label: ligue de baseball @fr
type: Class

links to Musical Artist
comment: Relazione tra College Coach e Musical Artist @it
sub property of: person
type: ObjectProperty
comment: Relation between College Coach and Musical Artist
domain: college coach
range: musical artist

broadcast
label: Émission de télévision @fr
type: Class

links to Soccer Manager
sub property of: person
comment: Relazione tra College Coach e Soccer Manager @it
range: soccer manager
comment: Relation between College Coach and Soccer Manager
type: ObjectProperty
domain: college coach

mammal
label: mammifère @fr
type: Class

links to Muscle
comment: Relazione tra College Coach e Muscle @it
type: ObjectProperty
range: muscle
domain: college coach
comment: Relation between College Coach and Muscle
sub property of: anatomical structure

links to Comics Creator
type: ObjectProperty
domain: college coach
range: comics creator
comment: Relazione tra College Coach e Comics Creator @it
sub property of: person
comment: Relation between College Coach and Comics Creator

island
type: Class
label: νησί @el
label: île @fr

links to Bird
sub property of: species
domain: college coach
range: bird
comment: Relation between College Coach and Bird
comment: Relazione tra College Coach e Bird @it
type: ObjectProperty

links to Comics Character
domain: college coach
comment: Relation between College Coach and Comics Character
type: ObjectProperty
sub property of: person
range: comics character
comment: Relazione tra College Coach e Comics Character @it

comics character
label: personnage de bandes dessinées @fr
type: Class

links to Currency
domain: college coach
comment: Relation between College Coach and Currency
comment: Relazione tra College Coach e Currency @it
range: currency
type: ObjectProperty
sub property of: currency

event
type: ObjectProperty
label: évènement @fr

skyscraper
type: Class
label: gratte-ciel @fr

radio station
label: station de radio @fr
type: Class

links to Rugby Player
type: ObjectProperty
domain: college coach
comment: Relation between College Coach and Rugby Player
sub property of: person
comment: Relazione tra College Coach e Rugby Player @it
range: rugby player

links to Skyscraper
range: skyscraper
domain: college coach
type: ObjectProperty
comment: Relazione tra College Coach e Skyscraper @it
sub property of: place
comment: Relation between College Coach and Skyscraper

member of parliament
label: membre du Parlement @fr
type: Class

links to Road
type: ObjectProperty
comment: Relation between College Coach and Road
sub property of: infrastructure
domain: college coach
range: road
comment: Relazione tra College Coach e Road @it

links to Criminal
domain: college coach
range: criminal
sub property of: person
comment: Relazione tra College Coach e Criminal @it
comment: Relation between College Coach and Criminal
type: ObjectProperty

airport
type: Class
label: Flughafen @de
label: aéroport @fr