links to Reptile
comment: Relazione tra Comics Character e Reptile @it
range: reptile
sub property of: species
type: ObjectProperty
comment: Relation between Comics Character and Reptile
domain: comics character

rocket
label: fusée @fr
type: Class

links to Bridge
comment: Relazione tra Comics Character e Bridge @it
type: ObjectProperty
comment: Relation between Comics Character and Bridge
sub property of: place
domain: comics character
range: bridge

disease
label: maladie @fr
type: Class
type: ObjectProperty

colour
type: ObjectProperty
label: χρώμα @el
label: couleur @fr
type: Class

automobile
type: Class

links to Weapon
range: weapon
comment: Relation between Comics Character and Weapon
domain: comics character
sub property of: device
comment: Relazione tra Comics Character e Weapon @it
type: ObjectProperty
related match: powers
type: NamedIndividual

links to River
sub property of: place
range: river
domain: comics character
comment: Relation between Comics Character and River
comment: Relazione tra Comics Character e River @it
type: ObjectProperty

links to Magazine
range: magazine
type: ObjectProperty
domain: comics character
sub property of: work
comment: Relazione tra Comics Character e Magazine @it
comment: Relation between Comics Character and Magazine

Election
label: élection @fr
type: Class

ComicsCharacter.owl
imports: dbpediainfoboxmatchingweight.owl
comment: ComicsCharacter Encyclopedic Knowledge Pattern
has author: Aldo Gangemi
has author: Andrea Giovanni Nuzzolese
extracted from: dbpedia.org
has intent: To represent the encyclopedic knowledge expressed by an object typed as ComicsCharacter
type: Ontology
has author: Valentina Presutti
imports: cpannotationschema.owl
extracted from: en.wikipedia.org

links to Administrative Region
comment: Relation between Comics Character and Administrative Region
domain: comics character
range: administrative region
comment: Relazione tra Comics Character e Administrative Region @it
sub property of: place
type: ObjectProperty

links to Hospital
type: ObjectProperty
sub property of: place
comment: Relation between Comics Character and Hospital
comment: Relazione tra Comics Character e Hospital @it
domain: comics character
range: hospital

american football player
type: Class
label: joueur de football américain @fr

mean of transportation
label: moyen de transport @fr
type: ObjectProperty

stadium
label: stade @fr
type: Class

links to World Heritage Site
range: World Heritage Site
type: ObjectProperty
domain: comics character
comment: Relazione tra Comics Character e World Heritage Site @it
comment: Relation between Comics Character and World Heritage Site
sub property of: place

astronaut
label: astronaute @fr
label: Astronaut @de
type: Class

links to College Coach
sub property of: person
comment: Relazione tra Comics Character e College Coach @it
type: ObjectProperty
domain: comics character
range: college coach
comment: Relation between Comics Character and College Coach

links to Airport
domain: comics character
type: ObjectProperty
comment: Relation between Comics Character and Airport
sub property of: place
range: airport
comment: Relazione tra Comics Character e Airport @it

links to Model
sub property of: person
comment: Relazione tra Comics Character e Model @it
domain: comics character
comment: Relation between Comics Character and Model
range: model
type: ObjectProperty

links to Aircraft
comment: Relazione tra Comics Character e Aircraft @it
range: aircraft
comment: Relation between Comics Character and Aircraft
domain: comics character
sub property of: mean of transportation
type: ObjectProperty

wrestler
type: Class
label: lutteur @fr

mayor
type: Class
label: maire @fr

amphibian
type: Class
label: amphibien @fr

links to Drug
range: drug
comment: Relation between Comics Character and Drug
comment: Relazione tra Comics Character e Drug @it
domain: comics character
type: ObjectProperty
sub property of: drug

species
type: ObjectProperty
label: espèce @fr

links to Cricketer
type: ObjectProperty
sub property of: person
range: cricketer
domain: comics character
comment: Relation between Comics Character and Cricketer
comment: Relazione tra Comics Character e Cricketer @it

links to Historic Place
type: ObjectProperty
sub property of: place
domain: comics character
range: historic place
comment: Relation between Comics Character and Historic Place
comment: Relazione tra Comics Character e Historic Place @it

newspaper
type: Class
label: journal @fr

links to Fish
comment: Relation between Comics Character and Fish
range: fish
sub property of: species
comment: Relazione tra Comics Character e Fish @it
domain: comics character
type: ObjectProperty

game
type: Class
label: jeu @fr

protected area
type: Class
label: προστατευμένη περιοχή @el
label: aire protégée @fr

road
type: Class
label: route @fr

boxer
label: boxeur @fr
type: Class

judge
label: juge @fr
type: Class

links to Journalist
type: ObjectProperty
comment: Relation between Comics Character and Journalist
sub property of: person
domain: comics character
comment: Relazione tra Comics Character e Journalist @it
range: journalist

World Heritage Site
type: Class
label: site du patrimoine mondial @fr

links to Mountain Range
sub property of: place
comment: Relazione tra Comics Character e Mountain Range @it
comment: Relation between Comics Character and Mountain Range
range: mountain range
domain: comics character
type: ObjectProperty

links to Game
comment: Relation between Comics Character and Game
comment: Relazione tra Comics Character e Game @it
range: game
type: ObjectProperty
domain: comics character
sub property of: activity

station
type: Class

language
type: ObjectProperty
label: langage @fr
type: Class

links to Museum
comment: Relazione tra Comics Character e Museum @it
range: museum
domain: comics character
sub property of: place
type: ObjectProperty
comment: Relation between Comics Character and Museum

links to Amphibian
comment: Relation between Comics Character and Amphibian
domain: comics character
comment: Relazione tra Comics Character e Amphibian @it
range: amphibian
type: ObjectProperty
sub property of: species

Axiom
dbpedia infobox matching weight: 100.0
annotated source: links to Album
annotated property: relatedMatch
annotated target: alliances

links to Military Person
range: military person
domain: comics character
comment: Relation between Comics Character and Military Person
type: ObjectProperty
comment: Relazione tra Comics Character e Military Person @it
sub property of: person

links to Basketball Team
type: ObjectProperty
sub property of: organisation
comment: Relazione tra Comics Character e Basketball Team @it
comment: Relation between Comics Character and Basketball Team
domain: comics character
range: basketball team

links to Fungus
domain: comics character
comment: Relazione tra Comics Character e Fungus @it
range: fungus
comment: Relation between Comics Character and Fungus
type: ObjectProperty
sub property of: species

lake
label: lac @fr
type: Class

arachnid
label: arachnides @fr
type: Class

links to Insect
range: insect
domain: comics character
type: ObjectProperty
comment: Relazione tra Comics Character e Insect @it
sub property of: species
comment: Relation between Comics Character and Insect

governor
label: gouverneur @fr
type: Class

administrative region
label: région administrative @fr
type: Class

links to Broadcast
sub property of: organisation
comment: Relation between Comics Character and Broadcast
type: ObjectProperty
comment: Relazione tra Comics Character e Broadcast @it
domain: comics character
range: broadcast

work
label: obra @pt
label: travail @fr
type: ObjectProperty

river
label: rivière @fr
type: Class

school
label: école @fr
type: Class

ship
type: Class
label: navire @fr

museum
label: musée @fr
type: Class

fish
label: poisson @fr
type: Class

tennis player
label: joueur de tennis @fr
type: Class

Axiom
dbpedia infobox matching weight: 100.0
annotated source: links to Soccer Player
annotated property: relatedMatch
annotated target: creators

links to Adult Actor
type: ObjectProperty
sub property of: person
comment: Relation between Comics Character and Adult Actor
range: adult actor
comment: Relazione tra Comics Character e Adult Actor @it
domain: comics character

links to Tennis Player
type: ObjectProperty
comment: Relation between Comics Character and Tennis Player
comment: Relazione tra Comics Character e Tennis Player @it
range: tennis player
domain: comics character
sub property of: person

currency
label: devise @fr
type: Class
type: ObjectProperty

prime minister
type: Class
label: premier ministre @fr

links to Soccer Manager
type: ObjectProperty
comment: Relazione tra Comics Character e Soccer Manager @it
range: soccer manager
comment: Relation between Comics Character and Soccer Manager
domain: comics character
sub property of: person

British royalty
type: Class
label: royauté Britannique @fr

links to British Royalty
comment: Relazione tra Comics Character e British Royalty @it
sub property of: person
type: ObjectProperty
domain: comics character
comment: Relation between Comics Character and British Royalty
range: British royalty

links to Soccer Club
domain: comics character
comment: Relazione tra Comics Character e Soccer Club @it
sub property of: organisation
type: ObjectProperty
comment: Relation between Comics Character and Soccer Club
range: soccer club

historic place
type: Class
label: site historique @fr

links to Historic Building
type: ObjectProperty
comment: Relazione tra Comics Character e Historic Building @it
domain: comics character
sub property of: place
comment: Relation between Comics Character and Historic Building
range: historic building

hospital
type: Class
label: hôpital @fr

monument
type: Class

links to Protected Area
sub property of: place
range: protected area
comment: Relation between Comics Character and Protected Area
comment: Relazione tra Comics Character e Protected Area @it
domain: comics character
type: ObjectProperty

links to Newspaper
comment: Relation between Comics Character and Newspaper
type: ObjectProperty
range: newspaper
domain: comics character
sub property of: work
comment: Relazione tra Comics Character e Newspaper @it

links to Colour
comment: Relation between Comics Character and Colour
comment: Relazione tra Comics Character e Colour @it
type: ObjectProperty
sub property of: colour
range: colour
domain: comics character

links to Architect
comment: Relazione tra Comics Character e Architect @it
domain: comics character
sub property of: person
comment: Relation between Comics Character and Architect
type: ObjectProperty
range: architect

continent
label: ήπειρος @el
type: Class

links to Music Festival
comment: Relazione tra Comics Character e Music Festival @it
type: ObjectProperty
sub property of: event
range: music festival
domain: comics character
comment: Relation between Comics Character and Music Festival

president
type: Class
label: président @fr

album
label: Album @de
type: Class

links to Monument
comment: Relazione tra Comics Character e Monument @it
comment: Relation between Comics Character and Monument
domain: comics character
range: monument
type: ObjectProperty
sub property of: place

links to Bacteria
comment: Relation between Comics Character and Bacteria
type: ObjectProperty
comment: Relazione tra Comics Character e Bacteria @it
sub property of: species
domain: comics character
range: bacteria

person
label: personne @fr
type: ObjectProperty
label: pessoa @pt
label: Person @de

military unit
label: unité militaire @fr
type: Class

soccer manager
type: Class
label: entraîneur de football @fr

basketball team
type: Class

music genre
type: Class
label: género musical @pt
type: ObjectProperty
label: genre musical @fr

record label
type: Class
label: label discographique @fr

architect
type: Class
label: architecte @fr

links to Flowering Plant
domain: comics character
type: ObjectProperty
comment: Relazione tra Comics Character e Flowering Plant @it
sub property of: species
range: flowering plant
comment: Relation between Comics Character and Flowering Plant

model
type: Class
label: mannequin @fr

ambassador
type: Class
label: ambassadeur @fr

links to Space Mission
comment: Relazione tra Comics Character e Space Mission @it
domain: comics character
sub property of: event
comment: Relation between Comics Character and Space Mission
range: space mission
type: ObjectProperty

crustacean
type: Class
label: crustacés @fr

links to American Football League
comment: Relazione tra Comics Character e American Football League @it
domain: comics character
sub property of: organisation
comment: Relation between Comics Character and American Football League
type: ObjectProperty
range: american football league

film festival
label: festival du film @fr
type: Class

links to Philosopher
type: ObjectProperty
comment: Relation between Comics Character and Philosopher
domain: comics character
range: philosopher
comment: Relazione tra Comics Character e Philosopher @it
sub property of: person

Axiom
dbpedia infobox matching weight: 100.0
annotated target: alliances
annotated property: relatedMatch
annotated source: links to President

links to Currency
comment: Relazione tra Comics Character e Currency @it
type: ObjectProperty
range: currency
comment: Relation between Comics Character and Currency
domain: comics character
sub property of: currency

links to Canal
comment: Relation between Comics Character and Canal
range: canal
domain: comics character
sub property of: place
comment: Relazione tra Comics Character e Canal @it
type: ObjectProperty

links to Mayor
related match: creators
type: NamedIndividual
sub property of: person
range: mayor
domain: comics character
comment: Relazione tra Comics Character e Mayor @it
type: ObjectProperty
comment: Relation between Comics Character and Mayor

links to Congressman
domain: comics character
comment: Relazione tra Comics Character e Congressman @it
range: congressman
type: ObjectProperty
comment: Relation between Comics Character and Congressman
sub property of: person
type: NamedIndividual
related match: creators

links to Road
domain: comics character
sub property of: infrastructure
range: road
comment: Relazione tra Comics Character e Road @it
comment: Relation between Comics Character and Road
type: ObjectProperty

aircraft
label: αεροσκάφος @el
type: Class
label: avion @fr

links to Bird
comment: Relazione tra Comics Character e Bird @it
type: ObjectProperty
range: bird
sub property of: species
comment: Relation between Comics Character and Bird
domain: comics character

soccer player
type: Class
label: joueur de football @fr

reptile
type: Class

legislature
type: Class
label: pouvoir législatif @fr

links to Ambassador
range: ambassador
type: ObjectProperty
comment: Relazione tra Comics Character e Ambassador @it
comment: Relation between Comics Character and Ambassador
domain: comics character
sub property of: person

links to Town
comment: Relation between Comics Character and Town
domain: comics character
type: ObjectProperty
range: town
sub property of: place
comment: Relazione tra Comics Character e Town @it

monarch
type: Class
label: monarque @fr

links to Olympics
type: ObjectProperty
comment: Relation between Comics Character and Olympics
comment: Relazione tra Comics Character e Olympics @it
sub property of: event
range: olympics
domain: comics character

congressman
type: Class
label: membre du Congrès @fr

activity
type: ObjectProperty
label: Aktivität @de
label: activité @fr

links to Member Of Parliament
comment: Relazione tra Comics Character e Member Of Parliament @it
range: member of parliament
domain: comics character
type: ObjectProperty
comment: Relation between Comics Character and Member Of Parliament
sub property of: person

space mission
type: Class
label: διαστημική αποστολή @el
label: mission spatiale @fr

journalist
label: journaliste @fr
type: Class

insect
type: Class
label: insecte @fr

links to Disease
domain: comics character
range: disease
comment: Relation between Comics Character and Disease
sub property of: disease
type: ObjectProperty
comment: Relazione tra Comics Character e Disease @it

american football team
label: équipe américaine de football américain @fr
type: Class

links to Television Episode
type: ObjectProperty
range: television episode
comment: Relazione tra Comics Character e Television Episode @it
domain: comics character
sub property of: work
comment: Relation between Comics Character and Television Episode

links to Office Holder
type: NamedIndividual
related match: creators
comment: Relazione tra Comics Character e Office Holder @it
comment: Relation between Comics Character and Office Holder
range: office holder
domain: comics character
sub property of: person
type: ObjectProperty

bird
type: Class
label: oiseau @fr

chemical compound
type: Class
type: ObjectProperty
label: produit chimique @fr

links to Rugby Player
comment: Relation between Comics Character and Rugby Player
type: ObjectProperty
domain: comics character
comment: Relazione tra Comics Character e Rugby Player @it
range: rugby player
sub property of: person

links to Military Conflict
type: ObjectProperty
sub property of: event
domain: comics character
range: military conflict
comment: Relazione tra Comics Character e Military Conflict @it
comment: Relation between Comics Character and Military Conflict

links to Protein
domain: comics character
comment: Relation between Comics Character and Protein
sub property of: protein
range: protein
comment: Relazione tra Comics Character e Protein @it
type: ObjectProperty

fungus
label: fungi @fr
type: Class

musical artist
label: musicien @fr
type: Class
label: artista musical @pt

links to Senator
type: ObjectProperty
domain: comics character
comment: Relation between Comics Character and Senator
sub property of: person
range: senator
comment: Relazione tra Comics Character e Senator @it

links to Language
range: language
comment: Relazione tra Comics Character e Language @it
type: ObjectProperty
domain: comics character
sub property of: language
comment: Relation between Comics Character and Language

links to Basketball Player
range: basketball player
comment: Relazione tra Comics Character e Basketball Player @it
comment: Relation between Comics Character and Basketball Player
domain: comics character
type: ObjectProperty
sub property of: person

links to Legislature
type: NamedIndividual
related match: alliances
comment: Relation between Comics Character and Legislature
type: ObjectProperty
range: legislature
sub property of: organisation
domain: comics character
comment: Relazione tra Comics Character e Legislature @it

park
type: Class
label: parc @fr

brain
label: cerveau @fr
type: Class

Axiom
dbpedia infobox matching weight: 100.0
annotated target: powers
annotated source: links to Weapon
annotated property: relatedMatch

rugby player
label: joueur de rugby @fr
type: Class

american football league
type: Class

links to Convention
comment: Relazione tra Comics Character e Convention @it
comment: Relation between Comics Character and Convention
range: convention
domain: comics character
type: ObjectProperty
sub property of: event

Axiom
dbpedia infobox matching weight: 100.0
annotated target: species
annotated property: relatedMatch
annotated source: links to Mammal

musical
type: Class
label: musique @fr

links to Radio Station
range: radio station
type: ObjectProperty
comment: Relation between Comics Character and Radio Station
sub property of: organisation
comment: Relazione tra Comics Character e Radio Station @it
domain: comics character

links to Beverage
sub property of: beverage
comment: Relation between Comics Character and Beverage
range: beverage
type: ObjectProperty
comment: Relazione tra Comics Character e Beverage @it
domain: comics character

cyclist
type: Class
label: cycliste @fr

place
type: ObjectProperty
label: περιοχή @el
label: lieu @fr
label: lugar @pt

links to Playboy Playmate
type: ObjectProperty
sub property of: person
comment: Relation between Comics Character and Playboy Playmate
comment: Relazione tra Comics Character e Playboy Playmate @it
range: Playboy Playmate
domain: comics character

links to Music Genre
range: music genre
domain: comics character
sub property of: music genre
type: ObjectProperty
comment: Relazione tra Comics Character e Music Genre @it
comment: Relation between Comics Character and Music Genre

Axiom
dbpedia infobox matching weight: 100.0
annotated property: relatedMatch
annotated source: links to Military Unit
annotated target: alliances

infrastructure
type: ObjectProperty

mountain
type: Class
label: montagne @fr
label: Βουνό @el

criminal
type: Class
label: criminel @fr

flowering plant
label: angiospermes @fr
type: Class

links to Stadium
domain: comics character
comment: Relazione tra Comics Character e Stadium @it
comment: Relation between Comics Character and Stadium
type: ObjectProperty
sub property of: place
range: stadium

Axiom
dbpedia infobox matching weight: 100.0
annotated target: creators
annotated property: relatedMatch
annotated source: links to Congressman

senator
label: sénateur @fr
type: Class

saint
type: Class

comedian
type: Class
label: comédien @fr

links to Record Label
type: ObjectProperty
sub property of: organisation
range: record label
domain: comics character
comment: Relation between Comics Character and Record Label
comment: Relazione tra Comics Character e Record Label @it

links to Mammal
type: NamedIndividual
related match: species
type: ObjectProperty
sub property of: species
domain: comics character
comment: Relation between Comics Character and Mammal
range: mammal
comment: Relazione tra Comics Character e Mammal @it

links to Baseball League
comment: Relazione tra Comics Character e Baseball League @it
type: ObjectProperty
comment: Relation between Comics Character and Baseball League
sub property of: organisation
domain: comics character
range: baseball league

Playboy Playmate
label: playmate pour Playboy @fr
type: Class

convention
label: congrès @fr
type: Class

book
type: Class
label: livre @fr
label: βιβλίο @el
label: książka @pl
label: llibre @ca

links to Arachnid
type: ObjectProperty
sub property of: species
range: arachnid
comment: Relazione tra Comics Character e Arachnid @it
domain: comics character
comment: Relation between Comics Character and Arachnid

links to Brain
sub property of: anatomical structure
comment: Relazione tra Comics Character e Brain @it
domain: comics character
comment: Relation between Comics Character and Brain
type: ObjectProperty
range: brain

links to Comedian
comment: Relazione tra Comics Character e Comedian @it
comment: Relation between Comics Character and Comedian
domain: comics character
sub property of: person
related match: starring
related match: actors
type: NamedIndividual
range: comedian
type: ObjectProperty

Axiom
dbpedia infobox matching weight: 100.0
annotated property: relatedMatch
annotated target: creators
annotated source: links to Scientist

device
label: appareil @fr
type: ObjectProperty

shopping mall
type: Class
label: centre commercial @fr

links to Book
domain: comics character
range: book
type: ObjectProperty
comment: Relazione tra Comics Character e Book @it
sub property of: work
comment: Relation between Comics Character and Book

Axiom
dbpedia infobox matching weight: 33.33
annotated property: relatedMatch
annotated target: actors
annotated source: links to Comedian

bacteria
type: Class
label: bactérie @fr

links to Eurovision Song Contest Entry
domain: comics character
range: Eurovision song contest entry
type: ObjectProperty
sub property of: work
comment: Relation between Comics Character and Eurovision Song Contest Entry
comment: Relazione tra Comics Character e Eurovision Song Contest Entry @it

non-profit organisation
label: organisation à but non lucratif @fr
type: Class

links to Film Festival
domain: comics character
range: film festival
type: ObjectProperty
comment: Relation between Comics Character and Film Festival
comment: Relazione tra Comics Character e Film Festival @it
sub property of: event

links to Governor
comment: Relazione tra Comics Character e Governor @it
comment: Relation between Comics Character and Governor
domain: comics character
type: ObjectProperty
sub property of: person
range: governor

links to Election
range: Election
comment: Relazione tra Comics Character e Election @it
type: ObjectProperty
domain: comics character
comment: Relation between Comics Character and Election
sub property of: event

links to Military Unit
related match: alliances
type: NamedIndividual
domain: comics character
comment: Relation between Comics Character and Military Unit
sub property of: organisation
comment: Relazione tra Comics Character e Military Unit @it
type: ObjectProperty
range: military unit

links to Park
domain: comics character
sub property of: place
comment: Relazione tra Comics Character e Park @it
type: ObjectProperty
range: park
comment: Relation between Comics Character and Park

mollusca
label: mollusque @fr
type: Class

links to Monarch
type: ObjectProperty
domain: comics character
comment: Relation between Comics Character and Monarch
comment: Relazione tra Comics Character e Monarch @it
range: monarch
sub property of: person

weapon
label: arme @fr
type: Class

links to Ice Hockey Player
range: ice hockey player
domain: comics character
comment: Relazione tra Comics Character e Ice Hockey Player @it
sub property of: person
comment: Relation between Comics Character and Ice Hockey Player
type: ObjectProperty

drug
type: Class
label: médicament @fr
type: ObjectProperty

Axiom
dbpedia infobox matching weight: 100.0
annotated property: relatedMatch
annotated source: links to Legislature
annotated target: alliances

links to Criminal
type: ObjectProperty
comment: Relation between Comics Character and Criminal
comment: Relazione tra Comics Character e Criminal @it
domain: comics character
range: criminal
sub property of: person

magazine
type: Class
label: περιοδικό @el

links to Village
sub property of: place
range: village
domain: comics character
type: ObjectProperty
comment: Relazione tra Comics Character e Village @it
comment: Relation between Comics Character and Village

links to Shopping Mall
type: ObjectProperty
range: shopping mall
comment: Relation between Comics Character and Shopping Mall
comment: Relazione tra Comics Character e Shopping Mall @it
sub property of: place
domain: comics character

canal
type: Class

Axiom
dbpedia infobox matching weight: 100.0
annotated target: composer
annotated source: links to Musical Artist
annotated property: relatedMatch

military person
type: Class
label: militaire @fr

links to Lake
range: lake
domain: comics character
comment: Relazione tra Comics Character e Lake @it
comment: Relation between Comics Character and Lake
type: ObjectProperty
sub property of: place

links to Skyscraper
sub property of: place
type: ObjectProperty
comment: Relation between Comics Character and Skyscraper
domain: comics character
comment: Relazione tra Comics Character e Skyscraper @it
range: skyscraper

links to School
sub property of: organisation
range: school
type: ObjectProperty
comment: Relazione tra Comics Character e School @it
comment: Relation between Comics Character and School
domain: comics character

philosopher
type: Class
label: philosophe @fr

award
type: ObjectProperty
label: récompense @fr
type: Class

links to Mountain
sub property of: place
type: ObjectProperty
comment: Relation between Comics Character and Mountain
comment: Relazione tra Comics Character e Mountain @it
range: mountain
domain: comics character

links to Continent
domain: comics character
comment: Relation between Comics Character and Continent
range: continent
sub property of: place
comment: Relazione tra Comics Character e Continent @it
type: ObjectProperty

anatomical structure
type: ObjectProperty
label: structure anatomique @fr

sport
type: Class

links to Crustacean
domain: comics character
range: crustacean
type: ObjectProperty
comment: Relation between Comics Character and Crustacean
sub property of: species
comment: Relazione tra Comics Character e Crustacean @it

cricketer
label: joueur de cricket @fr
type: Class

single
type: Class

Band
label: banda @pt
label: Musikgruppe @de
type: Class
label: groupe de musique @fr

town
label: ville @fr
type: Class

links to Station
type: ObjectProperty
sub property of: place
comment: Relation between Comics Character and Station
comment: Relazione tra Comics Character e Station @it
range: station
domain: comics character

Axiom
dbpedia infobox matching weight: 100.0
annotated source: links to Ethnic Group
annotated target: alliances
annotated property: relatedMatch

university
type: Class
label: université @fr
label: πανεπιστήμιο @el

links to Bone
range: bone
comment: Relation between Comics Character and Bone
comment: Relazione tra Comics Character e Bone @it
domain: comics character
sub property of: anatomical structure
type: ObjectProperty

protein
type: ObjectProperty
type: Class
label: protéine @fr

ethnic group
type: Class
type: ObjectProperty
label: groupe ethnique @fr

links to Single
comment: Relation between Comics Character and Single
range: single
sub property of: work
type: ObjectProperty
domain: comics character
comment: Relazione tra Comics Character e Single @it

links to Chemical Compound
comment: Relation between Comics Character and Chemical Compound
domain: comics character
range: chemical compound
comment: Relazione tra Comics Character e Chemical Compound @it
type: ObjectProperty
sub property of: chemical compound

music festival
label: festival de musique @fr
type: Class

college coach
type: Class
label: entraîneur universitaire @fr

television episode
label: épisode télévisé @fr
type: Class

links to Non- Profit Organisation
range: non-profit organisation
type: ObjectProperty
domain: comics character
comment: Relazione tra Comics Character e Non- Profit Organisation @it
sub property of: organisation
comment: Relation between Comics Character and Non- Profit Organisation

links to University
comment: Relation between Comics Character and University
comment: Relazione tra Comics Character e University @it
domain: comics character
range: university
sub property of: organisation
type: ObjectProperty

village
type: Class
label: χωριό @el

links to Scientist
type: NamedIndividual
related match: creators
comment: Relation between Comics Character and Scientist
comment: Relazione tra Comics Character e Scientist @it
range: scientist
type: ObjectProperty
sub property of: person
domain: comics character

soccer club
label: club de football @fr
type: Class

links to Musical
range: musical
comment: Relation between Comics Character and Musical
type: ObjectProperty
domain: comics character
comment: Relazione tra Comics Character e Musical @it
sub property of: work

historic building
label: bâtiment historique @fr
type: Class

baseball player
type: Class
label: joueur de baseball @fr

office holder
type: Class
label: Amtsinhaber @de
label: titulaire @fr

military conflict
type: Class
label: conflit militaire @fr

links to President
related match: alliances
type: NamedIndividual
range: president
type: ObjectProperty
comment: Relation between Comics Character and President
domain: comics character
sub property of: person
comment: Relazione tra Comics Character e President @it

website
type: ObjectProperty
type: Class
label: site web @fr
label: Ιστότοπος @el

basketball player
type: Class
label: joueur de basketball @fr

adult actor
label: erwachsener Schauspieler @de
type: Class
label: acteur adulte @fr

ice hockey player
label: joueur de hockey sur glace @fr
type: Class

links to Sport
type: ObjectProperty
domain: comics character
range: sport
sub property of: activity
comment: Relazione tra Comics Character e Sport @it
comment: Relation between Comics Character and Sport

links to Cyclist
comment: Relation between Comics Character and Cyclist
range: cyclist
type: ObjectProperty
sub property of: person
domain: comics character
comment: Relazione tra Comics Character e Cyclist @it

links to Ethnic Group
type: NamedIndividual
related match: alliances
comment: Relation between Comics Character and Ethnic Group
type: ObjectProperty
range: ethnic group
sub property of: ethnic group
comment: Relazione tra Comics Character e Ethnic Group @it
domain: comics character

mountain range
type: Class
label: chaîne de montagne @fr

beverage
type: ObjectProperty
type: Class
label: boisson @fr

planet
type: ObjectProperty
label: planète @fr
type: Class

scientist
label: scientifique @fr
type: Class
label: Wissenschaftler @de

links to Award
type: ObjectProperty
comment: Relation between Comics Character and Award
sub property of: award
domain: comics character
range: award
comment: Relazione tra Comics Character e Award @it

links to Judge
range: judge
sub property of: person
type: ObjectProperty
domain: comics character
comment: Relazione tra Comics Character e Judge @it
comment: Relation between Comics Character and Judge

links to American Football Team
sub property of: organisation
type: ObjectProperty
domain: comics character
comment: Relation between Comics Character and American Football Team
comment: Relazione tra Comics Character e American Football Team @it
range: american football team

links to Rocket
comment: Relazione tra Comics Character e Rocket @it
comment: Relation between Comics Character and Rocket
domain: comics character
type: ObjectProperty
range: rocket
sub property of: mean of transportation

links to Musical Artist
range: musical artist
comment: Relazione tra Comics Character e Musical Artist @it
type: ObjectProperty
sub property of: person
comment: Relation between Comics Character and Musical Artist
domain: comics character
related match: composer
type: NamedIndividual

links to Soccer Player
related match: creators
type: NamedIndividual
range: soccer player
sub property of: person
domain: comics character
comment: Relazione tra Comics Character e Soccer Player @it
type: ObjectProperty
comment: Relation between Comics Character and Soccer Player

links to Prime Minister
domain: comics character
comment: Relation between Comics Character and Prime Minister
sub property of: person
comment: Relazione tra Comics Character e Prime Minister @it
range: prime minister
type: ObjectProperty

links to Baseball Player
comment: Relation between Comics Character and Baseball Player
sub property of: person
type: ObjectProperty
range: baseball player
comment: Relazione tra Comics Character e Baseball Player @it
domain: comics character

olympics
label: Jeux Olympiques @fr
type: Class

organisation
label: Organisation @de
label: organização @pt
type: ObjectProperty

links to Astronaut
type: ObjectProperty
comment: Relation between Comics Character and Astronaut
sub property of: person
comment: Relazione tra Comics Character e Astronaut @it
range: astronaut
domain: comics character

baseball league
type: Class
label: ligue de baseball @fr

links to Boxer
domain: comics character
type: ObjectProperty
comment: Relation between Comics Character and Boxer
range: boxer
sub property of: person
comment: Relazione tra Comics Character e Boxer @it

links to Band
comment: Relazione tra Comics Character e Band @it
type: ObjectProperty
sub property of: organisation
domain: comics character
comment: Relation between Comics Character and Band
range: Band

bridge
label: pont @fr
type: Class

Axiom
dbpedia infobox matching weight: 100.0
annotated source: links to Office Holder
annotated property: relatedMatch
annotated target: creators

links to Website
comment: Relation between Comics Character and Website
domain: comics character
range: website
comment: Relazione tra Comics Character e Website @it
sub property of: website
type: ObjectProperty

links to Ship
comment: Relation between Comics Character and Ship
type: ObjectProperty
sub property of: mean of transportation
domain: comics character
range: ship
comment: Relazione tra Comics Character e Ship @it

broadcast
type: Class
label: Émission de télévision @fr

links to American Football Player
sub property of: person
domain: comics character
comment: Relazione tra Comics Character e American Football Player @it
range: american football player
comment: Relation between Comics Character and American Football Player
type: ObjectProperty

mammal
type: Class
label: mammifère @fr

links to Saint
range: saint
comment: Relazione tra Comics Character e Saint @it
type: ObjectProperty
domain: comics character
sub property of: person
comment: Relation between Comics Character and Saint

Eurovision song contest entry
type: Class
label: concours Eurovision de la chanson @fr

Axiom
dbpedia infobox matching weight: 66.67
annotated source: links to Comedian
annotated property: relatedMatch
annotated target: starring

island
label: île @fr
label: νησί @el
type: Class

links to Mollusca
comment: Relazione tra Comics Character e Mollusca @it
comment: Relation between Comics Character and Mollusca
sub property of: species
domain: comics character
type: ObjectProperty
range: mollusca

comics character
label: personnage de bandes dessinées @fr
type: Class

links to Wrestler
type: ObjectProperty
range: wrestler
domain: comics character
sub property of: person
comment: Relation between Comics Character and Wrestler
comment: Relazione tra Comics Character e Wrestler @it

event
label: évènement @fr
type: ObjectProperty

skyscraper
type: Class
label: gratte-ciel @fr

links to Automobile
comment: Relazione tra Comics Character e Automobile @it
range: automobile
comment: Relation between Comics Character and Automobile
type: ObjectProperty
sub property of: mean of transportation
domain: comics character

radio station
type: Class
label: station de radio @fr

links to Island
type: ObjectProperty
range: island
sub property of: place
comment: Relation between Comics Character and Island
comment: Relazione tra Comics Character e Island @it
domain: comics character

bone
label: os @fr
label: Knochen @de
type: Class

member of parliament
type: Class
label: membre du Parlement @fr

links to Planet
type: ObjectProperty
comment: Relazione tra Comics Character e Planet @it
range: planet
comment: Relation between Comics Character and Planet
domain: comics character
sub property of: planet

Axiom
dbpedia infobox matching weight: 100.0
annotated property: relatedMatch
annotated source: links to Mayor
annotated target: creators

airport
label: aéroport @fr
label: Flughafen @de
type: Class

links to Album
comment: Relazione tra Comics Character e Album @it
comment: Relation between Comics Character and Album
range: album
sub property of: work
type: ObjectProperty
domain: comics character
related match: alliances
type: NamedIndividual