links to Crustacean
range: crustacean
comment: Relation between Ethnic Group and Crustacean
sub property of: species
domain: ethnic group
comment: Relazione tra Ethnic Group e Crustacean @it
type: ObjectProperty

television show
label: émission de télévision @fr
type: Class

disease
type: ObjectProperty
type: Class
label: maladie @fr

links to Disease
range: disease
comment: Relation between Ethnic Group and Disease
domain: ethnic group
type: ObjectProperty
comment: Relazione tra Ethnic Group e Disease @it
sub property of: disease

links to Ambassador
sub property of: person
comment: Relation between Ethnic Group and Ambassador
comment: Relazione tra Ethnic Group e Ambassador @it
type: ObjectProperty
range: ambassador
domain: ethnic group

automobile
type: Class

colour
type: Class
label: couleur @fr
label: χρώμα @el
type: ObjectProperty

links to Arachnid
domain: ethnic group
sub property of: species
comment: Relazione tra Ethnic Group e Arachnid @it
comment: Relation between Ethnic Group and Arachnid
range: arachnid
type: ObjectProperty

Election
label: élection @fr
type: Class

links to Automobile
domain: ethnic group
sub property of: mean of transportation
comment: Relazione tra Ethnic Group e Automobile @it
type: ObjectProperty
range: automobile
comment: Relation between Ethnic Group and Automobile

links to Hospital
comment: Relation between Ethnic Group and Hospital
sub property of: place
comment: Relazione tra Ethnic Group e Hospital @it
type: ObjectProperty
domain: ethnic group
range: hospital

mean of transportation
type: ObjectProperty
label: moyen de transport @fr

american football player
label: joueur de football américain @fr
type: Class

Legal Case
label: cas juridique @fr
type: ObjectProperty

links to Lighthouse
type: ObjectProperty
domain: ethnic group
comment: Relation between Ethnic Group and Lighthouse
comment: Relazione tra Ethnic Group e Lighthouse @it
sub property of: place
range: lighthouse

Axiom
dbpedia infobox matching weight: 100.0
annotated target: caption
annotated source: links to Baseball Player
annotated property: relatedMatch

stadium
type: Class
label: stade @fr

links to Baseball League
sub property of: organização
type: ObjectProperty
domain: ethnic group
comment: Relation between Ethnic Group and Baseball League
range: baseball league
comment: Relazione tra Ethnic Group e Baseball League @it

links to Airline
comment: Relation between Ethnic Group and Airline
range: airline
sub property of: organização
comment: Relazione tra Ethnic Group e Airline @it
domain: ethnic group
type: ObjectProperty

EthnicGroup.owl
imports: dbpediainfoboxmatchingweight.owl
imports: cpannotationschema.owl
type: Ontology
extracted from: en.wikipedia.org
has intent: To represent the encyclopedic knowledge expressed by an object typed as EthnicGroup
has author: Valentina Presutti
has author: Andrea Giovanni Nuzzolese
has author: Aldo Gangemi
comment: EthnicGroup Encyclopedic Knowledge Pattern
extracted from: dbpedia.org

soccer league
label: ligue de football @fr
type: Class

astronaut
label: astronaute @fr
label: Astronaut @de
type: Class

links to Non- Profit Organisation
sub property of: organização
range: non-profit organisation
domain: ethnic group
comment: Relazione tra Ethnic Group e Non- Profit Organisation @it
type: ObjectProperty
comment: Relation between Ethnic Group and Non- Profit Organisation

links to Cyclist
type: ObjectProperty
comment: Relation between Ethnic Group and Cyclist
comment: Relazione tra Ethnic Group e Cyclist @it
domain: ethnic group
sub property of: person
range: cyclist

links to Race
domain: ethnic group
comment: Relazione tra Ethnic Group e Race @it
type: ObjectProperty
comment: Relation between Ethnic Group and Race
range: race
sub property of: event

links to Architect
comment: Relation between Ethnic Group and Architect
sub property of: person
comment: Relazione tra Ethnic Group e Architect @it
type: ObjectProperty
range: architect
domain: ethnic group

wrestler
type: Class
label: lutteur @fr

mayor
type: Class
label: maire @fr

amphibian
label: amphibien @fr
type: Class

pope
label: pape @fr
type: Class

links to Station
range: station
type: ObjectProperty
comment: Relazione tra Ethnic Group e Station @it
sub property of: place
domain: ethnic group
comment: Relation between Ethnic Group and Station

species
label: espèce @fr
type: ObjectProperty

links to World Heritage Site
comment: Relation between Ethnic Group and World Heritage Site
domain: ethnic group
sub property of: place
comment: Relazione tra Ethnic Group e World Heritage Site @it
range: World Heritage Site
type: ObjectProperty

links to Mountain
type: ObjectProperty
comment: Relazione tra Ethnic Group e Mountain @it
sub property of: place
range: mountain
comment: Relation between Ethnic Group and Mountain
domain: ethnic group

links to Poker Player
comment: Relazione tra Ethnic Group e Poker Player @it
domain: ethnic group
sub property of: person
type: ObjectProperty
comment: Relation between Ethnic Group and Poker Player
range: poker player

newspaper
label: journal @fr
type: Class

protected area
label: aire protégée @fr
label: προστατευμένη περιοχή @el
type: Class

game
label: jeu @fr
type: Class

road
type: Class
label: route @fr

Axiom
dbpedia infobox matching weight: 100.0
annotated property: relatedMatch
annotated source: links to Model
annotated target: caption

links to Judge
type: ObjectProperty
comment: Relazione tra Ethnic Group e Judge @it
sub property of: person
comment: Relation between Ethnic Group and Judge
range: judge
domain: ethnic group

boxer
type: Class
label: boxeur @fr

judge
label: juge @fr
type: Class

Axiom
dbpedia infobox matching weight: 100.0
annotated property: relatedMatch
annotated target: caption
annotated source: links to Governor

World Heritage Site
type: Class
label: site du patrimoine mondial @fr

links to Basketball League
range: basketball league
type: ObjectProperty
domain: ethnic group
sub property of: organização
comment: Relation between Ethnic Group and Basketball League
comment: Relazione tra Ethnic Group e Basketball League @it

station
type: Class

tennis league
type: Class
label: ligue de tennis @fr

links to Basketball Team
domain: ethnic group
comment: Relazione tra Ethnic Group e Basketball Team @it
type: ObjectProperty
range: basketball team
comment: Relation between Ethnic Group and Basketball Team
sub property of: organização

lake
type: Class
label: lac @fr

arachnid
type: Class
label: arachnides @fr

links to Film
comment: Relazione tra Ethnic Group e Film @it
domain: ethnic group
sub property of: work
range: film
comment: Relation between Ethnic Group and Film
type: ObjectProperty

links to Fish
comment: Relazione tra Ethnic Group e Fish @it
range: fish
domain: ethnic group
comment: Relation between Ethnic Group and Fish
type: ObjectProperty
sub property of: species
related match: relatedC
type: NamedIndividual

governor
label: gouverneur @fr
type: Class

links to Skyscraper
sub property of: place
range: skyscraper
type: ObjectProperty
comment: Relation between Ethnic Group and Skyscraper
comment: Relazione tra Ethnic Group e Skyscraper @it
domain: ethnic group

work
label: obra @pt
label: travail @fr
type: ObjectProperty

poker player
label: joueur de poker @fr
type: Class

school
type: Class
label: école @fr

museum
label: musée @fr
type: Class

ship
type: Class
label: navire @fr

fish
label: poisson @fr
type: Class

tennis player
type: Class
label: joueur de tennis @fr

links to Historic Building
comment: Relation between Ethnic Group and Historic Building
range: historic building
type: ObjectProperty
sub property of: place
comment: Relazione tra Ethnic Group e Historic Building @it
domain: ethnic group

video game
type: Class
label: jeux vidéo @fr

trade union
type: Class
label: syndicat professionnel @fr

links to Fern
comment: Relation between Ethnic Group and Fern
domain: ethnic group
type: ObjectProperty
sub property of: species
range: fern
comment: Relazione tra Ethnic Group e Fern @it

links to Ship
type: ObjectProperty
comment: Relazione tra Ethnic Group e Ship @it
domain: ethnic group
comment: Relation between Ethnic Group and Ship
range: ship
sub property of: mean of transportation

currency
label: devise @fr
type: Class
type: ObjectProperty

British royalty
label: royauté Britannique @fr
type: Class

prime minister
type: Class
label: premier ministre @fr

links to Park
sub property of: place
comment: Relazione tra Ethnic Group e Park @it
comment: Relation between Ethnic Group and Park
domain: ethnic group
type: ObjectProperty
range: park

historic place
type: Class
label: site historique @fr

race
label: course @fr
type: Class

hospital
label: hôpital @fr
type: Class

links to Hockey Team
comment: Relazione tra Ethnic Group e Hockey Team @it
comment: Relation between Ethnic Group and Hockey Team
range: hockey team
domain: ethnic group
type: ObjectProperty
sub property of: organização

links to Wrestler
type: ObjectProperty
comment: Relation between Ethnic Group and Wrestler
sub property of: person
range: wrestler
domain: ethnic group
comment: Relazione tra Ethnic Group e Wrestler @it

Axiom
dbpedia infobox matching weight: 100.0
annotated source: links to Congressman
annotated property: relatedMatch
annotated target: caption

links to Soccer Club
range: soccer club
comment: Relazione tra Ethnic Group e Soccer Club @it
domain: ethnic group
sub property of: organização
type: ObjectProperty
comment: Relation between Ethnic Group and Soccer Club

Axiom
dbpedia infobox matching weight: 100.0
annotated source: links to Basketball Player
annotated target: caption
annotated property: relatedMatch

links to Beverage
range: beverage
type: ObjectProperty
domain: ethnic group
sub property of: beverage
comment: Relation between Ethnic Group and Beverage
comment: Relazione tra Ethnic Group e Beverage @it

album
label: Album @de
type: Class

links to Protected Area
comment: Relazione tra Ethnic Group e Protected Area @it
range: protected area
sub property of: place
domain: ethnic group
comment: Relation between Ethnic Group and Protected Area
type: ObjectProperty

links to Member Of Parliament
type: NamedIndividual
related match: caption
domain: ethnic group
comment: Relation between Ethnic Group and Member Of Parliament
sub property of: person
comment: Relazione tra Ethnic Group e Member Of Parliament @it
range: member of parliament
type: ObjectProperty

figure skater
type: Class
label: patineur artistique @fr

links to Golf League
comment: Relation between Ethnic Group and Golf League
range: golf league
type: ObjectProperty
sub property of: organização
domain: ethnic group
comment: Relazione tra Ethnic Group e Golf League @it

Axiom
dbpedia infobox matching weight: 100.0
annotated property: relatedMatch
annotated source: links to Cricketer
annotated target: caption

person
label: personne @fr
label: pessoa @pt
type: ObjectProperty
label: Person @de

military unit
label: unité militaire @fr
type: Class

links to Conifer
type: ObjectProperty
domain: ethnic group
sub property of: species
comment: Relation between Ethnic Group and Conifer
range: conifer
comment: Relazione tra Ethnic Group e Conifer @it

Axiom
dbpedia infobox matching weight: 100.0
annotated property: relatedMatch
annotated source: links to American Football Player
annotated target: caption

links to Book
comment: Relation between Ethnic Group and Book
sub property of: work
range: book
comment: Relazione tra Ethnic Group e Book @it
domain: ethnic group
type: ObjectProperty

soccer manager
label: entraîneur de football @fr
type: Class

basketball team
type: Class

links to Music Genre
domain: ethnic group
sub property of: music genre
type: ObjectProperty
comment: Relazione tra Ethnic Group e Music Genre @it
range: music genre
comment: Relation between Ethnic Group and Music Genre

canadian football team
type: Class
label: équipe canadienne de football américain @fr

music genre
label: genre musical @fr
type: ObjectProperty
label: género musical @pt
type: Class

links to Prime Minister
type: NamedIndividual
related match: caption
sub property of: person
range: prime minister
type: ObjectProperty
domain: ethnic group
comment: Relazione tra Ethnic Group e Prime Minister @it
comment: Relation between Ethnic Group and Prime Minister

cycad
type: Class
label: cycadophytes @fr

links to Lake
range: lake
comment: Relazione tra Ethnic Group e Lake @it
type: ObjectProperty
domain: ethnic group
sub property of: place
comment: Relation between Ethnic Group and Lake

record label
type: Class
label: label discographique @fr

links to Philosopher
type: NamedIndividual
related match: caption
domain: ethnic group
range: philosopher
comment: Relazione tra Ethnic Group e Philosopher @it
type: ObjectProperty
comment: Relation between Ethnic Group and Philosopher
sub property of: person

links to Insect
sub property of: species
comment: Relation between Ethnic Group and Insect
comment: Relazione tra Ethnic Group e Insect @it
domain: ethnic group
range: insect
type: ObjectProperty

links to Model
domain: ethnic group
sub property of: person
range: model
comment: Relazione tra Ethnic Group e Model @it
type: ObjectProperty
comment: Relation between Ethnic Group and Model
related match: caption
type: NamedIndividual

links to Space Station
range: space station
domain: ethnic group
type: ObjectProperty
comment: Relation between Ethnic Group and Space Station
sub property of: mean of transportation
comment: Relazione tra Ethnic Group e Space Station @it

architect
type: Class
label: architecte @fr

model
label: mannequin @fr
type: Class

Axiom
dbpedia infobox matching weight: 100.0
annotated property: relatedMatch
annotated target: caption
annotated source: links to Tennis Player

ambassador
type: Class
label: ambassadeur @fr

links to Canadian Football League
domain: ethnic group
comment: Relation between Ethnic Group and Canadian Football League
range: canadian football league
sub property of: organização
comment: Relazione tra Ethnic Group e Canadian Football League @it
type: ObjectProperty

links to Formula One Racer
comment: Relazione tra Ethnic Group e Formula One Racer @it
comment: Relation between Ethnic Group and Formula One Racer
range: Formula One racer
domain: ethnic group
sub property of: person
type: ObjectProperty

links to Astronaut
range: astronaut
sub property of: person
type: ObjectProperty
domain: ethnic group
comment: Relazione tra Ethnic Group e Astronaut @it
comment: Relation between Ethnic Group and Astronaut
related match: caption
type: NamedIndividual

olympic result
type: ObjectProperty
type: Class
label: résultat de Jeux Olympiques @fr

crustacean
type: Class
label: crustacés @fr

links to Soccer Manager
comment: Relation between Ethnic Group and Soccer Manager
domain: ethnic group
type: ObjectProperty
sub property of: person
comment: Relazione tra Ethnic Group e Soccer Manager @it
range: soccer manager

links to Road
domain: ethnic group
range: road
comment: Relation between Ethnic Group and Road
type: ObjectProperty
comment: Relazione tra Ethnic Group e Road @it
sub property of: infrastructure

film festival
type: Class
label: festival du film @fr

links to School
domain: ethnic group
comment: Relation between Ethnic Group and School
range: school
sub property of: organização
comment: Relazione tra Ethnic Group e School @it
type: ObjectProperty

links to Saint
range: saint
type: ObjectProperty
domain: ethnic group
comment: Relation between Ethnic Group and Saint
comment: Relazione tra Ethnic Group e Saint @it
sub property of: person

Axiom
dbpedia infobox matching weight: 100.0
annotated source: links to Soccer Player
annotated property: relatedMatch
annotated target: caption

links to Comedian
type: ObjectProperty
domain: ethnic group
comment: Relation between Ethnic Group and Comedian
sub property of: person
comment: Relazione tra Ethnic Group e Comedian @it
range: comedian
related match: caption
type: NamedIndividual

links to Video Game
comment: Relation between Ethnic Group and Video Game
comment: Relazione tra Ethnic Group e Video Game @it
sub property of: work
domain: ethnic group
type: ObjectProperty
range: video game

links to Museum
range: museum
comment: Relation between Ethnic Group and Museum
type: ObjectProperty
sub property of: place
comment: Relazione tra Ethnic Group e Museum @it
domain: ethnic group

links to Power Station
comment: Relation between Ethnic Group and Power Station
comment: Relazione tra Ethnic Group e Power Station @it
domain: ethnic group
sub property of: infrastructure
type: ObjectProperty
range: power station

links to Legislature
comment: Relazione tra Ethnic Group e Legislature @it
sub property of: organização
domain: ethnic group
comment: Relation between Ethnic Group and Legislature
range: legislature
type: ObjectProperty

links to Cycad
sub property of: species
range: cycad
type: ObjectProperty
comment: Relation between Ethnic Group and Cycad
domain: ethnic group
comment: Relazione tra Ethnic Group e Cycad @it

links to Boxer
comment: Relation between Ethnic Group and Boxer
domain: ethnic group
comment: Relazione tra Ethnic Group e Boxer @it
type: ObjectProperty
sub property of: person
range: boxer

lighthouse
label: phare @fr
type: Class

links to Journalist
comment: Relation between Ethnic Group and Journalist
comment: Relazione tra Ethnic Group e Journalist @it
type: ObjectProperty
sub property of: person
range: journalist
domain: ethnic group

chancellor
type: Class
label: chancelier @fr

comics creator
type: Class
label: créateur de bandes dessinées @fr

aircraft
label: αεροσκάφος @el
type: Class
label: avion @fr

links to Basketball Player
type: NamedIndividual
related match: caption
domain: ethnic group
comment: Relazione tra Ethnic Group e Basketball Player @it
type: ObjectProperty
range: basketball player
sub property of: person
comment: Relation between Ethnic Group and Basketball Player

links to Album
sub property of: work
domain: ethnic group
comment: Relation between Ethnic Group and Album
type: ObjectProperty
comment: Relazione tra Ethnic Group e Album @it
range: album

hockey team
type: Class
label: équipe de hockey @fr

soccer player
type: Class
label: joueur de football @fr

links to Ice Hockey Player
type: NamedIndividual
related match: caption
sub property of: person
comment: Relazione tra Ethnic Group e Ice Hockey Player @it
domain: ethnic group
range: ice hockey player
comment: Relation between Ethnic Group and Ice Hockey Player
type: ObjectProperty

reptile
type: Class

legislature
type: Class
label: pouvoir législatif @fr

cave
type: Class
label: grotte @fr

links to Baseball Player
type: NamedIndividual
related match: caption
type: ObjectProperty
sub property of: person
comment: Relation between Ethnic Group and Baseball Player
comment: Relazione tra Ethnic Group e Baseball Player @it
range: baseball player
domain: ethnic group

Axiom
dbpedia infobox matching weight: 100.0
annotated target: caption
annotated property: relatedMatch
annotated source: links to Scientist

Axiom
dbpedia infobox matching weight: 100.0
annotated property: relatedMatch
annotated source: links to Astronaut
annotated target: caption

airline
label: compagnie aérienne @fr
type: Class

monarch
type: Class
label: monarque @fr

congressman
label: membre du Congrès @fr
type: Class

links to Pope
comment: Relation between Ethnic Group and Pope
type: ObjectProperty
comment: Relazione tra Ethnic Group e Pope @it
domain: ethnic group
sub property of: person
range: pope

golf player
label: golfeur @fr
type: Class

activity
label: activité @fr
label: Aktivität @de
type: ObjectProperty

nascar driver
type: Class
label: pilote de la nascar @fr

journalist
type: Class
label: journaliste @fr

space mission
label: mission spatiale @fr
label: διαστημική αποστολή @el
type: Class

insect
label: insecte @fr
type: Class

links to Nascar Driver
range: nascar driver
type: ObjectProperty
domain: ethnic group
comment: Relation between Ethnic Group and Nascar Driver
sub property of: person
comment: Relazione tra Ethnic Group e Nascar Driver @it

film
label: ταινία @el
type: Class

links to Supreme Court Of The United States Case
type: ObjectProperty
comment: Relation between Ethnic Group and Supreme Court Of The United States Case
domain: ethnic group
range: Supreme Court of the United States case
comment: Relazione tra Ethnic Group e Supreme Court Of The United States Case @it
sub property of: Legal Case

links to Bird
comment: Relazione tra Ethnic Group e Bird @it
sub property of: species
range: bird
comment: Relation between Ethnic Group and Bird
domain: ethnic group
type: ObjectProperty

american football team
label: équipe américaine de football américain @fr
type: Class

Supreme Court of the United States case
type: Class
label: cas juridique de la Cour suprême des États-Unis @fr

Axiom
dbpedia infobox matching weight: 100.0
annotated property: relatedMatch
annotated target: relatedC
annotated source: links to Fish

chemical compound
label: produit chimique @fr
type: ObjectProperty
type: Class

bird
type: Class
label: oiseau @fr

power station
type: Class

Gaelic games player
label: joueur de sports gaéliques @fr
type: Class

links to Bone
comment: Relation between Ethnic Group and Bone
range: bone
sub property of: anatomical structure
domain: ethnic group
type: ObjectProperty
comment: Relazione tra Ethnic Group e Bone @it

Axiom
dbpedia infobox matching weight: 100.0
annotated property: relatedMatch
annotated source: links to British Royalty
annotated target: caption

fungus
type: Class
label: fungi @fr

fern
type: Class
label: fougères @fr

links to Senator
domain: ethnic group
comment: Relazione tra Ethnic Group e Senator @it
comment: Relation between Ethnic Group and Senator
type: ObjectProperty
range: senator
sub property of: person

links to Weapon
domain: ethnic group
comment: Relation between Ethnic Group and Weapon
sub property of: device
range: weapon
type: ObjectProperty
comment: Relazione tra Ethnic Group e Weapon @it

links to Soccer Player
type: NamedIndividual
related match: caption
type: ObjectProperty
sub property of: person
comment: Relation between Ethnic Group and Soccer Player
range: soccer player
domain: ethnic group
comment: Relazione tra Ethnic Group e Soccer Player @it

links to Comics Creator
type: ObjectProperty
domain: ethnic group
sub property of: person
range: comics creator
comment: Relation between Ethnic Group and Comics Creator
comment: Relazione tra Ethnic Group e Comics Creator @it

park
label: parc @fr
type: Class

links to British Royalty
sub property of: person
type: ObjectProperty
range: British royalty
comment: Relation between Ethnic Group and British Royalty
comment: Relazione tra Ethnic Group e British Royalty @it
domain: ethnic group
related match: caption
type: NamedIndividual

cardinal
type: Class

rugby player
label: joueur de rugby @fr
type: Class

links to Radio Station
type: ObjectProperty
domain: ethnic group
sub property of: organização
range: radio station
comment: Relation between Ethnic Group and Radio Station
comment: Relazione tra Ethnic Group e Radio Station @it

american football league
type: Class

links to Drug
range: drug
sub property of: drug
type: ObjectProperty
comment: Relation between Ethnic Group and Drug
comment: Relazione tra Ethnic Group e Drug @it
domain: ethnic group

musical
label: musique @fr
type: Class

links to Chancellor
domain: ethnic group
sub property of: person
comment: Relation between Ethnic Group and Chancellor
range: chancellor
type: ObjectProperty
comment: Relazione tra Ethnic Group e Chancellor @it

cyclist
label: cycliste @fr
type: Class

links to Golf Player
related match: imageCaption
type: NamedIndividual
domain: ethnic group
type: ObjectProperty
sub property of: person
comment: Relation between Ethnic Group and Golf Player
comment: Relazione tra Ethnic Group e Golf Player @it
range: golf player

links to Film Festival
sub property of: event
comment: Relation between Ethnic Group and Film Festival
domain: ethnic group
range: film festival
type: ObjectProperty
comment: Relazione tra Ethnic Group e Film Festival @it

Axiom
dbpedia infobox matching weight: 100.0
annotated source: links to Ice Hockey Player
annotated target: caption
annotated property: relatedMatch

place
label: lugar @pt
label: lieu @fr
label: περιοχή @el
type: ObjectProperty

links to Cardinal
domain: ethnic group
range: cardinal
sub property of: person
type: ObjectProperty
comment: Relation between Ethnic Group and Cardinal
comment: Relazione tra Ethnic Group e Cardinal @it

infrastructure
type: ObjectProperty

links to Historic Place
type: ObjectProperty
sub property of: place
comment: Relation between Ethnic Group and Historic Place
domain: ethnic group
range: historic place
comment: Relazione tra Ethnic Group e Historic Place @it

basketball league
type: Class
label: ligue de basketball @fr

mountain
type: Class
label: montagne @fr
label: Βουνό @el

criminal
type: Class
label: criminel @fr

links to Grape
domain: ethnic group
range: grape
comment: Relation between Ethnic Group and Grape
sub property of: species
type: ObjectProperty
comment: Relazione tra Ethnic Group e Grape @it

space shuttle
label: navette spatiale @fr
type: Class

links to Bacteria
sub property of: species
comment: Relation between Ethnic Group and Bacteria
domain: ethnic group
comment: Relazione tra Ethnic Group e Bacteria @it
range: bacteria
type: ObjectProperty

links to Figure Skater
type: NamedIndividual
related match: caption
range: figure skater
sub property of: person
domain: ethnic group
comment: Relazione tra Ethnic Group e Figure Skater @it
type: ObjectProperty
comment: Relation between Ethnic Group and Figure Skater

senator
type: Class
label: sénateur @fr

saint
type: Class

valley
type: Class
label: vallée @fr

comedian
label: comédien @fr
type: Class

song
label: chanson @fr
type: Class

links to Television Episode
domain: ethnic group
type: ObjectProperty
range: television episode
comment: Relazione tra Ethnic Group e Television Episode @it
comment: Relation between Ethnic Group and Television Episode
sub property of: work

links to Olympics
sub property of: event
comment: Relazione tra Ethnic Group e Olympics @it
range: olympics
type: ObjectProperty
comment: Relation between Ethnic Group and Olympics
domain: ethnic group

links to Playboy Playmate
range: Playboy Playmate
sub property of: person
type: ObjectProperty
comment: Relation between Ethnic Group and Playboy Playmate
domain: ethnic group
comment: Relazione tra Ethnic Group e Playboy Playmate @it

Playboy Playmate
label: playmate pour Playboy @fr
type: Class

Axiom
dbpedia infobox matching weight: 100.0
annotated target: caption
annotated property: relatedMatch
annotated source: links to Member Of Parliament

book
label: książka @pl
label: llibre @ca
label: βιβλίο @el
label: livre @fr
type: Class

links to Criminal
range: criminal
sub property of: person
domain: ethnic group
type: ObjectProperty
comment: Relation between Ethnic Group and Criminal
comment: Relazione tra Ethnic Group e Criminal @it

links to Award
type: ObjectProperty
range: award
sub property of: award
domain: ethnic group
comment: Relation between Ethnic Group and Award
comment: Relazione tra Ethnic Group e Award @it

links to Single
domain: ethnic group
range: single
comment: Relazione tra Ethnic Group e Single @it
type: ObjectProperty
comment: Relation between Ethnic Group and Single
sub property of: work

device
type: ObjectProperty
label: appareil @fr

shopping mall
label: centre commercial @fr
type: Class

links to American Football Player
comment: Relazione tra Ethnic Group e American Football Player @it
range: american football player
sub property of: person
domain: ethnic group
type: ObjectProperty
comment: Relation between Ethnic Group and American Football Player
related match: caption
type: NamedIndividual

bacteria
type: Class
label: bactérie @fr

links to Stadium
range: stadium
sub property of: place
domain: ethnic group
comment: Relation between Ethnic Group and Stadium
type: ObjectProperty
comment: Relazione tra Ethnic Group e Stadium @it

links to Fungus
comment: Relazione tra Ethnic Group e Fungus @it
range: fungus
sub property of: species
domain: ethnic group
comment: Relation between Ethnic Group and Fungus
type: ObjectProperty

links to Amphibian
type: ObjectProperty
range: amphibian
comment: Relation between Ethnic Group and Amphibian
sub property of: species
domain: ethnic group
comment: Relazione tra Ethnic Group e Amphibian @it

space station
type: Class
label: station spatiale @fr

non-profit organisation
label: organisation à but non lucratif @fr
type: Class

links to Rugby League
type: ObjectProperty
comment: Relazione tra Ethnic Group e Rugby League @it
sub property of: organização
domain: ethnic group
comment: Relation between Ethnic Group and Rugby League
range: rugby league

canadian football league
type: Class

rugby league
type: Class
label: ligue de rugby @fr

links to Airport
type: ObjectProperty
range: airport
domain: ethnic group
comment: Relazione tra Ethnic Group e Airport @it
sub property of: place
comment: Relation between Ethnic Group and Airport

mollusca
type: Class
label: mollusque @fr

links to Musical
range: musical
domain: ethnic group
comment: Relazione tra Ethnic Group e Musical @it
sub property of: work
comment: Relation between Ethnic Group and Musical
type: ObjectProperty

wine region
type: Class
label: région viticole @fr

weapon
type: Class
label: arme @fr

Axiom
dbpedia infobox matching weight: 100.0
annotated property: relatedMatch
annotated target: caption
annotated source: links to Comedian

drug
type: Class
label: médicament @fr
type: ObjectProperty

links to Television Show
range: television show
domain: ethnic group
sub property of: work
type: ObjectProperty
comment: Relation between Ethnic Group and Television Show
comment: Relazione tra Ethnic Group e Television Show @it

Axiom
dbpedia infobox matching weight: 100.0
annotated target: imageCaption
annotated source: links to Golf Player
annotated property: relatedMatch

magazine
type: Class
label: περιοδικό @el

links to Election
sub property of: event
domain: ethnic group
comment: Relation between Ethnic Group and Election
comment: Relazione tra Ethnic Group e Election @it
type: ObjectProperty
range: Election

links to Website
comment: Relation between Ethnic Group and Website
domain: ethnic group
sub property of: website
range: website
type: ObjectProperty
comment: Relazione tra Ethnic Group e Website @it

links to Song
range: song
comment: Relazione tra Ethnic Group e Song @it
domain: ethnic group
type: ObjectProperty
sub property of: work
comment: Relation between Ethnic Group and Song

canal
type: Class

links to Valley
type: ObjectProperty
comment: Relation between Ethnic Group and Valley
comment: Relazione tra Ethnic Group e Valley @it
sub property of: place
range: valley
domain: ethnic group

military person
label: militaire @fr
type: Class

philosopher
type: Class
label: philosophe @fr

award
type: Class
label: récompense @fr
type: ObjectProperty

anatomical structure
type: ObjectProperty
label: structure anatomique @fr

sport
type: Class

links to Badminton Player
type: ObjectProperty
range: badminton player
comment: Relazione tra Ethnic Group e Badminton Player @it
comment: Relation between Ethnic Group and Badminton Player
domain: ethnic group
sub property of: person

links to Space Mission
range: space mission
sub property of: event
comment: Relation between Ethnic Group and Space Mission
domain: ethnic group
comment: Relazione tra Ethnic Group e Space Mission @it
type: ObjectProperty

cricketer
type: Class
label: joueur de cricket @fr

single
type: Class

links to Mollusca
domain: ethnic group
range: mollusca
comment: Relazione tra Ethnic Group e Mollusca @it
sub property of: species
comment: Relation between Ethnic Group and Mollusca
type: ObjectProperty

nerve
type: Class
label: nerf @fr

Band
label: groupe de musique @fr
type: Class
label: Musikgruppe @de
label: banda @pt

links to Congressman
type: NamedIndividual
related match: caption
range: congressman
comment: Relazione tra Ethnic Group e Congressman @it
sub property of: person
type: ObjectProperty
comment: Relation between Ethnic Group and Congressman
domain: ethnic group

links to Currency
type: ObjectProperty
domain: ethnic group
range: currency
sub property of: currency
comment: Relation between Ethnic Group and Currency
comment: Relazione tra Ethnic Group e Currency @it

links to Monarch
comment: Relation between Ethnic Group and Monarch
type: ObjectProperty
sub property of: person
comment: Relazione tra Ethnic Group e Monarch @it
range: monarch
domain: ethnic group

links to Mayor
comment: Relation between Ethnic Group and Mayor
type: ObjectProperty
comment: Relazione tra Ethnic Group e Mayor @it
range: mayor
sub property of: person
domain: ethnic group

university
label: πανεπιστήμιο @el
label: université @fr
type: Class

Axiom
dbpedia infobox matching weight: 100.0
annotated property: relatedMatch
annotated target: caption
annotated source: links to Figure Skater

ethnic group
label: groupe ethnique @fr
type: Class

links to American Football League
range: american football league
type: ObjectProperty
comment: Relazione tra Ethnic Group e American Football League @it
domain: ethnic group
comment: Relation between Ethnic Group and American Football League
sub property of: organização

embryology
type: Class
label: embryologie @fr

links to Mammal
range: mammal
domain: ethnic group
sub property of: species
comment: Relazione tra Ethnic Group e Mammal @it
type: ObjectProperty
comment: Relation between Ethnic Group and Mammal

links to Game
range: game
domain: ethnic group
type: ObjectProperty
comment: Relazione tra Ethnic Group e Game @it
comment: Relation between Ethnic Group and Game
sub property of: activity

links to Mountain Range
type: ObjectProperty
comment: Relazione tra Ethnic Group e Mountain Range @it
range: mountain range
sub property of: place
domain: ethnic group
comment: Relation between Ethnic Group and Mountain Range

hotel
label: hôtel @fr
type: Class

links to Nerve
comment: Relazione tra Ethnic Group e Nerve @it
comment: Relation between Ethnic Group and Nerve
type: ObjectProperty
range: nerve
sub property of: anatomical structure
domain: ethnic group

links to Canadian Football Team
comment: Relazione tra Ethnic Group e Canadian Football Team @it
comment: Relation between Ethnic Group and Canadian Football Team
range: canadian football team
sub property of: organização
domain: ethnic group
type: ObjectProperty

Axiom
dbpedia infobox matching weight: 100.0
annotated target: caption
annotated source: links to Military Person
annotated property: relatedMatch

college coach
label: entraîneur universitaire @fr
type: Class

television episode
type: Class
label: épisode télévisé @fr

links to Ice Hockey League
sub property of: organização
type: ObjectProperty
range: ice hockey league
comment: Relation between Ethnic Group and Ice Hockey League
domain: ethnic group
comment: Relazione tra Ethnic Group e Ice Hockey League @it

links to Broadcast
type: ObjectProperty
comment: Relazione tra Ethnic Group e Broadcast @it
comment: Relation between Ethnic Group and Broadcast
domain: ethnic group
range: broadcast
sub property of: organização

village
type: Class
label: χωριό @el

ice hockey league
type: Class
label: ligue d'hockey sur glace @fr

soccer club
type: Class
label: club de football @fr

Axiom
dbpedia infobox matching weight: 100.0
annotated target: caption
annotated property: relatedMatch
annotated source: links to Philosopher

historic building
type: Class
label: bâtiment historique @fr

links to Band
sub property of: organização
type: ObjectProperty
comment: Relation between Ethnic Group and Band
domain: ethnic group
range: Band
comment: Relazione tra Ethnic Group e Band @it

baseball player
label: joueur de baseball @fr
type: Class

grape
label: raisin @fr
type: Class

website
type: ObjectProperty
type: Class
label: site web @fr
label: Ιστότοπος @el

links to Hotel
range: hotel
comment: Relation between Ethnic Group and Hotel
comment: Relazione tra Ethnic Group e Hotel @it
sub property of: place
type: ObjectProperty
domain: ethnic group

links to Reptile
domain: ethnic group
comment: Relation between Ethnic Group and Reptile
range: reptile
sub property of: species
comment: Relazione tra Ethnic Group e Reptile @it
type: ObjectProperty

links to Sport
type: ObjectProperty
range: sport
comment: Relazione tra Ethnic Group e Sport @it
sub property of: activity
comment: Relation between Ethnic Group and Sport
domain: ethnic group

basketball player
label: joueur de basketball @fr
type: Class

adult actor
label: erwachsener Schauspieler @de
type: Class
label: acteur adulte @fr

links to American Football Team
comment: Relazione tra Ethnic Group e American Football Team @it
range: american football team
comment: Relation between Ethnic Group and American Football Team
domain: ethnic group
sub property of: organização
type: ObjectProperty

ice hockey player
type: Class
label: joueur de hockey sur glace @fr

links to Tennis Player
comment: Relation between Ethnic Group and Tennis Player
comment: Relazione tra Ethnic Group e Tennis Player @it
domain: ethnic group
type: ObjectProperty
sub property of: person
range: tennis player
related match: caption
type: NamedIndividual

Christian Bishop
label: évêque chrétien @fr
type: Class

mountain range
type: Class
label: chaîne de montagne @fr

links to Newspaper
comment: Relation between Ethnic Group and Newspaper
range: newspaper
domain: ethnic group
sub property of: work
comment: Relazione tra Ethnic Group e Newspaper @it
type: ObjectProperty

beverage
type: ObjectProperty
type: Class
label: boisson @fr

links to Record Label
range: record label
type: ObjectProperty
comment: Relazione tra Ethnic Group e Record Label @it
comment: Relation between Ethnic Group and Record Label
domain: ethnic group
sub property of: organização

links to Comics Character
domain: ethnic group
comment: Relazione tra Ethnic Group e Comics Character @it
range: comics character
comment: Relation between Ethnic Group and Comics Character
type: ObjectProperty
sub property of: person

links to Military Person
type: NamedIndividual
related match: caption
domain: ethnic group
type: ObjectProperty
comment: Relazione tra Ethnic Group e Military Person @it
sub property of: person
range: military person
comment: Relation between Ethnic Group and Military Person

links to Cricketer
sub property of: person
domain: ethnic group
range: cricketer
type: ObjectProperty
comment: Relation between Ethnic Group and Cricketer
comment: Relazione tra Ethnic Group e Cricketer @it
related match: caption
type: NamedIndividual

planet
type: ObjectProperty
label: planète @fr
type: Class

links to Tennis League
domain: ethnic group
comment: Relation between Ethnic Group and Tennis League
type: ObjectProperty
sub property of: organização
comment: Relazione tra Ethnic Group e Tennis League @it
range: tennis league

links to Space Shuttle
sub property of: mean of transportation
comment: Relazione tra Ethnic Group e Space Shuttle @it
domain: ethnic group
range: space shuttle
comment: Relation between Ethnic Group and Space Shuttle
type: ObjectProperty

links to Scientist
comment: Relazione tra Ethnic Group e Scientist @it
comment: Relation between Ethnic Group and Scientist
type: ObjectProperty
sub property of: person
domain: ethnic group
range: scientist
related match: caption
type: NamedIndividual

links to Soccer League
sub property of: organização
type: ObjectProperty
domain: ethnic group
comment: Relazione tra Ethnic Group e Soccer League @it
range: soccer league
comment: Relation between Ethnic Group and Soccer League

links to Rugby Player
sub property of: person
range: rugby player
domain: ethnic group
comment: Relation between Ethnic Group and Rugby Player
type: ObjectProperty
comment: Relazione tra Ethnic Group e Rugby Player @it

scientist
label: Wissenschaftler @de
type: Class
label: scientifique @fr

links to Embryology
type: ObjectProperty
comment: Relazione tra Ethnic Group e Embryology @it
domain: ethnic group
range: embryology
sub property of: anatomical structure
comment: Relation between Ethnic Group and Embryology

links to Aircraft
domain: ethnic group
sub property of: mean of transportation
type: ObjectProperty
comment: Relazione tra Ethnic Group e Aircraft @it
comment: Relation between Ethnic Group and Aircraft
range: aircraft

links to Village
domain: ethnic group
comment: Relazione tra Ethnic Group e Village @it
comment: Relation between Ethnic Group and Village
sub property of: place
type: ObjectProperty
range: village

links to Bridge
comment: Relation between Ethnic Group and Bridge
type: ObjectProperty
range: bridge
sub property of: place
domain: ethnic group
comment: Relazione tra Ethnic Group e Bridge @it

golf league
label: ligue de golf @fr
type: Class

links to Cave
comment: Relazione tra Ethnic Group e Cave @it
sub property of: place
range: cave
type: ObjectProperty
domain: ethnic group
comment: Relation between Ethnic Group and Cave

olympics
label: Jeux Olympiques @fr
type: Class

badminton player
label: joueur de badminton @fr
type: Class

organização
type: ObjectProperty
label: organisation
label: Organisation @de

links to Trade Union
range: trade union
comment: Relazione tra Ethnic Group e Trade Union @it
comment: Relation between Ethnic Group and Trade Union
domain: ethnic group
type: ObjectProperty
sub property of: organização

baseball league
type: Class
label: ligue de baseball @fr

links to Chemical Compound
comment: Relation between Ethnic Group and Chemical Compound
range: chemical compound
comment: Relazione tra Ethnic Group e Chemical Compound @it
type: ObjectProperty
domain: ethnic group
sub property of: chemical compound

links to Adult Actor
sub property of: person
comment: Relazione tra Ethnic Group e Adult Actor @it
comment: Relation between Ethnic Group and Adult Actor
domain: ethnic group
range: adult actor
type: ObjectProperty

bridge
type: Class
label: pont @fr

broadcast
type: Class
label: Émission de télévision @fr

mammal
label: mammifère @fr
type: Class

links to College Coach
type: ObjectProperty
range: college coach
sub property of: person
domain: ethnic group
comment: Relazione tra Ethnic Group e College Coach @it
comment: Relation between Ethnic Group and College Coach

comics character
type: Class
label: personnage de bandes dessinées @fr

links to University
sub property of: organização
type: ObjectProperty
comment: Relation between Ethnic Group and University
comment: Relazione tra Ethnic Group e University @it
domain: ethnic group
range: university

links to Gaelic Games Player
domain: ethnic group
comment: Relazione tra Ethnic Group e Gaelic Games Player @it
sub property of: person
range: Gaelic games player
type: ObjectProperty
comment: Relation between Ethnic Group and Gaelic Games Player

event
type: ObjectProperty
label: évènement @fr

Formula One racer
type: Class
label: pilote de formule 1 @fr

links to Military Unit
comment: Relazione tra Ethnic Group e Military Unit @it
comment: Relation between Ethnic Group and Military Unit
type: ObjectProperty
sub property of: organização
domain: ethnic group
range: military unit

skyscraper
label: gratte-ciel @fr
type: Class

links to Wine Region
domain: ethnic group
comment: Relation between Ethnic Group and Wine Region
range: wine region
comment: Relazione tra Ethnic Group e Wine Region @it
type: ObjectProperty
sub property of: place

links to Christian Bishop
comment: Relation between Ethnic Group and Christian Bishop
range: Christian Bishop
sub property of: person
domain: ethnic group
comment: Relazione tra Ethnic Group e Christian Bishop @it
type: ObjectProperty

radio station
label: station de radio @fr
type: Class

links to Canal
sub property of: place
range: canal
comment: Relazione tra Ethnic Group e Canal @it
comment: Relation between Ethnic Group and Canal
type: ObjectProperty
domain: ethnic group

member of parliament
type: Class
label: membre du Parlement @fr

bone
label: os @fr
label: Knochen @de
type: Class

links to Colour
comment: Relazione tra Ethnic Group e Colour @it
sub property of: colour
domain: ethnic group
type: ObjectProperty
range: colour
comment: Relation between Ethnic Group and Colour

Axiom
dbpedia infobox matching weight: 100.0
annotated source: links to Prime Minister
annotated target: caption
annotated property: relatedMatch

links to Magazine
range: magazine
sub property of: work
comment: Relation between Ethnic Group and Magazine
comment: Relazione tra Ethnic Group e Magazine @it
type: ObjectProperty
domain: ethnic group

links to Planet
comment: Relazione tra Ethnic Group e Planet @it
sub property of: planet
type: ObjectProperty
domain: ethnic group
comment: Relation between Ethnic Group and Planet
range: planet

links to Governor
type: NamedIndividual
related match: caption
comment: Relazione tra Ethnic Group e Governor @it
range: governor
domain: ethnic group
type: ObjectProperty
sub property of: person
comment: Relation between Ethnic Group and Governor

conifer
label: conifères @fr
type: Class

airport
label: aéroport @fr
label: Flughafen @de
type: Class

links to Olympic Result
comment: Relation between Ethnic Group and Olympic Result
comment: Relazione tra Ethnic Group e Olympic Result @it
domain: ethnic group
range: olympic result
type: ObjectProperty
sub property of: olympic result

links to Shopping Mall
comment: Relazione tra Ethnic Group e Shopping Mall @it
comment: Relation between Ethnic Group and Shopping Mall
range: shopping mall
type: ObjectProperty
domain: ethnic group
sub property of: place