links to Hotel
comment: Relation between Figure Skater and Hotel
range: hotel
domain: figure skater
sub property of: place
type: ObjectProperty
comment: Relazione tra Figure Skater e Hotel @it

links to Non- Profit Organisation
comment: Relazione tra Figure Skater e Non- Profit Organisation @it
type: ObjectProperty
domain: figure skater
range: non-profit organisation
sub property of: organização
comment: Relation between Figure Skater and Non- Profit Organisation

links to Film Festival
sub property of: event
range: film festival
comment: Relazione tra Figure Skater e Film Festival @it
type: ObjectProperty
comment: Relation between Figure Skater and Film Festival
domain: figure skater

links to World Heritage Site
comment: Relation between Figure Skater and World Heritage Site
domain: figure skater
sub property of: place
range: World Heritage Site
type: ObjectProperty
comment: Relazione tra Figure Skater e World Heritage Site @it

links to Band
range: Band
type: ObjectProperty
comment: Relation between Figure Skater and Band
comment: Relazione tra Figure Skater e Band @it
domain: figure skater
sub property of: organização

links to Soccer Club
domain: figure skater
range: soccer club
sub property of: organização
comment: Relation between Figure Skater and Soccer Club
comment: Relazione tra Figure Skater e Soccer Club @it
type: ObjectProperty

links to Newspaper
sub property of: work
range: newspaper
comment: Relation between Figure Skater and Newspaper
comment: Relazione tra Figure Skater e Newspaper @it
domain: figure skater
type: ObjectProperty

Axiom
dbpedia infobox matching weight: 100.0
annotated source: links to Boxer
annotated target: after
annotated property: relatedMatch

television show
label: émission de télévision @fr
type: Class

disease
label: maladie @fr
type: Class
type: ObjectProperty

links to River
domain: figure skater
sub property of: place
range: river
comment: Relation between Figure Skater and River
comment: Relazione tra Figure Skater e River @it
type: ObjectProperty

rugby player
label: joueur de rugby @fr
type: Class

links to Hockey Team
type: ObjectProperty
domain: figure skater
range: hockey team
sub property of: organização
comment: Relazione tra Figure Skater e Hockey Team @it
comment: Relation between Figure Skater and Hockey Team

Election
label: élection @fr
type: Class

musical
label: musique @fr
type: Class

links to American Football Player
range: american football player
domain: figure skater
comment: Relation between Figure Skater and American Football Player
type: ObjectProperty
comment: Relazione tra Figure Skater e American Football Player @it
sub property of: person

american football player
type: Class
label: joueur de football américain @fr

links to Village
range: village
comment: Relation between Figure Skater and Village
sub property of: place
type: ObjectProperty
domain: figure skater
comment: Relazione tra Figure Skater e Village @it

cyclist
label: cycliste @fr
type: Class

stadium
label: stade @fr
type: Class

place
type: ObjectProperty
label: περιοχή @el
label: lieu @fr
label: lugar @pt

links to Broadcast
sub property of: organização
type: ObjectProperty
domain: figure skater
comment: Relation between Figure Skater and Broadcast
comment: Relazione tra Figure Skater e Broadcast @it
range: broadcast

links to Single
comment: Relation between Figure Skater and Single
range: single
comment: Relazione tra Figure Skater e Single @it
sub property of: work
domain: figure skater
type: ObjectProperty

links to Television Show
type: ObjectProperty
domain: figure skater
comment: Relation between Figure Skater and Television Show
range: television show
comment: Relazione tra Figure Skater e Television Show @it
sub property of: work

links to Stadium
sub property of: place
comment: Relation between Figure Skater and Stadium
type: ObjectProperty
range: stadium
domain: figure skater
comment: Relazione tra Figure Skater e Stadium @it

links to Drug
comment: Relazione tra Figure Skater e Drug @it
domain: figure skater
comment: Relation between Figure Skater and Drug
sub property of: drug
range: drug
type: ObjectProperty

Axiom
dbpedia infobox matching weight: 100.0
annotated property: relatedMatch
annotated target: before
annotated source: links to Cyclist

links to Mountain Range
comment: Relation between Figure Skater and Mountain Range
type: ObjectProperty
comment: Relazione tra Figure Skater e Mountain Range @it
range: mountain range
sub property of: place
domain: figure skater

links to Beverage
range: beverage
domain: figure skater
comment: Relazione tra Figure Skater e Beverage @it
sub property of: beverage
type: ObjectProperty
comment: Relation between Figure Skater and Beverage

links to Museum
sub property of: place
domain: figure skater
comment: Relation between Figure Skater and Museum
range: museum
type: ObjectProperty
comment: Relazione tra Figure Skater e Museum @it

links to Writer
sub property of: person
domain: figure skater
comment: Relazione tra Figure Skater e Writer @it
comment: Relation between Figure Skater and Writer
range: writer
type: ObjectProperty

wrestler
label: lutteur @fr
type: Class

links to Disease
domain: figure skater
comment: Relation between Figure Skater and Disease
comment: Relazione tra Figure Skater e Disease @it
range: disease
sub property of: disease
type: ObjectProperty

species
type: ObjectProperty
label: espèce @fr

senator
label: sénateur @fr
type: Class

links to Town
domain: figure skater
range: town
sub property of: place
type: ObjectProperty
comment: Relazione tra Figure Skater e Town @it
comment: Relation between Figure Skater and Town

comedian
type: Class
label: comédien @fr

links to Election
range: Election
sub property of: event
domain: figure skater
comment: Relation between Figure Skater and Election
type: ObjectProperty
comment: Relazione tra Figure Skater e Election @it

newspaper
type: Class
label: journal @fr

links to Airline
type: ObjectProperty
comment: Relation between Figure Skater and Airline
sub property of: organização
range: airline
domain: figure skater
comment: Relazione tra Figure Skater e Airline @it

boxer
type: Class
label: boxeur @fr

book
type: Class
label: livre @fr
label: βιβλίο @el
label: książka @pl
label: llibre @ca

links to College Coach
domain: figure skater
sub property of: person
comment: Relation between Figure Skater and College Coach
comment: Relazione tra Figure Skater e College Coach @it
type: ObjectProperty
range: college coach

World Heritage Site
type: Class
label: site du patrimoine mondial @fr

language
type: ObjectProperty
label: langage @fr
type: Class

ski area
label: domaine skiable @fr
type: Class

links to Legislature
range: legislature
domain: figure skater
comment: Relation between Figure Skater and Legislature
sub property of: organização
type: ObjectProperty
comment: Relazione tra Figure Skater e Legislature @it

non-profit organisation
label: organisation à but non lucratif @fr
type: Class

Axiom
dbpedia infobox matching weight: 100.0
annotated property: relatedMatch
annotated source: links to Cricketer
annotated target: after

lake
type: Class
label: lac @fr

links to Musical
sub property of: work
range: musical
comment: Relazione tra Figure Skater e Musical @it
type: ObjectProperty
domain: figure skater
comment: Relation between Figure Skater and Musical

links to Rugby Player
range: rugby player
sub property of: person
domain: figure skater
comment: Relation between Figure Skater and Rugby Player
type: ObjectProperty
comment: Relazione tra Figure Skater e Rugby Player @it

links to Ice Hockey League
type: ObjectProperty
sub property of: organização
comment: Relazione tra Figure Skater e Ice Hockey League @it
domain: figure skater
comment: Relation between Figure Skater and Ice Hockey League
range: ice hockey league

drug
type: Class
label: médicament @fr
type: ObjectProperty

work
label: obra @pt
label: travail @fr
type: ObjectProperty

river
type: Class
label: rivière @fr

links to Television Episode
comment: Relation between Figure Skater and Television Episode
sub property of: work
type: ObjectProperty
range: television episode
domain: figure skater
comment: Relazione tra Figure Skater e Television Episode @it

magazine
label: περιοδικό @el
type: Class

links to Military Person
comment: Relation between Figure Skater and Military Person
sub property of: person
domain: figure skater
type: ObjectProperty
range: military person
comment: Relazione tra Figure Skater e Military Person @it

school
type: Class
label: école @fr

museum
type: Class
label: musée @fr

tennis player
type: Class
label: joueur de tennis @fr

links to Tennis Player
comment: Relation between Figure Skater and Tennis Player
range: tennis player
type: ObjectProperty
sub property of: person
domain: figure skater
comment: Relazione tra Figure Skater e Tennis Player @it
related match: after
type: NamedIndividual

links to Currency
comment: Relazione tra Figure Skater e Currency @it
domain: figure skater
sub property of: currency
type: ObjectProperty
comment: Relation between Figure Skater and Currency
range: currency

links to Muscle
comment: Relation between Figure Skater and Muscle
type: ObjectProperty
comment: Relazione tra Figure Skater e Muscle @it
domain: figure skater
sub property of: anatomical structure
range: muscle

links to School
type: ObjectProperty
domain: figure skater
sub property of: organização
comment: Relazione tra Figure Skater e School @it
comment: Relation between Figure Skater and School
range: school

links to British Royalty
domain: figure skater
comment: Relazione tra Figure Skater e British Royalty @it
range: British royalty
type: ObjectProperty
sub property of: person
comment: Relation between Figure Skater and British Royalty

military person
type: Class
label: militaire @fr

currency
type: ObjectProperty
label: devise @fr
type: Class

award
type: Class
label: récompense @fr
type: ObjectProperty

prime minister
label: premier ministre @fr
type: Class

British royalty
type: Class
label: royauté Britannique @fr

links to Eurovision Song Contest Entry
comment: Relazione tra Figure Skater e Eurovision Song Contest Entry @it
range: Eurovision song contest entry
domain: figure skater
type: ObjectProperty
comment: Relation between Figure Skater and Eurovision Song Contest Entry
sub property of: work

historic place
label: site historique @fr
type: Class

hospital
label: hôpital @fr
type: Class

anatomical structure
type: ObjectProperty
label: structure anatomique @fr

links to Radio Station
type: ObjectProperty
sub property of: organização
comment: Relation between Figure Skater and Radio Station
domain: figure skater
range: radio station
comment: Relazione tra Figure Skater e Radio Station @it

Axiom
dbpedia infobox matching weight: 100.0
annotated source: links to Tennis Player
annotated property: relatedMatch
annotated target: after

cricketer
type: Class
label: joueur de cricket @fr

single
type: Class

links to Music Genre
sub property of: music genre
type: ObjectProperty
comment: Relation between Figure Skater and Music Genre
range: music genre
domain: figure skater
comment: Relazione tra Figure Skater e Music Genre @it

Band
label: banda @pt
label: Musikgruppe @de
type: Class
label: groupe de musique @fr

links to Prime Minister
sub property of: person
comment: Relazione tra Figure Skater e Prime Minister @it
domain: figure skater
range: prime minister
comment: Relation between Figure Skater and Prime Minister
type: ObjectProperty

town
label: ville @fr
type: Class

links to Continent
domain: figure skater
range: continent
sub property of: place
comment: Relation between Figure Skater and Continent
comment: Relazione tra Figure Skater e Continent @it
type: ObjectProperty

university
type: Class
label: université @fr
label: πανεπιστήμιο @el

links to Historic Place
comment: Relazione tra Figure Skater e Historic Place @it
range: historic place
domain: figure skater
sub property of: place
comment: Relation between Figure Skater and Historic Place
type: ObjectProperty

links to Album
range: album
comment: Relazione tra Figure Skater e Album @it
domain: figure skater
sub property of: work
type: ObjectProperty
comment: Relation between Figure Skater and Album

continent
type: Class
label: ήπειρος @el

ethnic group
type: Class
type: ObjectProperty
label: groupe ethnique @fr

president
label: président @fr
type: Class

album
label: Album @de
type: Class

figure skater
label: patineur artistique @fr
type: Class

links to Office Holder
type: ObjectProperty
sub property of: person
range: office holder
comment: Relation between Figure Skater and Office Holder
domain: figure skater
comment: Relazione tra Figure Skater e Office Holder @it

links to Cyclist
sub property of: person
type: ObjectProperty
domain: figure skater
range: cyclist
comment: Relation between Figure Skater and Cyclist
comment: Relazione tra Figure Skater e Cyclist @it
type: NamedIndividual
related match: before

links to Adult Actor
domain: figure skater
sub property of: person
range: adult actor
comment: Relation between Figure Skater and Adult Actor
comment: Relazione tra Figure Skater e Adult Actor @it
type: ObjectProperty

links to Wrestler
type: ObjectProperty
comment: Relazione tra Figure Skater e Wrestler @it
sub property of: person
comment: Relation between Figure Skater and Wrestler
domain: figure skater
range: wrestler

links to Film
domain: figure skater
comment: Relation between Figure Skater and Film
sub property of: work
type: ObjectProperty
range: film
comment: Relazione tra Figure Skater e Film @it

hotel
label: hôtel @fr
type: Class

person
label: personne @fr
type: ObjectProperty
label: pessoa @pt
label: Person @de

military unit
type: Class
label: unité militaire @fr

links to Lake
sub property of: place
comment: Relazione tra Figure Skater e Lake @it
domain: figure skater
range: lake
comment: Relation between Figure Skater and Lake
type: ObjectProperty

links to Architect
sub property of: person
range: architect
comment: Relation between Figure Skater and Architect
type: ObjectProperty
domain: figure skater
comment: Relazione tra Figure Skater e Architect @it

college coach
label: entraîneur universitaire @fr
type: Class

television episode
type: Class
label: épisode télévisé @fr

soccer manager
type: Class
label: entraîneur de football @fr

muscle
type: Class

links to Book
comment: Relation between Figure Skater and Book
comment: Relazione tra Figure Skater e Book @it
range: book
type: ObjectProperty
domain: figure skater
sub property of: work

village
type: Class
label: χωριό @el

ice hockey league
label: ligue d'hockey sur glace @fr
type: Class

soccer club
label: club de football @fr
type: Class

music genre
type: Class
label: género musical @pt
type: ObjectProperty
label: genre musical @fr

writer
type: Class
label: écrivain @fr

baseball player
type: Class
label: joueur de baseball @fr

office holder
label: titulaire @fr
label: Amtsinhaber @de
type: Class

architect
type: Class
label: architecte @fr

military conflict
type: Class
label: conflit militaire @fr

links to Comics Character
range: comics character
type: ObjectProperty
comment: Relation between Figure Skater and Comics Character
domain: figure skater
sub property of: person
comment: Relazione tra Figure Skater e Comics Character @it

olympic result
label: résultat de Jeux Olympiques @fr
type: Class
type: ObjectProperty

links to Hospital
range: hospital
comment: Relazione tra Figure Skater e Hospital @it
comment: Relation between Figure Skater and Hospital
type: ObjectProperty
domain: figure skater
sub property of: place

links to Soccer Player
range: soccer player
sub property of: person
type: ObjectProperty
comment: Relation between Figure Skater and Soccer Player
domain: figure skater
comment: Relazione tra Figure Skater e Soccer Player @it

links to Baseball Player
comment: Relazione tra Figure Skater e Baseball Player @it
comment: Relation between Figure Skater and Baseball Player
sub property of: person
domain: figure skater
type: ObjectProperty
range: baseball player

links to Member Of Parliament
comment: Relazione tra Figure Skater e Member Of Parliament @it
domain: figure skater
range: member of parliament
comment: Relation between Figure Skater and Member Of Parliament
type: ObjectProperty
sub property of: person

film festival
label: festival du film @fr
type: Class

basketball player
type: Class
label: joueur de basketball @fr

adult actor
label: acteur adulte @fr
type: Class
label: erwachsener Schauspieler @de

links to Boxer
type: ObjectProperty
domain: figure skater
range: boxer
sub property of: person
comment: Relazione tra Figure Skater e Boxer @it
comment: Relation between Figure Skater and Boxer
type: NamedIndividual
related match: after

links to University
type: ObjectProperty
range: university
domain: figure skater
comment: Relazione tra Figure Skater e University @it
comment: Relation between Figure Skater and University
sub property of: organização

links to Ice Hockey Player
comment: Relazione tra Figure Skater e Ice Hockey Player @it
type: ObjectProperty
sub property of: person
comment: Relation between Figure Skater and Ice Hockey Player
range: ice hockey player
domain: figure skater

ice hockey player
label: joueur de hockey sur glace @fr
type: Class

links to Basketball Player
type: ObjectProperty
comment: Relation between Figure Skater and Basketball Player
range: basketball player
comment: Relazione tra Figure Skater e Basketball Player @it
domain: figure skater
sub property of: person

links to Chancellor
comment: Relation between Figure Skater and Chancellor
comment: Relazione tra Figure Skater e Chancellor @it
type: ObjectProperty
sub property of: person
domain: figure skater
range: chancellor

links to Senator
sub property of: person
comment: Relation between Figure Skater and Senator
comment: Relazione tra Figure Skater e Senator @it
domain: figure skater
range: senator
type: ObjectProperty

mountain range
label: chaîne de montagne @fr
type: Class

beverage
type: ObjectProperty
type: Class
label: boisson @fr

chancellor
type: Class
label: chancelier @fr

planet
type: Class
label: planète @fr
type: ObjectProperty

FigureSkater.owl
has intent: To represent the encyclopedic knowledge expressed by an object typed as FigureSkater
has author: Valentina Presutti
extracted from: dbpedia.org
has author: Andrea Giovanni Nuzzolese
extracted from: en.wikipedia.org
has author: Aldo Gangemi
type: Ontology
imports: cpannotationschema.owl
imports: dbpediainfoboxmatchingweight.owl
comment: FigureSkater Encyclopedic Knowledge Pattern

hockey team
type: Class
label: équipe de hockey @fr

links to Comedian
comment: Relazione tra Figure Skater e Comedian @it
type: ObjectProperty
sub property of: person
comment: Relation between Figure Skater and Comedian
domain: figure skater
range: comedian

soccer player
label: joueur de football @fr
type: Class

scientist
label: Wissenschaftler @de
type: Class
label: scientifique @fr

links to Mammal
comment: Relation between Figure Skater and Mammal
sub property of: species
type: ObjectProperty
range: mammal
comment: Relazione tra Figure Skater e Mammal @it
domain: figure skater

links to President
comment: Relation between Figure Skater and President
type: ObjectProperty
domain: figure skater
sub property of: person
comment: Relazione tra Figure Skater e President @it
range: president

links to Language
type: ObjectProperty
domain: figure skater
sub property of: language
comment: Relazione tra Figure Skater e Language @it
comment: Relation between Figure Skater and Language
range: language

legislature
type: Class
label: pouvoir législatif @fr

links to Airport
type: ObjectProperty
comment: Relazione tra Figure Skater e Airport @it
range: airport
sub property of: place
domain: figure skater
comment: Relation between Figure Skater and Airport

links to Planet
sub property of: planet
comment: Relazione tra Figure Skater e Planet @it
range: planet
comment: Relation between Figure Skater and Planet
type: ObjectProperty
domain: figure skater

links to Island
comment: Relation between Figure Skater and Island
type: ObjectProperty
range: island
sub property of: place
comment: Relazione tra Figure Skater e Island @it
domain: figure skater

airline
type: Class
label: compagnie aérienne @fr

links to Military Conflict
domain: figure skater
comment: Relation between Figure Skater and Military Conflict
type: ObjectProperty
comment: Relazione tra Figure Skater e Military Conflict @it
range: military conflict
sub property of: event

organização
type: ObjectProperty
label: organisation
label: Organisation @de

links to Scientist
sub property of: person
comment: Relation between Figure Skater and Scientist
domain: figure skater
comment: Relazione tra Figure Skater e Scientist @it
range: scientist
type: ObjectProperty

journalist
label: journaliste @fr
type: Class

broadcast
type: Class
label: Émission de télévision @fr

links to Olympic Result
type: ObjectProperty
comment: Relazione tra Figure Skater e Olympic Result @it
sub property of: olympic result
comment: Relation between Figure Skater and Olympic Result
range: olympic result
domain: figure skater

film
label: ταινία @el
type: Class

mammal
type: Class
label: mammifère @fr

Eurovision song contest entry
type: Class
label: concours Eurovision de la chanson @fr

links to Soccer Manager
range: soccer manager
sub property of: person
domain: figure skater
comment: Relation between Figure Skater and Soccer Manager
comment: Relazione tra Figure Skater e Soccer Manager @it
type: ObjectProperty

island
label: île @fr
label: νησί @el
type: Class

links to Magazine
type: ObjectProperty
range: magazine
comment: Relation between Figure Skater and Magazine
domain: figure skater
comment: Relazione tra Figure Skater e Magazine @it
sub property of: work

links to Ethnic Group
comment: Relazione tra Figure Skater e Ethnic Group @it
range: ethnic group
sub property of: ethnic group
comment: Relation between Figure Skater and Ethnic Group
domain: figure skater
type: ObjectProperty

links to Military Unit
sub property of: organização
domain: figure skater
comment: Relazione tra Figure Skater e Military Unit @it
range: military unit
type: ObjectProperty
comment: Relation between Figure Skater and Military Unit

comics character
type: Class
label: personnage de bandes dessinées @fr

event
label: évènement @fr
type: ObjectProperty

radio station
type: Class
label: station de radio @fr

links to Cricketer
comment: Relazione tra Figure Skater e Cricketer @it
domain: figure skater
comment: Relation between Figure Skater and Cricketer
type: ObjectProperty
sub property of: person
range: cricketer
related match: after
type: NamedIndividual

links to Ski Area
domain: figure skater
comment: Relazione tra Figure Skater e Ski Area @it
type: ObjectProperty
range: ski area
comment: Relation between Figure Skater and Ski Area
sub property of: place

member of parliament
type: Class
label: membre du Parlement @fr

links to Journalist
comment: Relazione tra Figure Skater e Journalist @it
comment: Relation between Figure Skater and Journalist
range: journalist
type: ObjectProperty
domain: figure skater
sub property of: person

links to Award
comment: Relation between Figure Skater and Award
type: ObjectProperty
comment: Relazione tra Figure Skater e Award @it
range: award
domain: figure skater
sub property of: award

airport
label: aéroport @fr
label: Flughafen @de
type: Class