links to Stadium
comment: Relation between Film Festival and Stadium
type: ObjectProperty
comment: Relazione tra Film Festival e Stadium @it
range: stadium
sub property of: place
domain: film festival

links to Architect
type: ObjectProperty
sub property of: person
comment: Relazione tra Film Festival e Architect @it
domain: film festival
comment: Relation between Film Festival and Architect
range: architect

television show
type: Class
label: émission de télévision @fr

links to Album
domain: film festival
comment: Relation between Film Festival and Album
range: album
comment: Relazione tra Film Festival e Album @it
sub property of: work
type: ObjectProperty

park
type: Class
label: parc @fr

disease
type: ObjectProperty
type: Class
label: maladie @fr

links to Broadcast
domain: film festival
range: broadcast
comment: Relation between Film Festival and Broadcast
comment: Relazione tra Film Festival e Broadcast @it
type: ObjectProperty
sub property of: organização

links to Single
comment: Relazione tra Film Festival e Single @it
comment: Relation between Film Festival and Single
domain: film festival
type: ObjectProperty
range: single
sub property of: work

links to Ethnic Group
sub property of: ethnic group
comment: Relation between Film Festival and Ethnic Group
range: ethnic group
type: ObjectProperty
comment: Relazione tra Film Festival e Ethnic Group @it
domain: film festival

links to Airline
domain: film festival
range: airline
sub property of: organização
type: ObjectProperty
comment: Relazione tra Film Festival e Airline @it
comment: Relation between Film Festival and Airline

musical
type: Class
label: musique @fr

Election
label: élection @fr
type: Class

links to Monarch
comment: Relazione tra Film Festival e Monarch @it
comment: Relation between Film Festival and Monarch
range: monarch
sub property of: person
type: ObjectProperty
domain: film festival

links to Soccer Player
comment: Relazione tra Film Festival e Soccer Player @it
comment: Relation between Film Festival and Soccer Player
domain: film festival
range: soccer player
sub property of: person
type: ObjectProperty

stadium
label: stade @fr
type: Class

place
label: lugar @pt
label: lieu @fr
label: περιοχή @el
type: ObjectProperty

links to Mayor
sub property of: person
type: ObjectProperty
range: mayor
comment: Relazione tra Film Festival e Mayor @it
domain: film festival
comment: Relation between Film Festival and Mayor

links to Cricketer
domain: film festival
range: cricketer
comment: Relation between Film Festival and Cricketer
type: ObjectProperty
comment: Relazione tra Film Festival e Cricketer @it
sub property of: person

mountain
label: Βουνό @el
label: montagne @fr
type: Class

links to Comics Character
range: comics character
comment: Relation between Film Festival and Comics Character
comment: Relazione tra Film Festival e Comics Character @it
type: ObjectProperty
sub property of: person
domain: film festival

wrestler
label: lutteur @fr
type: Class

links to Wrestler
type: ObjectProperty
comment: Relazione tra Film Festival e Wrestler @it
domain: film festival
sub property of: person
comment: Relation between Film Festival and Wrestler
range: wrestler

criminal
type: Class
label: criminel @fr

mayor
type: Class
label: maire @fr

species
type: ObjectProperty
label: espèce @fr

senator
label: sénateur @fr
type: Class

comedian
label: comédien @fr
type: Class

links to Comedian
comment: Relation between Film Festival and Comedian
domain: film festival
range: comedian
comment: Relazione tra Film Festival e Comedian @it
sub property of: person
type: ObjectProperty

links to Radio Station
domain: film festival
comment: Relazione tra Film Festival e Radio Station @it
type: ObjectProperty
sub property of: organização
range: radio station
comment: Relation between Film Festival and Radio Station

newspaper
label: journal @fr
type: Class

links to Non- Profit Organisation
type: ObjectProperty
sub property of: organização
domain: film festival
range: non-profit organisation
comment: Relazione tra Film Festival e Non- Profit Organisation @it
comment: Relation between Film Festival and Non- Profit Organisation

links to Member Of Parliament
domain: film festival
comment: Relation between Film Festival and Member Of Parliament
comment: Relazione tra Film Festival e Member Of Parliament @it
sub property of: person
type: ObjectProperty
range: member of parliament

links to Office Holder
sub property of: person
range: office holder
comment: Relazione tra Film Festival e Office Holder @it
type: ObjectProperty
domain: film festival
comment: Relation between Film Festival and Office Holder

convention
label: congrès @fr
type: Class

links to Town
domain: film festival
range: town
comment: Relazione tra Film Festival e Town @it
comment: Relation between Film Festival and Town
sub property of: place
type: ObjectProperty

book
label: llibre @ca
label: książka @pl
label: βιβλίο @el
label: livre @fr
type: Class

World Heritage Site
type: Class
label: site du patrimoine mondial @fr

shopping mall
label: centre commercial @fr
type: Class

links to Congressman
domain: film festival
comment: Relazione tra Film Festival e Congressman @it
type: ObjectProperty
sub property of: person
range: congressman
comment: Relation between Film Festival and Congressman

links to British Royalty
domain: film festival
comment: Relation between Film Festival and British Royalty
range: British royalty
comment: Relazione tra Film Festival e British Royalty @it
sub property of: person
type: ObjectProperty

language
type: Class
label: langage @fr
type: ObjectProperty

links to University
type: ObjectProperty
sub property of: organização
comment: Relation between Film Festival and University
comment: Relazione tra Film Festival e University @it
domain: film festival
range: university

non-profit organisation
label: organisation à but non lucratif @fr
type: Class

links to World Heritage Site
range: World Heritage Site
sub property of: place
domain: film festival
type: ObjectProperty
comment: Relation between Film Festival and World Heritage Site
comment: Relazione tra Film Festival e World Heritage Site @it

links to Musical Artist
comment: Relazione tra Film Festival e Musical Artist @it
type: ObjectProperty
domain: film festival
sub property of: person
range: musical artist
comment: Relation between Film Festival and Musical Artist

links to Skyscraper
range: skyscraper
comment: Relazione tra Film Festival e Skyscraper @it
sub property of: place
domain: film festival
comment: Relation between Film Festival and Skyscraper
type: ObjectProperty

links to Television Show
range: television show
comment: Relazione tra Film Festival e Television Show @it
domain: film festival
type: ObjectProperty
sub property of: work
comment: Relation between Film Festival and Television Show

Axiom
dbpedia infobox matching weight: 100.0
annotated target: language
annotated source: links to Language
annotated property: relatedMatch

links to Island
type: ObjectProperty
comment: Relation between Film Festival and Island
range: island
comment: Relazione tra Film Festival e Island @it
sub property of: place
domain: film festival

links to Newspaper
comment: Relazione tra Film Festival e Newspaper @it
type: ObjectProperty
comment: Relation between Film Festival and Newspaper
range: newspaper
sub property of: work
domain: film festival

governor
label: gouverneur @fr
type: Class

links to Shopping Mall
sub property of: place
domain: film festival
comment: Relation between Film Festival and Shopping Mall
range: shopping mall
type: ObjectProperty
comment: Relazione tra Film Festival e Shopping Mall @it

work
type: ObjectProperty
label: travail @fr
label: obra @pt

links to Museum
range: museum
sub property of: place
comment: Relazione tra Film Festival e Museum @it
type: ObjectProperty
comment: Relation between Film Festival and Museum
domain: film festival

links to Continent
sub property of: place
domain: film festival
type: ObjectProperty
comment: Relazione tra Film Festival e Continent @it
comment: Relation between Film Festival and Continent
range: continent

magazine
label: περιοδικό @el
type: Class

school
type: Class
label: école @fr

links to Mountain
comment: Relazione tra Film Festival e Mountain @it
comment: Relation between Film Festival and Mountain
range: mountain
type: ObjectProperty
sub property of: place
domain: film festival

museum
type: Class
label: musée @fr

links to Legislature
domain: film festival
comment: Relazione tra Film Festival e Legislature @it
sub property of: organização
type: ObjectProperty
comment: Relation between Film Festival and Legislature
range: legislature

video game
label: jeux vidéo @fr
type: Class

trade union
type: Class
label: syndicat professionnel @fr

links to Military Conflict
comment: Relazione tra Film Festival e Military Conflict @it
sub property of: event
comment: Relation between Film Festival and Military Conflict
domain: film festival
range: military conflict
type: ObjectProperty

military person
type: Class
label: militaire @fr

philosopher
label: philosophe @fr
type: Class

currency
label: devise @fr
type: Class
type: ObjectProperty

links to Mammal
sub property of: species
range: mammal
comment: Relation between Film Festival and Mammal
domain: film festival
type: ObjectProperty
comment: Relazione tra Film Festival e Mammal @it

British royalty
label: royauté Britannique @fr
type: Class

links to President
type: ObjectProperty
domain: film festival
sub property of: person
range: president
comment: Relation between Film Festival and President
comment: Relazione tra Film Festival e President @it

links to Historic Place
range: historic place
comment: Relation between Film Festival and Historic Place
type: ObjectProperty
comment: Relazione tra Film Festival e Historic Place @it
domain: film festival
sub property of: place

historic place
label: site historique @fr
type: Class

links to Park
comment: Relazione tra Film Festival e Park @it
comment: Relation between Film Festival and Park
domain: film festival
type: ObjectProperty
sub property of: place
range: park

links to Music Festival
range: music festival
domain: film festival
comment: Relazione tra Film Festival e Music Festival @it
type: ObjectProperty
comment: Relation between Film Festival and Music Festival
sub property of: event

cricketer
label: joueur de cricket @fr
type: Class

links to Musical
comment: Relazione tra Film Festival e Musical @it
range: musical
type: ObjectProperty
domain: film festival
comment: Relation between Film Festival and Musical
sub property of: work

single
type: Class

Band
label: groupe de musique @fr
type: Class
label: Musikgruppe @de
label: banda @pt

links to Bird
type: ObjectProperty
comment: Relation between Film Festival and Bird
comment: Relazione tra Film Festival e Bird @it
range: bird
domain: film festival
sub property of: species

town
label: ville @fr
type: Class

university
label: πανεπιστήμιο @el
label: université @fr
type: Class

continent
type: Class
label: ήπειρος @el

ethnic group
type: Class
type: ObjectProperty
label: groupe ethnique @fr

links to Soccer Manager
domain: film festival
range: soccer manager
comment: Relazione tra Film Festival e Soccer Manager @it
sub property of: person
comment: Relation between Film Festival and Soccer Manager
type: ObjectProperty

president
type: Class
label: président @fr

album
label: Album @de
type: Class

links to Military Person
comment: Relazione tra Film Festival e Military Person @it
comment: Relation between Film Festival and Military Person
sub property of: person
type: ObjectProperty
domain: film festival
range: military person

links to Trade Union
comment: Relation between Film Festival and Trade Union
type: ObjectProperty
comment: Relazione tra Film Festival e Trade Union @it
range: trade union
domain: film festival
sub property of: organização

links to Criminal
comment: Relazione tra Film Festival e Criminal @it
comment: Relation between Film Festival and Criminal
type: ObjectProperty
domain: film festival
range: criminal
sub property of: person

links to Convention
domain: film festival
type: ObjectProperty
range: convention
comment: Relazione tra Film Festival e Convention @it
sub property of: event
comment: Relation between Film Festival and Convention

music festival
type: Class
label: festival de musique @fr

person
label: personne @fr
label: pessoa @pt
type: ObjectProperty
label: Person @de

links to Journalist
range: journalist
type: ObjectProperty
sub property of: person
domain: film festival
comment: Relazione tra Film Festival e Journalist @it
comment: Relation between Film Festival and Journalist

links to Television Episode
comment: Relazione tra Film Festival e Television Episode @it
range: television episode
domain: film festival
type: ObjectProperty
sub property of: work
comment: Relation between Film Festival and Television Episode

links to Adult Actor
comment: Relation between Film Festival and Adult Actor
domain: film festival
sub property of: person
range: adult actor
type: ObjectProperty
comment: Relazione tra Film Festival e Adult Actor @it

television episode
label: épisode télévisé @fr
type: Class

soccer manager
label: entraîneur de football @fr
type: Class

village
type: Class
label: χωριό @el

links to Plant
type: ObjectProperty
domain: film festival
comment: Relazione tra Film Festival e Plant @it
comment: Relation between Film Festival and Plant
sub property of: species
range: plant

links to Village
range: village
comment: Relazione tra Film Festival e Village @it
domain: film festival
sub property of: place
comment: Relation between Film Festival and Village
type: ObjectProperty

office holder
label: titulaire @fr
label: Amtsinhaber @de
type: Class

baseball player
label: joueur de baseball @fr
type: Class

military conflict
type: Class
label: conflit militaire @fr

architect
type: Class
label: architecte @fr

model
type: Class
label: mannequin @fr

links to Airport
range: airport
comment: Relation between Film Festival and Airport
comment: Relazione tra Film Festival e Airport @it
sub property of: place
domain: film festival
type: ObjectProperty

links to Senator
comment: Relation between Film Festival and Senator
domain: film festival
comment: Relazione tra Film Festival e Senator @it
sub property of: person
range: senator
type: ObjectProperty

links to Currency
type: ObjectProperty
domain: film festival
range: currency
comment: Relazione tra Film Festival e Currency @it
comment: Relation between Film Festival and Currency
sub property of: currency

film festival
label: festival du film @fr
type: Class

adult actor
label: erwachsener Schauspieler @de
type: Class
label: acteur adulte @fr

links to Band
range: Band
type: ObjectProperty
comment: Relazione tra Film Festival e Band @it
sub property of: organização
comment: Relation between Film Festival and Band
domain: film festival

links to Book
range: book
domain: film festival
comment: Relazione tra Film Festival e Book @it
comment: Relation between Film Festival and Book
type: ObjectProperty
sub property of: work

links to Philosopher
comment: Relation between Film Festival and Philosopher
domain: film festival
range: philosopher
comment: Relazione tra Film Festival e Philosopher @it
type: ObjectProperty
sub property of: person

links to Election
sub property of: event
range: Election
comment: Relazione tra Film Festival e Election @it
type: ObjectProperty
comment: Relation between Film Festival and Election
domain: film festival

links to Scientist
type: ObjectProperty
domain: film festival
range: scientist
sub property of: person
comment: Relation between Film Festival and Scientist
comment: Relazione tra Film Festival e Scientist @it

beverage
label: boisson @fr
type: Class
type: ObjectProperty

comics creator
type: Class
label: créateur de bandes dessinées @fr

soccer player
label: joueur de football @fr
type: Class

scientist
label: scientifique @fr
label: Wissenschaftler @de
type: Class

legislature
type: Class
label: pouvoir législatif @fr

links to Model
type: ObjectProperty
sub property of: person
domain: film festival
range: model
comment: Relation between Film Festival and Model
comment: Relazione tra Film Festival e Model @it

links to Video Game
comment: Relazione tra Film Festival e Video Game @it
comment: Relation between Film Festival and Video Game
domain: film festival
sub property of: work
type: ObjectProperty
range: video game

links to Magazine
type: ObjectProperty
range: magazine
comment: Relazione tra Film Festival e Magazine @it
sub property of: work
domain: film festival
comment: Relation between Film Festival and Magazine

links to School
type: ObjectProperty
range: school
sub property of: organização
comment: Relation between Film Festival and School
domain: film festival
comment: Relazione tra Film Festival e School @it

airline
label: compagnie aérienne @fr
type: Class

organização
type: ObjectProperty
label: organisation
label: Organisation @de

monarch
type: Class
label: monarque @fr

congressman
label: membre du Congrès @fr
type: Class

FilmFestival.owl
type: Ontology
extracted from: en.wikipedia.org
imports: dbpediainfoboxmatchingweight.owl
has author: Valentina Presutti
has intent: To represent the encyclopedic knowledge expressed by an object typed as FilmFestival
has author: Andrea Giovanni Nuzzolese
extracted from: dbpedia.org
has author: Aldo Gangemi
imports: cpannotationschema.owl
comment: FilmFestival Encyclopedic Knowledge Pattern

journalist
label: journaliste @fr
type: Class

plant
label: plante @fr
type: Class

links to Disease
sub property of: disease
comment: Relazione tra Film Festival e Disease @it
type: ObjectProperty
domain: film festival
comment: Relation between Film Festival and Disease
range: disease

broadcast
type: Class
label: Émission de télévision @fr

links to Language
type: ObjectProperty
range: language
comment: Relazione tra Film Festival e Language @it
comment: Relation between Film Festival and Language
domain: film festival
sub property of: language
type: NamedIndividual
related match: language

mammal
label: mammifère @fr
type: Class

island
label: île @fr
label: νησί @el
type: Class

links to Beverage
range: beverage
sub property of: beverage
comment: Relazione tra Film Festival e Beverage @it
comment: Relation between Film Festival and Beverage
type: ObjectProperty
domain: film festival

comics character
type: Class
label: personnage de bandes dessinées @fr

bird
label: oiseau @fr
type: Class

event
label: évènement @fr
type: ObjectProperty

skyscraper
type: Class
label: gratte-ciel @fr

radio station
label: station de radio @fr
type: Class

links to Baseball Player
domain: film festival
sub property of: person
range: baseball player
comment: Relazione tra Film Festival e Baseball Player @it
type: ObjectProperty
comment: Relation between Film Festival and Baseball Player

links to Comics Creator
type: ObjectProperty
domain: film festival
range: comics creator
comment: Relazione tra Film Festival e Comics Creator @it
sub property of: person
comment: Relation between Film Festival and Comics Creator

member of parliament
type: Class
label: membre du Parlement @fr

musical artist
label: musicien @fr
type: Class
label: artista musical @pt

airport
label: aéroport @fr
label: Flughafen @de
type: Class

links to Governor
domain: film festival
range: governor
sub property of: person
type: ObjectProperty
comment: Relazione tra Film Festival e Governor @it
comment: Relation between Film Festival and Governor