links to Village
comment: Relation between Flowering Plant and Village
type: ObjectProperty
sub property of: place
range: village
comment: Relazione tra Flowering Plant e Village @it
domain: flowering plant

links to Actor
sub property of: person
domain: flowering plant
range: actor
comment: Relation between Flowering Plant and Actor
comment: Relazione tra Flowering Plant e Actor @it
type: ObjectProperty

links to Legislature
range: legislature
comment: Relazione tra Flowering Plant e Legislature @it
type: ObjectProperty
comment: Relation between Flowering Plant and Legislature
sub property of: organização
domain: flowering plant

television show
label: émission de télévision @fr
type: Class

park
label: parc @fr
type: Class

brain
label: cerveau @fr
type: Class

links to Fern
sub property of: species
domain: flowering plant
type: ObjectProperty
comment: Relation between Flowering Plant and Fern
range: fern
comment: Relazione tra Flowering Plant e Fern @it

disease
label: maladie @fr
type: Class
type: ObjectProperty

links to Website
comment: Relazione tra Flowering Plant e Website @it
domain: flowering plant
sub property of: website
range: website
type: ObjectProperty
comment: Relation between Flowering Plant and Website

links to School
domain: flowering plant
comment: Relation between Flowering Plant and School
range: school
sub property of: organização
type: ObjectProperty
comment: Relazione tra Flowering Plant e School @it

links to Amphibian
domain: flowering plant
comment: Relation between Flowering Plant and Amphibian
comment: Relazione tra Flowering Plant e Amphibian @it
type: ObjectProperty
sub property of: species
range: amphibian

links to Park
sub property of: place
domain: flowering plant
type: ObjectProperty
range: park
comment: Relazione tra Flowering Plant e Park @it
comment: Relation between Flowering Plant and Park

links to Olympics
sub property of: event
type: ObjectProperty
domain: flowering plant
comment: Relazione tra Flowering Plant e Olympics @it
comment: Relation between Flowering Plant and Olympics
range: olympics

actor
label: Schauspieler @de
type: Class
label: acteur @fr

mean of transportation
label: moyen de transport @fr
type: ObjectProperty

Legal Case
label: cas juridique @fr
type: ObjectProperty

links to Film
range: film
comment: Relation between Flowering Plant and Film
comment: Relazione tra Flowering Plant e Film @it
domain: flowering plant
type: ObjectProperty
sub property of: work

stadium
label: stade @fr
type: Class

links to Disease
type: ObjectProperty
comment: Relazione tra Flowering Plant e Disease @it
comment: Relation between Flowering Plant and Disease
sub property of: disease
domain: flowering plant
range: disease

place
type: ObjectProperty
label: περιοχή @el
label: lieu @fr
label: lugar @pt

links to Valley
domain: flowering plant
comment: Relazione tra Flowering Plant e Valley @it
type: ObjectProperty
sub property of: place
range: valley
comment: Relation between Flowering Plant and Valley

links to Museum
type: ObjectProperty
sub property of: place
comment: Relation between Flowering Plant and Museum
range: museum
domain: flowering plant
comment: Relazione tra Flowering Plant e Museum @it

links to Site Of Special Scientific Interest
comment: Relazione tra Flowering Plant e Site Of Special Scientific Interest @it
domain: flowering plant
comment: Relation between Flowering Plant and Site Of Special Scientific Interest
sub property of: place
range: Site of Special Scientific Interest
type: ObjectProperty

infrastructure
type: ObjectProperty

Site of Special Scientific Interest
label: site d'intérêt scientifique particulier @fr
type: Class

links to Television Episode
comment: Relazione tra Flowering Plant e Television Episode @it
domain: flowering plant
comment: Relation between Flowering Plant and Television Episode
type: ObjectProperty
range: television episode
sub property of: work

criminal
label: criminel @fr
type: Class

amphibian
label: amphibien @fr
type: Class

links to Moss
domain: flowering plant
sub property of: species
type: ObjectProperty
comment: Relation between Flowering Plant and Moss
range: moss
comment: Relazione tra Flowering Plant e Moss @it

flowering plant
label: angiospermes @fr
type: Class

species
label: espèce @fr
type: ObjectProperty

senator
label: sénateur @fr
type: Class

valley
type: Class
label: vallée @fr

links to Music Genre
domain: flowering plant
comment: Relation between Flowering Plant and Music Genre
type: ObjectProperty
range: music genre
comment: Relazione tra Flowering Plant e Music Genre @it
sub property of: music genre

links to Airline
type: ObjectProperty
range: airline
sub property of: organização
comment: Relazione tra Flowering Plant e Airline @it
comment: Relation between Flowering Plant and Airline
domain: flowering plant

newspaper
label: journal @fr
type: Class

game
label: jeu @fr
type: Class

protected area
label: aire protégée @fr
label: προστατευμένη περιοχή @el
type: Class

links to Currency
comment: Relazione tra Flowering Plant e Currency @it
sub property of: currency
comment: Relation between Flowering Plant and Currency
type: ObjectProperty
domain: flowering plant
range: currency

road
label: route @fr
type: Class

ginkgo
type: Class

device
label: appareil @fr
type: ObjectProperty

links to Supreme Court Of The United States Case
domain: flowering plant
range: Supreme Court of the United States case
type: ObjectProperty
comment: Relazione tra Flowering Plant e Supreme Court Of The United States Case @it
comment: Relation between Flowering Plant and Supreme Court Of The United States Case
sub property of: Legal Case

links to American Football Team
comment: Relazione tra Flowering Plant e American Football Team @it
domain: flowering plant
type: ObjectProperty
range: american football team
sub property of: organização
comment: Relation between Flowering Plant and American Football Team

bacteria
label: bactérie @fr
type: Class

links to Criminal
sub property of: person
comment: Relation between Flowering Plant and Criminal
type: ObjectProperty
domain: flowering plant
comment: Relazione tra Flowering Plant e Criminal @it
range: criminal

links to Bone
type: ObjectProperty
comment: Relazione tra Flowering Plant e Bone @it
sub property of: anatomical structure
range: bone
domain: flowering plant
comment: Relation between Flowering Plant and Bone

non-profit organisation
label: organisation à but non lucratif @fr
type: Class

links to Television Show
sub property of: work
range: television show
comment: Relation between Flowering Plant and Television Show
type: ObjectProperty
domain: flowering plant
comment: Relazione tra Flowering Plant e Television Show @it

canadian football league
type: Class

mollusca
type: Class
label: mollusque @fr

arachnid
label: arachnides @fr
type: Class

weapon
label: arme @fr
type: Class

governor
type: Class
label: gouverneur @fr

drug
type: ObjectProperty
label: médicament @fr
type: Class

work
type: ObjectProperty
label: travail @fr
label: obra @pt

magazine
type: Class
label: περιοδικό @el

school
type: Class
label: école @fr

ship
type: Class
label: navire @fr

links to Arachnid
type: ObjectProperty
domain: flowering plant
sub property of: species
range: arachnid
comment: Relation between Flowering Plant and Arachnid
comment: Relazione tra Flowering Plant e Arachnid @it

museum
label: musée @fr
type: Class

fish
type: Class
label: poisson @fr

video game
label: jeux vidéo @fr
type: Class

canal
type: Class

links to Canal
comment: Relation between Flowering Plant and Canal
comment: Relazione tra Flowering Plant e Canal @it
range: canal
type: ObjectProperty
domain: flowering plant
sub property of: place

military person
label: militaire @fr
type: Class

award
type: ObjectProperty
label: récompense @fr
type: Class

currency
type: ObjectProperty
type: Class
label: devise @fr

historic place
label: site historique @fr
type: Class

links to Award
sub property of: award
range: award
type: ObjectProperty
domain: flowering plant
comment: Relation between Flowering Plant and Award
comment: Relazione tra Flowering Plant e Award @it

hospital
type: Class
label: hôpital @fr

college
type: Class

anatomical structure
label: structure anatomique @fr
type: ObjectProperty

sport
type: Class

links to Mollusca
comment: Relazione tra Flowering Plant e Mollusca @it
domain: flowering plant
range: mollusca
type: ObjectProperty
comment: Relation between Flowering Plant and Mollusca
sub property of: species

nerve
label: nerf @fr
type: Class

single
type: Class

links to Bird
range: bird
comment: Relazione tra Flowering Plant e Bird @it
type: ObjectProperty
sub property of: species
comment: Relation between Flowering Plant and Bird
domain: flowering plant

links to Reptile
type: ObjectProperty
sub property of: species
range: reptile
comment: Relazione tra Flowering Plant e Reptile @it
domain: flowering plant
comment: Relation between Flowering Plant and Reptile

Band
label: banda @pt
label: Musikgruppe @de
type: Class
label: groupe de musique @fr

links to Nerve
range: nerve
type: ObjectProperty
sub property of: anatomical structure
domain: flowering plant
comment: Relation between Flowering Plant and Nerve
comment: Relazione tra Flowering Plant e Nerve @it

links to Military Person
sub property of: person
type: ObjectProperty
domain: flowering plant
comment: Relazione tra Flowering Plant e Military Person @it
comment: Relation between Flowering Plant and Military Person
range: military person

links to Canadian Football Team
sub property of: organização
domain: flowering plant
comment: Relazione tra Flowering Plant e Canadian Football Team @it
comment: Relation between Flowering Plant and Canadian Football Team
type: ObjectProperty
range: canadian football team

links to Ginkgo
range: ginkgo
comment: Relation between Flowering Plant and Ginkgo
sub property of: species
type: ObjectProperty
domain: flowering plant
comment: Relazione tra Flowering Plant e Ginkgo @it

links to Bacteria
sub property of: species
comment: Relation between Flowering Plant and Bacteria
range: bacteria
domain: flowering plant
type: ObjectProperty
comment: Relazione tra Flowering Plant e Bacteria @it

links to Video Game
comment: Relazione tra Flowering Plant e Video Game @it
range: video game
comment: Relation between Flowering Plant and Video Game
type: ObjectProperty
sub property of: work
domain: flowering plant

artery
label: artère @fr
type: Class
label: Arterie @de

embryology
type: Class
label: embryologie @fr

album
type: Class
label: Album @de

moss
type: Class
label: mousses @fr

links to Newspaper
range: newspaper
type: ObjectProperty
sub property of: work
comment: Relazione tra Flowering Plant e Newspaper @it
domain: flowering plant
comment: Relation between Flowering Plant and Newspaper

links to Road
type: ObjectProperty
comment: Relation between Flowering Plant and Road
range: road
domain: flowering plant
sub property of: infrastructure
comment: Relazione tra Flowering Plant e Road @it

links to Governor
domain: flowering plant
range: governor
comment: Relation between Flowering Plant and Governor
sub property of: person
comment: Relazione tra Flowering Plant e Governor @it
type: ObjectProperty

person
label: Person @de
type: ObjectProperty
label: pessoa @pt
label: personne @fr

military unit
type: Class
label: unité militaire @fr

television episode
type: Class
label: épisode télévisé @fr

links to Lighthouse
domain: flowering plant
comment: Relazione tra Flowering Plant e Lighthouse @it
comment: Relation between Flowering Plant and Lighthouse
range: lighthouse
type: ObjectProperty
sub property of: place

links to Military Unit
type: ObjectProperty
range: military unit
comment: Relation between Flowering Plant and Military Unit
domain: flowering plant
comment: Relazione tra Flowering Plant e Military Unit @it
sub property of: organização

links to Soccer Club
type: ObjectProperty
comment: Relazione tra Flowering Plant e Soccer Club @it
range: soccer club
domain: flowering plant
comment: Relation between Flowering Plant and Soccer Club
sub property of: organização

village
type: Class
label: χωριό @el

links to Fish
range: fish
comment: Relation between Flowering Plant and Fish
comment: Relazione tra Flowering Plant e Fish @it
type: ObjectProperty
domain: flowering plant
sub property of: species

links to Member Of Parliament
comment: Relation between Flowering Plant and Member Of Parliament
domain: flowering plant
range: member of parliament
comment: Relazione tra Flowering Plant e Member Of Parliament @it
type: ObjectProperty
sub property of: person

links to Aircraft
domain: flowering plant
range: aircraft
comment: Relation between Flowering Plant and Aircraft
sub property of: mean of transportation
type: ObjectProperty
comment: Relazione tra Flowering Plant e Aircraft @it

canadian football team
label: équipe canadienne de football américain @fr
type: Class

soccer club
label: club de football @fr
type: Class

music genre
label: genre musical @fr
type: ObjectProperty
label: género musical @pt
type: Class

links to Ship
range: ship
sub property of: mean of transportation
domain: flowering plant
type: ObjectProperty
comment: Relation between Flowering Plant and Ship
comment: Relazione tra Flowering Plant e Ship @it

links to Canadian Football League
sub property of: organização
type: ObjectProperty
comment: Relation between Flowering Plant and Canadian Football League
comment: Relazione tra Flowering Plant e Canadian Football League @it
range: canadian football league
domain: flowering plant

links to Planet
sub property of: planet
type: ObjectProperty
domain: flowering plant
range: planet
comment: Relation between Flowering Plant and Planet
comment: Relazione tra Flowering Plant e Planet @it

website
type: ObjectProperty
type: Class
label: site web @fr
label: Ιστότοπος @el

FloweringPlant.owl
imports: cpannotationschema.owl
extracted from: en.wikipedia.org
has author: Andrea Giovanni Nuzzolese
imports: dbpediainfoboxmatchingweight.owl
comment: FloweringPlant Encyclopedic Knowledge Pattern
type: Ontology
extracted from: dbpedia.org
has author: Valentina Presutti
has author: Aldo Gangemi
has intent: To represent the encyclopedic knowledge expressed by an object typed as FloweringPlant

links to Crustacean
domain: flowering plant
sub property of: species
comment: Relazione tra Flowering Plant e Crustacean @it
comment: Relation between Flowering Plant and Crustacean
type: ObjectProperty
range: crustacean

crustacean
label: crustacés @fr
type: Class

links to Sport
range: sport
sub property of: activity
comment: Relazione tra Flowering Plant e Sport @it
domain: flowering plant
type: ObjectProperty
comment: Relation between Flowering Plant and Sport

links to College
comment: Relation between Flowering Plant and College
sub property of: organização
comment: Relazione tra Flowering Plant e College @it
domain: flowering plant
type: ObjectProperty
range: college

links to Magazine
comment: Relazione tra Flowering Plant e Magazine @it
comment: Relation between Flowering Plant and Magazine
domain: flowering plant
sub property of: work
type: ObjectProperty
range: magazine

links to Embryology
comment: Relation between Flowering Plant and Embryology
type: ObjectProperty
sub property of: anatomical structure
domain: flowering plant
comment: Relazione tra Flowering Plant e Embryology @it
range: embryology

ice hockey player
type: Class
label: joueur de hockey sur glace @fr

links to Game
sub property of: activity
type: ObjectProperty
comment: Relation between Flowering Plant and Game
domain: flowering plant
range: game
comment: Relazione tra Flowering Plant e Game @it

links to Club Moss
sub property of: species
range: club moss
domain: flowering plant
type: ObjectProperty
comment: Relation between Flowering Plant and Club Moss
comment: Relazione tra Flowering Plant e Club Moss @it

lighthouse
label: phare @fr
type: Class

comics creator
label: créateur de bandes dessinées @fr
type: Class

links to Congressman
range: congressman
domain: flowering plant
comment: Relation between Flowering Plant and Congressman
sub property of: person
type: ObjectProperty
comment: Relazione tra Flowering Plant e Congressman @it

aircraft
label: αεροσκάφος @el
type: Class
label: avion @fr

planet
type: Class
label: planète @fr
type: ObjectProperty

links to Drug
type: ObjectProperty
domain: flowering plant
sub property of: drug
comment: Relation between Flowering Plant and Drug
range: drug
comment: Relazione tra Flowering Plant e Drug @it

links to Broadcast
comment: Relazione tra Flowering Plant e Broadcast @it
domain: flowering plant
sub property of: organização
comment: Relation between Flowering Plant and Broadcast
range: broadcast
type: ObjectProperty

club moss
type: Class
label: lycopodiopsida @fr

reptile
type: Class

links to Protected Area
comment: Relation between Flowering Plant and Protected Area
domain: flowering plant
range: protected area
type: ObjectProperty
comment: Relazione tra Flowering Plant e Protected Area @it
sub property of: place

legislature
label: pouvoir législatif @fr
type: Class

links to Senator
domain: flowering plant
comment: Relazione tra Flowering Plant e Senator @it
range: senator
comment: Relation between Flowering Plant and Senator
sub property of: person
type: ObjectProperty

links to Comics Creator
range: comics creator
type: ObjectProperty
domain: flowering plant
comment: Relation between Flowering Plant and Comics Creator
sub property of: person
comment: Relazione tra Flowering Plant e Comics Creator @it

links to Ice Hockey Player
comment: Relazione tra Flowering Plant e Ice Hockey Player @it
domain: flowering plant
range: ice hockey player
comment: Relation between Flowering Plant and Ice Hockey Player
sub property of: person
type: ObjectProperty

airline
type: Class
label: compagnie aérienne @fr

olympics
type: Class
label: Jeux Olympiques @fr

organização
type: ObjectProperty
label: organisation
label: Organisation @de

congressman
type: Class
label: membre du Congrès @fr

links to Single
comment: Relazione tra Flowering Plant e Single @it
sub property of: work
type: ObjectProperty
domain: flowering plant
comment: Relation between Flowering Plant and Single
range: single

links to Stadium
comment: Relazione tra Flowering Plant e Stadium @it
domain: flowering plant
sub property of: place
range: stadium
type: ObjectProperty
comment: Relation between Flowering Plant and Stadium

bridge
type: Class
label: pont @fr

activity
label: activité @fr
label: Aktivität @de
type: ObjectProperty

links to Brain
type: ObjectProperty
range: brain
comment: Relazione tra Flowering Plant e Brain @it
sub property of: anatomical structure
domain: flowering plant
comment: Relation between Flowering Plant and Brain

links to Artery
type: ObjectProperty
domain: flowering plant
comment: Relation between Flowering Plant and Artery
comment: Relazione tra Flowering Plant e Artery @it
sub property of: anatomical structure
range: artery

broadcast
type: Class
label: Émission de télévision @fr

film
type: Class
label: ταινία @el

links to Bridge
comment: Relation between Flowering Plant and Bridge
sub property of: place
domain: flowering plant
comment: Relazione tra Flowering Plant e Bridge @it
range: bridge
type: ObjectProperty

links to Musical Artist
type: ObjectProperty
comment: Relazione tra Flowering Plant e Musical Artist @it
domain: flowering plant
range: musical artist
sub property of: person
comment: Relation between Flowering Plant and Musical Artist

american football team
type: Class
label: équipe américaine de football américain @fr

links to Historic Place
comment: Relation between Flowering Plant and Historic Place
sub property of: place
type: ObjectProperty
domain: flowering plant
comment: Relazione tra Flowering Plant e Historic Place @it
range: historic place

comics character
type: Class
label: personnage de bandes dessinées @fr

links to Album
sub property of: work
type: ObjectProperty
domain: flowering plant
comment: Relazione tra Flowering Plant e Album @it
range: album
comment: Relation between Flowering Plant and Album

Supreme Court of the United States case
type: Class
label: cas juridique de la Cour suprême des États-Unis @fr

bird
label: oiseau @fr
type: Class

event
label: évènement @fr
type: ObjectProperty

links to Conifer
type: ObjectProperty
comment: Relazione tra Flowering Plant e Conifer @it
domain: flowering plant
sub property of: species
comment: Relation between Flowering Plant and Conifer
range: conifer

links to Weapon
comment: Relation between Flowering Plant and Weapon
type: ObjectProperty
range: weapon
sub property of: device
domain: flowering plant
comment: Relazione tra Flowering Plant e Weapon @it

bone
label: os @fr
label: Knochen @de
type: Class

member of parliament
type: Class
label: membre du Parlement @fr

fern
label: fougères @fr
type: Class

links to Non- Profit Organisation
range: non-profit organisation
type: ObjectProperty
sub property of: organização
domain: flowering plant
comment: Relation between Flowering Plant and Non- Profit Organisation
comment: Relazione tra Flowering Plant e Non- Profit Organisation @it

musical artist
label: musicien @fr
type: Class
label: artista musical @pt

links to Comics Character
range: comics character
comment: Relation between Flowering Plant and Comics Character
sub property of: person
domain: flowering plant
comment: Relazione tra Flowering Plant e Comics Character @it
type: ObjectProperty

links to Band
domain: flowering plant
comment: Relazione tra Flowering Plant e Band @it
range: Band
comment: Relation between Flowering Plant and Band
type: ObjectProperty
sub property of: organização

links to Hospital
sub property of: place
comment: Relazione tra Flowering Plant e Hospital @it
range: hospital
domain: flowering plant
comment: Relation between Flowering Plant and Hospital
type: ObjectProperty

conifer
label: conifères @fr
type: Class