links to Canal
sub property of: place
comment: Relation between Formula One Racer and Canal
comment: Relazione tra Formula One Racer e Canal @it
domain: Formula One racer
type: ObjectProperty
range: canal

links to Office Holder
related match: successor
type: NamedIndividual
range: office holder
comment: Relation between Formula One Racer and Office Holder
type: ObjectProperty
sub property of: person
domain: Formula One racer
comment: Relazione tra Formula One Racer e Office Holder @it

links to Model
comment: Relazione tra Formula One Racer e Model @it
domain: Formula One racer
type: ObjectProperty
comment: Relation between Formula One Racer and Model
sub property of: person
range: model

television show
type: Class
label: émission de télévision @fr

links to Ethnic Group
sub property of: ethnic group
domain: Formula One racer
comment: Relation between Formula One Racer and Ethnic Group
comment: Relazione tra Formula One Racer e Ethnic Group @it
range: ethnic group
type: ObjectProperty

disease
label: maladie @fr
type: Class
type: ObjectProperty

links to Mountain Range
range: mountain range
comment: Relation between Formula One Racer and Mountain Range
type: ObjectProperty
sub property of: place
comment: Relazione tra Formula One Racer e Mountain Range @it
domain: Formula One racer

links to Boxer
domain: Formula One racer
comment: Relazione tra Formula One Racer e Boxer @it
comment: Relation between Formula One Racer and Boxer
sub property of: person
range: boxer
type: ObjectProperty

Election
type: Class
label: élection @fr

links to Soccer Manager
range: soccer manager
sub property of: person
comment: Relation between Formula One Racer and Soccer Manager
domain: Formula One racer
type: ObjectProperty
comment: Relazione tra Formula One Racer e Soccer Manager @it
type: NamedIndividual
related match: before

mean of transportation
label: moyen de transport @fr
type: ObjectProperty

stadium
type: Class
label: stade @fr

links to Protected Area
sub property of: place
type: ObjectProperty
comment: Relation between Formula One Racer and Protected Area
range: protected area
domain: Formula One racer
comment: Relazione tra Formula One Racer e Protected Area @it

astronaut
type: Class
label: Astronaut @de
label: astronaute @fr

links to Bird
sub property of: species
range: bird
type: ObjectProperty
domain: Formula One racer
comment: Relation between Formula One Racer and Bird
comment: Relazione tra Formula One Racer e Bird @it

Site of Special Scientific Interest
type: Class
label: site d'intérêt scientifique particulier @fr

links to Wrestler
comment: Relation between Formula One Racer and Wrestler
sub property of: person
domain: Formula One racer
range: wrestler
type: ObjectProperty
comment: Relazione tra Formula One Racer e Wrestler @it

wrestler
label: lutteur @fr
type: Class

species
label: espèce @fr
type: ObjectProperty

links to Ship
comment: Relazione tra Formula One Racer e Ship @it
comment: Relation between Formula One Racer and Ship
range: ship
type: ObjectProperty
sub property of: mean of transportation
domain: Formula One racer

newspaper
type: Class
label: journal @fr

protected area
label: aire protégée @fr
label: προστατευμένη περιοχή @el
type: Class

links to Rugby Player
range: rugby player
sub property of: person
domain: Formula One racer
comment: Relazione tra Formula One Racer e Rugby Player @it
type: ObjectProperty
comment: Relation between Formula One Racer and Rugby Player

boxer
label: boxeur @fr
type: Class

links to Single
domain: Formula One racer
type: ObjectProperty
comment: Relazione tra Formula One Racer e Single @it
sub property of: work
range: single
comment: Relation between Formula One Racer and Single

language
type: Class
label: langage @fr
type: ObjectProperty

links to Lake
domain: Formula One racer
range: lake
type: ObjectProperty
sub property of: place
comment: Relation between Formula One Racer and Lake
comment: Relazione tra Formula One Racer e Lake @it

links to Musical Artist
range: musical artist
type: ObjectProperty
domain: Formula One racer
sub property of: person
comment: Relation between Formula One Racer and Musical Artist
comment: Relazione tra Formula One Racer e Musical Artist @it

links to School
comment: Relation between Formula One Racer and School
type: ObjectProperty
domain: Formula One racer
range: school
comment: Relazione tra Formula One Racer e School @it
sub property of: organização

lake
label: lac @fr
type: Class

links to Criminal
range: criminal
comment: Relazione tra Formula One Racer e Criminal @it
comment: Relation between Formula One Racer and Criminal
type: ObjectProperty
domain: Formula One racer
sub property of: person

work
type: ObjectProperty
label: travail @fr
label: obra @pt

school
type: Class
label: école @fr

links to Legislature
comment: Relazione tra Formula One Racer e Legislature @it
type: ObjectProperty
domain: Formula One racer
sub property of: organização
range: legislature
comment: Relation between Formula One Racer and Legislature

museum
type: Class
label: musée @fr

ship
label: navire @fr
type: Class

tennis player
label: joueur de tennis @fr
type: Class

video game
label: jeux vidéo @fr
type: Class

currency
type: ObjectProperty
label: devise @fr
type: Class

British royalty
label: royauté Britannique @fr
type: Class

prime minister
type: Class
label: premier ministre @fr

race
label: course @fr
type: Class

historic place
type: Class
label: site historique @fr

hospital
label: hôpital @fr
type: Class

links to Currency
range: currency
type: ObjectProperty
domain: Formula One racer
comment: Relazione tra Formula One Racer e Currency @it
comment: Relation between Formula One Racer and Currency
sub property of: currency

links to Member Of Parliament
comment: Relazione tra Formula One Racer e Member Of Parliament @it
domain: Formula One racer
comment: Relation between Formula One Racer and Member Of Parliament
range: member of parliament
type: ObjectProperty
sub property of: person

links to Plant
type: ObjectProperty
domain: Formula One racer
range: plant
sub property of: species
comment: Relation between Formula One Racer and Plant
comment: Relazione tra Formula One Racer e Plant @it

links to Mammal
sub property of: species
comment: Relation between Formula One Racer and Mammal
range: mammal
comment: Relazione tra Formula One Racer e Mammal @it
type: ObjectProperty
domain: Formula One racer

links to Museum
comment: Relation between Formula One Racer and Museum
domain: Formula One racer
type: ObjectProperty
comment: Relazione tra Formula One Racer e Museum @it
range: museum
sub property of: place

continent
type: Class
label: ήπειρος @el

president
label: président @fr
type: Class

album
label: Album @de
type: Class

links to Award
related match: title
type: NamedIndividual
domain: Formula One racer
type: ObjectProperty
comment: Relation between Formula One Racer and Award
range: award
comment: Relazione tra Formula One Racer e Award @it
sub property of: award

links to Actor
comment: Relation between Formula One Racer and Actor
type: ObjectProperty
range: actor
sub property of: person
comment: Relazione tra Formula One Racer e Actor @it
domain: Formula One racer

person
label: Person @de
label: pessoa @pt
type: ObjectProperty
label: personne @fr

military unit
type: Class
label: unité militaire @fr

soccer manager
type: Class
label: entraîneur de football @fr

links to Soccer Club
comment: Relazione tra Formula One Racer e Soccer Club @it
type: ObjectProperty
sub property of: organização
range: soccer club
comment: Relation between Formula One Racer and Soccer Club
domain: Formula One racer

links to Non- Profit Organisation
sub property of: organização
range: non-profit organisation
comment: Relazione tra Formula One Racer e Non- Profit Organisation @it
domain: Formula One racer
type: ObjectProperty
comment: Relation between Formula One Racer and Non- Profit Organisation

writer
label: écrivain @fr
type: Class

links to Beverage
range: beverage
domain: Formula One racer
comment: Relazione tra Formula One Racer e Beverage @it
type: ObjectProperty
sub property of: beverage
comment: Relation between Formula One Racer and Beverage

links to British Royalty
type: ObjectProperty
range: British royalty
domain: Formula One racer
comment: Relazione tra Formula One Racer e British Royalty @it
comment: Relation between Formula One Racer and British Royalty
sub property of: person
type: NamedIndividual
related match: before

model
type: Class
label: mannequin @fr

links to Scientist
domain: Formula One racer
sub property of: person
comment: Relation between Formula One Racer and Scientist
comment: Relazione tra Formula One Racer e Scientist @it
range: scientist
type: ObjectProperty

links to Album
comment: Relazione tra Formula One Racer e Album @it
range: album
comment: Relation between Formula One Racer and Album
type: ObjectProperty
domain: Formula One racer
sub property of: work

links to Writer
type: ObjectProperty
comment: Relazione tra Formula One Racer e Writer @it
range: writer
domain: Formula One racer
comment: Relation between Formula One Racer and Writer
sub property of: person

links to Broadcast
sub property of: organização
type: ObjectProperty
comment: Relazione tra Formula One Racer e Broadcast @it
domain: Formula One racer
range: broadcast
comment: Relation between Formula One Racer and Broadcast

links to Hotel
domain: Formula One racer
type: ObjectProperty
comment: Relazione tra Formula One Racer e Hotel @it
comment: Relation between Formula One Racer and Hotel
range: hotel
sub property of: place

comics creator
type: Class
label: créateur de bandes dessinées @fr

aircraft
label: avion @fr
type: Class
label: αεροσκάφος @el

links to Village
comment: Relazione tra Formula One Racer e Village @it
range: village
sub property of: place
comment: Relation between Formula One Racer and Village
type: ObjectProperty
domain: Formula One racer

links to Monarch
range: monarch
comment: Relazione tra Formula One Racer e Monarch @it
sub property of: person
comment: Relation between Formula One Racer and Monarch
domain: Formula One racer
type: ObjectProperty

soccer player
label: joueur de football @fr
type: Class

links to Olympics
comment: Relazione tra Formula One Racer e Olympics @it
sub property of: event
range: olympics
comment: Relation between Formula One Racer and Olympics
domain: Formula One racer
type: ObjectProperty

links to Journalist
comment: Relation between Formula One Racer and Journalist
domain: Formula One racer
comment: Relazione tra Formula One Racer e Journalist @it
type: ObjectProperty
range: journalist
sub property of: person

legislature
label: pouvoir législatif @fr
type: Class

airline
type: Class
label: compagnie aérienne @fr

links to Comedian
comment: Relazione tra Formula One Racer e Comedian @it
domain: Formula One racer
type: ObjectProperty
comment: Relation between Formula One Racer and Comedian
sub property of: person
range: comedian

monarch
type: Class
label: monarque @fr

links to Mountain
range: mountain
domain: Formula One racer
comment: Relazione tra Formula One Racer e Mountain @it
type: ObjectProperty
sub property of: place
comment: Relation between Formula One Racer and Mountain

links to Sport
range: sport
comment: Relation between Formula One Racer and Sport
domain: Formula One racer
type: ObjectProperty
sub property of: activity
comment: Relazione tra Formula One Racer e Sport @it

golf player
type: Class
label: golfeur @fr

activity
label: activité @fr
label: Aktivität @de
type: ObjectProperty

journalist
label: journaliste @fr
type: Class

links to Book
sub property of: work
type: ObjectProperty
comment: Relazione tra Formula One Racer e Book @it
comment: Relation between Formula One Racer and Book
range: book
domain: Formula One racer

links to Automobile Engine
range: automobile engine
comment: Relazione tra Formula One Racer e Automobile Engine @it
type: ObjectProperty
sub property of: device
domain: Formula One racer
comment: Relation between Formula One Racer and Automobile Engine

links to Astronaut
domain: Formula One racer
range: astronaut
comment: Relation between Formula One Racer and Astronaut
comment: Relazione tra Formula One Racer e Astronaut @it
type: ObjectProperty
sub property of: person

film
label: ταινία @el
type: Class

links to Ice Hockey Player
type: ObjectProperty
comment: Relation between Formula One Racer and Ice Hockey Player
range: ice hockey player
sub property of: person
comment: Relazione tra Formula One Racer e Ice Hockey Player @it
domain: Formula One racer

bird
label: oiseau @fr
type: Class

chemical compound
type: Class
type: ObjectProperty
label: produit chimique @fr

links to Historic Place
comment: Relazione tra Formula One Racer e Historic Place @it
type: ObjectProperty
sub property of: place
comment: Relation between Formula One Racer and Historic Place
range: historic place
domain: Formula One racer

links to Film
type: ObjectProperty
domain: Formula One racer
comment: Relazione tra Formula One Racer e Film @it
comment: Relation between Formula One Racer and Film
range: film
sub property of: work

links to Aircraft
sub property of: mean of transportation
comment: Relazione tra Formula One Racer e Aircraft @it
range: aircraft
type: ObjectProperty
comment: Relation between Formula One Racer and Aircraft
domain: Formula One racer

musical artist
label: artista musical @pt
type: Class
label: musicien @fr

links to Band
comment: Relation between Formula One Racer and Band
domain: Formula One racer
range: Band
sub property of: organização
type: ObjectProperty
comment: Relazione tra Formula One Racer e Band @it

links to Weapon
domain: Formula One racer
comment: Relazione tra Formula One Racer e Weapon @it
range: weapon
comment: Relation between Formula One Racer and Weapon
sub property of: device
type: ObjectProperty

links to Chemical Compound
domain: Formula One racer
comment: Relation between Formula One Racer and Chemical Compound
sub property of: chemical compound
type: ObjectProperty
range: chemical compound
comment: Relazione tra Formula One Racer e Chemical Compound @it

links to Soccer Player
range: soccer player
type: ObjectProperty
comment: Relazione tra Formula One Racer e Soccer Player @it
comment: Relation between Formula One Racer and Soccer Player
sub property of: person
domain: Formula One racer
type: NamedIndividual
related match: after

links to Continent
type: ObjectProperty
domain: Formula One racer
comment: Relazione tra Formula One Racer e Continent @it
sub property of: place
comment: Relation between Formula One Racer and Continent
range: continent

links to Cyclist
domain: Formula One racer
related match: before
type: ObjectProperty
comment: Relation between Formula One Racer and Cyclist
sub property of: person
type: NamedIndividual
range: cyclist
comment: Relazione tra Formula One Racer e Cyclist @it
related match: after

park
label: parc @fr
type: Class

Axiom
dbpedia infobox matching weight: 100.0
annotated target: before
annotated property: relatedMatch
annotated source: links to Soccer Manager

rugby player
label: joueur de rugby @fr
type: Class

links to Language
type: ObjectProperty
domain: Formula One racer
comment: Relazione tra Formula One Racer e Language @it
range: language
sub property of: language
comment: Relation between Formula One Racer and Language

links to Website
sub property of: website
comment: Relation between Formula One Racer and Website
type: ObjectProperty
range: website
domain: Formula One racer
comment: Relazione tra Formula One Racer e Website @it

actor
label: acteur @fr
type: Class
label: Schauspieler @de

cyclist
label: cycliste @fr
type: Class

place
type: ObjectProperty
label: περιοχή @el
label: lieu @fr
label: lugar @pt

links to Gridiron Football Player
range: gridiron football player
type: ObjectProperty
sub property of: person
comment: Relazione tra Formula One Racer e Gridiron Football Player @it
comment: Relation between Formula One Racer and Gridiron Football Player
domain: Formula One racer

links to Comics Character
range: comics character
comment: Relation between Formula One Racer and Comics Character
comment: Relazione tra Formula One Racer e Comics Character @it
sub property of: person
type: ObjectProperty
domain: Formula One racer

links to Ski Area
sub property of: place
domain: Formula One racer
type: ObjectProperty
comment: Relation between Formula One Racer and Ski Area
range: ski area
comment: Relazione tra Formula One Racer e Ski Area @it

links to Airline
sub property of: organização
domain: Formula One racer
comment: Relazione tra Formula One Racer e Airline @it
type: ObjectProperty
range: airline
comment: Relation between Formula One Racer and Airline

Axiom
dbpedia infobox matching weight: 50.0
annotated source: links to Cyclist
annotated property: relatedMatch
annotated target: before

mountain
type: Class
label: montagne @fr
label: Βουνό @el

criminal
label: criminel @fr
type: Class

comedian
type: Class
label: comédien @fr

Playboy Playmate
type: Class
label: playmate pour Playboy @fr

book
type: Class
label: livre @fr
label: βιβλίο @el
label: książka @pl
label: llibre @ca

device
type: ObjectProperty
label: appareil @fr

gridiron football player
type: Class
label: joueur de football américain gridiron @fr

Axiom
dbpedia infobox matching weight: 100.0
annotated source: links to Award
annotated target: title
annotated property: relatedMatch

ski area
label: domaine skiable @fr
type: Class

links to Radio Station
comment: Relazione tra Formula One Racer e Radio Station @it
sub property of: organização
comment: Relation between Formula One Racer and Radio Station
range: radio station
type: ObjectProperty
domain: Formula One racer

non-profit organisation
label: organisation à but non lucratif @fr
type: Class

weapon
type: Class
label: arme @fr

links to Military Conflict
range: military conflict
comment: Relation between Formula One Racer and Military Conflict
comment: Relazione tra Formula One Racer e Military Conflict @it
type: ObjectProperty
domain: Formula One racer
sub property of: event

links to Motorcycle Racing League
type: ObjectProperty
comment: Relation between Formula One Racer and Motorcycle Racing League
comment: Relazione tra Formula One Racer e Motorcycle Racing League @it
domain: Formula One racer
sub property of: organização
range: motorcycle racing league

links to Military Unit
range: military unit
type: ObjectProperty
domain: Formula One racer
sub property of: organização
comment: Relation between Formula One Racer and Military Unit
comment: Relazione tra Formula One Racer e Military Unit @it

magazine
label: περιοδικό @el
type: Class

links to Video Game
comment: Relazione tra Formula One Racer e Video Game @it
domain: Formula One racer
type: ObjectProperty
sub property of: work
range: video game
comment: Relation between Formula One Racer and Video Game

Axiom
dbpedia infobox matching weight: 100.0
annotated target: before
annotated property: relatedMatch
annotated source: links to British Royalty

canal
type: Class

military person
type: Class
label: militaire @fr

philosopher
label: philosophe @fr
type: Class

links to Park
sub property of: place
comment: Relation between Formula One Racer and Park
comment: Relazione tra Formula One Racer e Park @it
range: park
type: ObjectProperty
domain: Formula One racer

links to Newspaper
comment: Relation between Formula One Racer and Newspaper
type: ObjectProperty
sub property of: work
range: newspaper
comment: Relazione tra Formula One Racer e Newspaper @it
domain: Formula One racer

award
type: Class
label: récompense @fr
type: ObjectProperty

sport
type: Class

anatomical structure
label: structure anatomique @fr
type: ObjectProperty

automobile engine
label: moteur d'automobile @fr
type: Class

cricketer
label: joueur de cricket @fr
type: Class

links to Race
comment: Relazione tra Formula One Racer e Race @it
type: ObjectProperty
comment: Relation between Formula One Racer and Race
sub property of: event
range: race
domain: Formula One racer

single
type: Class

links to Comics Creator
domain: Formula One racer
range: comics creator
sub property of: person
type: ObjectProperty
comment: Relazione tra Formula One Racer e Comics Creator @it
comment: Relation between Formula One Racer and Comics Creator

Band
label: groupe de musique @fr
type: Class
label: Musikgruppe @de
label: banda @pt

town
type: Class
label: ville @fr

university
label: πανεπιστήμιο @el
label: université @fr
type: Class

links to Site Of Special Scientific Interest
range: Site of Special Scientific Interest
comment: Relazione tra Formula One Racer e Site Of Special Scientific Interest @it
sub property of: place
domain: Formula One racer
type: ObjectProperty
comment: Relation between Formula One Racer and Site Of Special Scientific Interest

ethnic group
label: groupe ethnique @fr
type: ObjectProperty
type: Class

Axiom
dbpedia infobox matching weight: 100.0
annotated source: links to Soccer Player
annotated property: relatedMatch
annotated target: after

links to Magazine
type: ObjectProperty
domain: Formula One racer
range: magazine
comment: Relation between Formula One Racer and Magazine
sub property of: work
comment: Relazione tra Formula One Racer e Magazine @it

motorcycle racing league
type: Class
label: ligue de courses motocycliste @fr

hotel
type: Class
label: hôtel @fr

links to Prime Minister
comment: Relation between Formula One Racer and Prime Minister
type: ObjectProperty
sub property of: person
range: prime minister
comment: Relazione tra Formula One Racer e Prime Minister @it
domain: Formula One racer

links to Bone
domain: Formula One racer
comment: Relazione tra Formula One Racer e Bone @it
type: ObjectProperty
comment: Relation between Formula One Racer and Bone
sub property of: anatomical structure
range: bone

village
label: χωριό @el
type: Class

links to Stadium
range: stadium
type: ObjectProperty
sub property of: place
comment: Relation between Formula One Racer and Stadium
domain: Formula One racer
comment: Relazione tra Formula One Racer e Stadium @it

soccer club
type: Class
label: club de football @fr

links to Disease
range: disease
domain: Formula One racer
type: ObjectProperty
sub property of: disease
comment: Relazione tra Formula One Racer e Disease @it
comment: Relation between Formula One Racer and Disease

links to University
sub property of: organização
comment: Relazione tra Formula One Racer e University @it
range: university
domain: Formula One racer
comment: Relation between Formula One Racer and University
type: ObjectProperty

links to Cricketer
comment: Relazione tra Formula One Racer e Cricketer @it
type: ObjectProperty
domain: Formula One racer
sub property of: person
comment: Relation between Formula One Racer and Cricketer
range: cricketer

office holder
type: Class
label: Amtsinhaber @de
label: titulaire @fr

military conflict
type: Class
label: conflit militaire @fr

website
type: ObjectProperty
type: Class
label: site web @fr
label: Ιστότοπος @el

Axiom
dbpedia infobox matching weight: 100.0
annotated target: successor
annotated property: relatedMatch
annotated source: links to Office Holder

links to Hospital
type: ObjectProperty
domain: Formula One racer
comment: Relazione tra Formula One Racer e Hospital @it
range: hospital
comment: Relation between Formula One Racer and Hospital
sub property of: place

basketball player
type: Class
label: joueur de basketball @fr

links to Military Person
type: ObjectProperty
comment: Relation between Formula One Racer and Military Person
domain: Formula One racer
comment: Relazione tra Formula One Racer e Military Person @it
range: military person
sub property of: person

links to President
sub property of: person
type: ObjectProperty
comment: Relation between Formula One Racer and President
range: president
comment: Relazione tra Formula One Racer e President @it
domain: Formula One racer

ice hockey player
label: joueur de hockey sur glace @fr
type: Class

Axiom
dbpedia infobox matching weight: 50.0
annotated target: after
annotated property: relatedMatch
annotated source: links to Cyclist

mountain range
type: Class
label: chaîne de montagne @fr

beverage
type: ObjectProperty
type: Class
label: boisson @fr

links to Golf Player
comment: Relation between Formula One Racer and Golf Player
sub property of: person
range: golf player
type: ObjectProperty
domain: Formula One racer
comment: Relazione tra Formula One Racer e Golf Player @it

links to Playboy Playmate
comment: Relazione tra Formula One Racer e Playboy Playmate @it
comment: Relation between Formula One Racer and Playboy Playmate
type: ObjectProperty
domain: Formula One racer
range: Playboy Playmate
sub property of: person

scientist
label: Wissenschaftler @de
type: Class
label: scientifique @fr

olympics
type: Class
label: Jeux Olympiques @fr

organização
type: ObjectProperty
label: organisation
label: Organisation @de

links to Island
range: island
comment: Relazione tra Formula One Racer e Island @it
domain: Formula One racer
comment: Relation between Formula One Racer and Island
type: ObjectProperty
sub property of: place

links to Election
comment: Relazione tra Formula One Racer e Election @it
comment: Relation between Formula One Racer and Election
sub property of: event
range: Election
type: ObjectProperty
domain: Formula One racer

links to Airport
type: ObjectProperty
range: airport
sub property of: place
comment: Relazione tra Formula One Racer e Airport @it
domain: Formula One racer
comment: Relation between Formula One Racer and Airport

plant
type: Class
label: plante @fr

FormulaOneRacer.owl
comment: FormulaOneRacer Encyclopedic Knowledge Pattern
has author: Valentina Presutti
extracted from: en.wikipedia.org
has intent: To represent the encyclopedic knowledge expressed by an object typed as FormulaOneRacer
has author: Aldo Gangemi
extracted from: dbpedia.org
imports: cpannotationschema.owl
has author: Andrea Giovanni Nuzzolese
imports: dbpediainfoboxmatchingweight.owl
type: Ontology

broadcast
label: Émission de télévision @fr
type: Class

links to Basketball Player
comment: Relazione tra Formula One Racer e Basketball Player @it
type: ObjectProperty
range: basketball player
comment: Relation between Formula One Racer and Basketball Player
sub property of: person
domain: Formula One racer

links to Television Show
comment: Relazione tra Formula One Racer e Television Show @it
range: television show
type: ObjectProperty
sub property of: work
domain: Formula One racer
comment: Relation between Formula One Racer and Television Show

mammal
type: Class
label: mammifère @fr

island
type: Class
label: νησί @el
label: île @fr

links to Town
range: town
type: ObjectProperty
comment: Relation between Formula One Racer and Town
domain: Formula One racer
comment: Relazione tra Formula One Racer e Town @it
sub property of: place

comics character
label: personnage de bandes dessinées @fr
type: Class

event
type: ObjectProperty
label: évènement @fr

Formula One racer
label: pilote de formule 1 @fr
type: Class

radio station
type: Class
label: station de radio @fr

member of parliament
type: Class
label: membre du Parlement @fr

bone
type: Class
label: Knochen @de
label: os @fr

links to Philosopher
range: philosopher
comment: Relation between Formula One Racer and Philosopher
domain: Formula One racer
type: ObjectProperty
comment: Relazione tra Formula One Racer e Philosopher @it
sub property of: person

links to Tennis Player
range: tennis player
comment: Relation between Formula One Racer and Tennis Player
comment: Relazione tra Formula One Racer e Tennis Player @it
sub property of: person
type: ObjectProperty
domain: Formula One racer

airport
label: aéroport @fr
label: Flughafen @de
type: Class