television show
type: Class
label: émission de télévision @fr

links to World Heritage Site
sub property of: place
domain: golf player
type: ObjectProperty
comment: Relation between Golf Player and World Heritage Site
comment: Relazione tra Golf Player e World Heritage Site @it
range: World Heritage Site

disease
type: ObjectProperty
type: Class
label: maladie @fr

links to Lake
comment: Relation between Golf Player and Lake
range: lake
type: ObjectProperty
sub property of: place
domain: golf player
comment: Relazione tra Golf Player e Lake @it

links to American Football Player
type: NamedIndividual
related match: after
range: american football player
domain: golf player
type: ObjectProperty
sub property of: person
comment: Relazione tra Golf Player e American Football Player @it
comment: Relation between Golf Player and American Football Player

automobile
type: Class

colour
type: ObjectProperty
label: χρώμα @el
label: couleur @fr
type: Class

links to Radio Station
range: radio station
comment: Relation between Golf Player and Radio Station
domain: golf player
comment: Relazione tra Golf Player e Radio Station @it
type: ObjectProperty
sub property of: organização

links to Mountain Range
comment: Relazione tra Golf Player e Mountain Range @it
type: ObjectProperty
range: mountain range
domain: golf player
sub property of: place
comment: Relation between Golf Player and Mountain Range

links to Beverage
type: ObjectProperty
domain: golf player
comment: Relazione tra Golf Player e Beverage @it
range: beverage
comment: Relation between Golf Player and Beverage
sub property of: beverage

links to Colour
comment: Relation between Golf Player and Colour
range: colour
domain: golf player
sub property of: colour
type: ObjectProperty
comment: Relazione tra Golf Player e Colour @it

mean of transportation
type: ObjectProperty
label: moyen de transport @fr

american football player
type: Class
label: joueur de football américain @fr

links to Mammal
range: mammal
domain: golf player
sub property of: species
type: ObjectProperty
comment: Relation between Golf Player and Mammal
comment: Relazione tra Golf Player e Mammal @it

stadium
label: stade @fr
type: Class

links to Currency
comment: Relation between Golf Player and Currency
type: ObjectProperty
sub property of: currency
range: currency
domain: golf player
comment: Relazione tra Golf Player e Currency @it

links to Hotel
sub property of: place
type: ObjectProperty
domain: golf player
range: hotel
comment: Relazione tra Golf Player e Hotel @it
comment: Relation between Golf Player and Hotel

wrestler
type: Class
label: lutteur @fr

species
type: ObjectProperty
label: espèce @fr

links to School
type: ObjectProperty
domain: golf player
range: school
sub property of: organização
comment: Relation between Golf Player and School
comment: Relazione tra Golf Player e School @it
related match: college
type: NamedIndividual

links to Tennis Player
range: tennis player
comment: Relation between Golf Player and Tennis Player
sub property of: person
type: ObjectProperty
domain: golf player
comment: Relazione tra Golf Player e Tennis Player @it

links to Basketball Player
comment: Relazione tra Golf Player e Basketball Player @it
sub property of: person
range: basketball player
comment: Relation between Golf Player and Basketball Player
domain: golf player
type: ObjectProperty

GolfPlayer.owl
has author: Valentina Presutti
has intent: To represent the encyclopedic knowledge expressed by an object typed as GolfPlayer
has author: Aldo Gangemi
comment: GolfPlayer Encyclopedic Knowledge Pattern
type: Ontology
extracted from: en.wikipedia.org
imports: cpannotationschema.owl
imports: dbpediainfoboxmatchingweight.owl
extracted from: dbpedia.org
has author: Andrea Giovanni Nuzzolese

newspaper
label: journal @fr
type: Class

road
label: route @fr
type: Class

boxer
type: Class
label: boxeur @fr

World Heritage Site
label: site du patrimoine mondial @fr
type: Class

language
type: Class
label: langage @fr
type: ObjectProperty

links to British Royalty
comment: Relation between Golf Player and British Royalty
type: ObjectProperty
range: British royalty
comment: Relazione tra Golf Player e British Royalty @it
domain: golf player
sub property of: person

lake
type: Class
label: lac @fr

links to Soccer Manager
sub property of: person
type: ObjectProperty
domain: golf player
comment: Relation between Golf Player and Soccer Manager
range: soccer manager
comment: Relazione tra Golf Player e Soccer Manager @it

links to Ship
comment: Relation between Golf Player and Ship
type: ObjectProperty
range: ship
domain: golf player
comment: Relazione tra Golf Player e Ship @it
sub property of: mean of transportation

links to Rugby Player
type: ObjectProperty
domain: golf player
comment: Relazione tra Golf Player e Rugby Player @it
range: rugby player
sub property of: person
comment: Relation between Golf Player and Rugby Player

governor
type: Class
label: gouverneur @fr

work
type: ObjectProperty
label: travail @fr
label: obra @pt

poker player
type: Class
label: joueur de poker @fr

river
label: rivière @fr
type: Class

links to Road
sub property of: infrastructure
range: road
comment: Relation between Golf Player and Road
type: ObjectProperty
domain: golf player
comment: Relazione tra Golf Player e Road @it

school
type: Class
label: école @fr

fish
type: Class
label: poisson @fr

museum
type: Class
label: musée @fr

ship
type: Class
label: navire @fr

tennis player
label: joueur de tennis @fr
type: Class

video game
label: jeux vidéo @fr
type: Class

links to Comics Character
sub property of: person
range: comics character
domain: golf player
type: ObjectProperty
comment: Relazione tra Golf Player e Comics Character @it
comment: Relation between Golf Player and Comics Character

currency
label: devise @fr
type: Class
type: ObjectProperty

British royalty
label: royauté Britannique @fr
type: Class

historic place
type: Class
label: site historique @fr

hospital
type: Class
label: hôpital @fr

links to Saint
comment: Relazione tra Golf Player e Saint @it
range: saint
type: ObjectProperty
comment: Relation between Golf Player and Saint
domain: golf player
sub property of: person

links to Video Game
comment: Relation between Golf Player and Video Game
comment: Relazione tra Golf Player e Video Game @it
sub property of: work
domain: golf player
range: video game
type: ObjectProperty

links to American Football Team
sub property of: organização
domain: golf player
type: ObjectProperty
comment: Relazione tra Golf Player e American Football Team @it
range: american football team
comment: Relation between Golf Player and American Football Team

continent
label: ήπειρος @el
type: Class

links to Cricketer
comment: Relazione tra Golf Player e Cricketer @it
sub property of: person
domain: golf player
range: cricketer
type: ObjectProperty
comment: Relation between Golf Player and Cricketer

president
type: Class
label: président @fr

album
type: Class
label: Album @de

links to Formula One Racer
domain: golf player
sub property of: person
comment: Relazione tra Golf Player e Formula One Racer @it
comment: Relation between Golf Player and Formula One Racer
type: ObjectProperty
range: Formula One racer

links to Military Conflict
sub property of: event
range: military conflict
domain: golf player
comment: Relazione tra Golf Player e Military Conflict @it
comment: Relation between Golf Player and Military Conflict
type: ObjectProperty

person
label: Person @de
label: pessoa @pt
type: ObjectProperty
label: personne @fr

military unit
type: Class
label: unité militaire @fr

links to Television Episode
range: television episode
domain: golf player
comment: Relation between Golf Player and Television Episode
comment: Relazione tra Golf Player e Television Episode @it
sub property of: work
type: ObjectProperty

links to Wrestler
range: wrestler
sub property of: person
comment: Relazione tra Golf Player e Wrestler @it
type: ObjectProperty
comment: Relation between Golf Player and Wrestler
domain: golf player

soccer manager
label: entraîneur de football @fr
type: Class

basketball team
type: Class

links to Bird
sub property of: species
comment: Relazione tra Golf Player e Bird @it
comment: Relation between Golf Player and Bird
range: bird
type: ObjectProperty
domain: golf player

links to Album
sub property of: work
comment: Relazione tra Golf Player e Album @it
comment: Relation between Golf Player and Album
type: ObjectProperty
domain: golf player
range: album

writer
label: écrivain @fr
type: Class

links to Christian Bishop
type: ObjectProperty
comment: Relation between Golf Player and Christian Bishop
sub property of: person
domain: golf player
range: Christian Bishop
comment: Relazione tra Golf Player e Christian Bishop @it

links to Baseball Player
related match: after
type: NamedIndividual
sub property of: person
comment: Relation between Golf Player and Baseball Player
domain: golf player
range: baseball player
type: ObjectProperty
comment: Relazione tra Golf Player e Baseball Player @it

record label
type: Class
label: label discographique @fr

links to President
comment: Relation between Golf Player and President
comment: Relazione tra Golf Player e President @it
domain: golf player
type: ObjectProperty
sub property of: person
range: president

links to Cyclist
domain: golf player
type: ObjectProperty
comment: Relation between Golf Player and Cyclist
sub property of: person
comment: Relazione tra Golf Player e Cyclist @it
range: cyclist

links to Congressman
comment: Relation between Golf Player and Congressman
comment: Relazione tra Golf Player e Congressman @it
domain: golf player
type: ObjectProperty
range: congressman
sub property of: person

links to Fish
comment: Relation between Golf Player and Fish
comment: Relazione tra Golf Player e Fish @it
type: ObjectProperty
sub property of: species
range: fish
domain: golf player

links to Actor
range: actor
comment: Relazione tra Golf Player e Actor @it
sub property of: person
comment: Relation between Golf Player and Actor
type: ObjectProperty
domain: golf player

links to Ethnic Group
type: ObjectProperty
comment: Relation between Golf Player and Ethnic Group
comment: Relazione tra Golf Player e Ethnic Group @it
domain: golf player
sub property of: ethnic group
range: ethnic group

links to Website
comment: Relazione tra Golf Player e Website @it
comment: Relation between Golf Player and Website
range: website
type: ObjectProperty
domain: golf player
sub property of: website

comics creator
type: Class
label: créateur de bandes dessinées @fr

links to Automobile
comment: Relazione tra Golf Player e Automobile @it
range: automobile
comment: Relation between Golf Player and Automobile
domain: golf player
type: ObjectProperty
sub property of: mean of transportation

aircraft
label: avion @fr
type: Class
label: αεροσκάφος @el

links to Boxer
comment: Relation between Golf Player and Boxer
range: boxer
comment: Relazione tra Golf Player e Boxer @it
sub property of: person
type: ObjectProperty
domain: golf player
type: NamedIndividual
related match: before

hockey team
type: Class
label: équipe de hockey @fr

links to Magazine
domain: golf player
type: ObjectProperty
range: magazine
comment: Relazione tra Golf Player e Magazine @it
comment: Relation between Golf Player and Magazine
sub property of: work

soccer player
type: Class
label: joueur de football @fr

links to Language
comment: Relation between Golf Player and Language
range: language
type: ObjectProperty
domain: golf player
sub property of: language
comment: Relazione tra Golf Player e Language @it

links to Military Person
comment: Relation between Golf Player and Military Person
domain: golf player
comment: Relazione tra Golf Player e Military Person @it
type: ObjectProperty
sub property of: person
range: military person

links to Office Holder
domain: golf player
type: ObjectProperty
comment: Relazione tra Golf Player e Office Holder @it
comment: Relation between Golf Player and Office Holder
range: office holder
sub property of: person

links to Writer
type: ObjectProperty
comment: Relation between Golf Player and Writer
domain: golf player
sub property of: person
comment: Relazione tra Golf Player e Writer @it
range: writer

airline
type: Class
label: compagnie aérienne @fr

congressman
label: membre du Congrès @fr
type: Class

links to Scientist
domain: golf player
range: scientist
type: ObjectProperty
comment: Relation between Golf Player and Scientist
sub property of: person
comment: Relazione tra Golf Player e Scientist @it

links to Stadium
domain: golf player
comment: Relation between Golf Player and Stadium
range: stadium
sub property of: place
comment: Relazione tra Golf Player e Stadium @it
type: ObjectProperty

golf player
type: Class
label: golfeur @fr

links to River
range: river
comment: Relazione tra Golf Player e River @it
type: ObjectProperty
comment: Relation between Golf Player and River
domain: golf player
sub property of: place

journalist
type: Class
label: journaliste @fr

insect
label: insecte @fr
type: Class

film
label: ταινία @el
type: Class

links to Hospital
comment: Relazione tra Golf Player e Hospital @it
comment: Relation between Golf Player and Hospital
range: hospital
sub property of: place
domain: golf player
type: ObjectProperty

american football team
type: Class
label: équipe américaine de football américain @fr

bird
label: oiseau @fr
type: Class

Gaelic games player
label: joueur de sports gaéliques @fr
type: Class

links to Book
type: ObjectProperty
range: book
domain: golf player
sub property of: work
comment: Relation between Golf Player and Book
comment: Relazione tra Golf Player e Book @it

musical artist
label: musicien @fr
type: Class
label: artista musical @pt

links to Grape
domain: golf player
comment: Relazione tra Golf Player e Grape @it
type: ObjectProperty
comment: Relation between Golf Player and Grape
range: grape
sub property of: species

links to Film
range: film
comment: Relation between Golf Player and Film
domain: golf player
comment: Relazione tra Golf Player e Film @it
type: ObjectProperty
sub property of: work

links to Airport
type: ObjectProperty
domain: golf player
comment: Relazione tra Golf Player e Airport @it
sub property of: place
range: airport
comment: Relation between Golf Player and Airport

links to Gaelic Games Player
sub property of: person
domain: golf player
type: ObjectProperty
comment: Relazione tra Golf Player e Gaelic Games Player @it
range: Gaelic games player
comment: Relation between Golf Player and Gaelic Games Player

links to Island
type: ObjectProperty
range: island
comment: Relazione tra Golf Player e Island @it
comment: Relation between Golf Player and Island
domain: golf player
sub property of: place

rugby player
type: Class
label: joueur de rugby @fr

links to Historic Place
type: ObjectProperty
domain: golf player
sub property of: place
comment: Relazione tra Golf Player e Historic Place @it
comment: Relation between Golf Player and Historic Place
range: historic place

american football league
type: Class

links to Musical Artist
domain: golf player
type: ObjectProperty
comment: Relation between Golf Player and Musical Artist
comment: Relazione tra Golf Player e Musical Artist @it
range: musical artist
sub property of: person

links to Comedian
comment: Relation between Golf Player and Comedian
type: ObjectProperty
domain: golf player
comment: Relazione tra Golf Player e Comedian @it
range: comedian
sub property of: person

actor
label: acteur @fr
type: Class
label: Schauspieler @de

cyclist
label: cycliste @fr
type: Class

place
type: ObjectProperty
label: περιοχή @el
label: lieu @fr
label: lugar @pt

links to Military Unit
comment: Relation between Golf Player and Military Unit
range: military unit
type: ObjectProperty
comment: Relazione tra Golf Player e Military Unit @it
domain: golf player
sub property of: organização

infrastructure
type: ObjectProperty

links to Protein
comment: Relation between Golf Player and Protein
domain: golf player
range: protein
comment: Relazione tra Golf Player e Protein @it
sub property of: protein
type: ObjectProperty

links to Comics Creator
sub property of: person
range: comics creator
type: ObjectProperty
domain: golf player
comment: Relazione tra Golf Player e Comics Creator @it
comment: Relation between Golf Player and Comics Creator

links to Olympics
domain: golf player
range: olympics
type: ObjectProperty
sub property of: event
comment: Relazione tra Golf Player e Olympics @it
comment: Relation between Golf Player and Olympics

saint
type: Class

comedian
label: comédien @fr
type: Class

links to Broadcast
type: ObjectProperty
sub property of: organização
range: broadcast
domain: golf player
comment: Relation between Golf Player and Broadcast
comment: Relazione tra Golf Player e Broadcast @it

links to Newspaper
comment: Relazione tra Golf Player e Newspaper @it
domain: golf player
sub property of: work
type: ObjectProperty
range: newspaper
comment: Relation between Golf Player and Newspaper

book
label: książka @pl
label: llibre @ca
label: βιβλίο @el
label: livre @fr
type: Class

links to Single
comment: Relazione tra Golf Player e Single @it
range: single
sub property of: work
comment: Relation between Golf Player and Single
type: ObjectProperty
domain: golf player

links to Museum
range: museum
comment: Relation between Golf Player and Museum
domain: golf player
sub property of: place
type: ObjectProperty
comment: Relazione tra Golf Player e Museum @it

links to Village
sub property of: place
comment: Relation between Golf Player and Village
domain: golf player
comment: Relazione tra Golf Player e Village @it
type: ObjectProperty
range: village

links to College Coach
comment: Relation between Golf Player and College Coach
comment: Relazione tra Golf Player e College Coach @it
type: ObjectProperty
range: college coach
sub property of: person
domain: golf player

non-profit organisation
label: organisation à but non lucratif @fr
type: Class

links to Ice Hockey Player
sub property of: person
type: ObjectProperty
comment: Relazione tra Golf Player e Ice Hockey Player @it
range: ice hockey player
comment: Relation between Golf Player and Ice Hockey Player
domain: golf player

links to Insect
comment: Relazione tra Golf Player e Insect @it
domain: golf player
type: ObjectProperty
sub property of: species
comment: Relation between Golf Player and Insect
range: insect

links to American Football League
domain: golf player
range: american football league
comment: Relazione tra Golf Player e American Football League @it
comment: Relation between Golf Player and American Football League
sub property of: organização
type: ObjectProperty

links to Band
type: ObjectProperty
sub property of: organização
comment: Relation between Golf Player and Band
range: Band
comment: Relazione tra Golf Player e Band @it
domain: golf player

drug
type: ObjectProperty
label: médicament @fr
type: Class

Axiom
dbpedia infobox matching weight: 100.0
annotated property: relatedMatch
annotated source: links to Town
annotated target: residence

links to Soccer Player
related match: after
type: NamedIndividual
sub property of: person
range: soccer player
comment: Relazione tra Golf Player e Soccer Player @it
domain: golf player
comment: Relation between Golf Player and Soccer Player
type: ObjectProperty

magazine
type: Class
label: περιοδικό @el

links to Governor
sub property of: person
domain: golf player
comment: Relation between Golf Player and Governor
range: governor
type: ObjectProperty
comment: Relazione tra Golf Player e Governor @it

links to Drug
comment: Relation between Golf Player and Drug
comment: Relazione tra Golf Player e Drug @it
sub property of: drug
type: ObjectProperty
range: drug
domain: golf player

military person
type: Class
label: militaire @fr

award
type: ObjectProperty
label: récompense @fr
type: Class

anatomical structure
label: structure anatomique @fr
type: ObjectProperty

cricketer
type: Class
label: joueur de cricket @fr

single
type: Class

nerve
label: nerf @fr
type: Class

links to Non- Profit Organisation
range: non-profit organisation
comment: Relation between Golf Player and Non- Profit Organisation
domain: golf player
comment: Relazione tra Golf Player e Non- Profit Organisation @it
type: ObjectProperty
sub property of: organização

links to Airline
comment: Relation between Golf Player and Airline
domain: golf player
sub property of: organização
range: airline
comment: Relazione tra Golf Player e Airline @it
type: ObjectProperty

Band
label: banda @pt
label: Musikgruppe @de
type: Class
label: groupe de musique @fr

town
type: Class
label: ville @fr

Axiom
dbpedia infobox matching weight: 100.0
annotated source: links to Baseball Player
annotated target: after
annotated property: relatedMatch

protein
type: ObjectProperty
type: Class
label: protéine @fr

ethnic group
label: groupe ethnique @fr
type: ObjectProperty
type: Class

links to Bone
type: ObjectProperty
domain: golf player
comment: Relation between Golf Player and Bone
range: bone
sub property of: anatomical structure
comment: Relazione tra Golf Player e Bone @it

hotel
label: hôtel @fr
type: Class

college coach
label: entraîneur universitaire @fr
type: Class

Axiom
dbpedia infobox matching weight: 100.0
annotated target: title
annotated property: relatedMatch
annotated source: links to Award

links to Continent
range: continent
domain: golf player
type: ObjectProperty
comment: Relation between Golf Player and Continent
sub property of: place
comment: Relazione tra Golf Player e Continent @it

links to Record Label
comment: Relation between Golf Player and Record Label
domain: golf player
comment: Relazione tra Golf Player e Record Label @it
range: record label
type: ObjectProperty
sub property of: organização

television episode
label: épisode télévisé @fr
type: Class

village
label: χωριό @el
type: Class

soccer club
label: club de football @fr
type: Class

links to Soccer Club
type: ObjectProperty
domain: golf player
comment: Relazione tra Golf Player e Soccer Club @it
sub property of: organização
comment: Relation between Golf Player and Soccer Club
range: soccer club

links to Disease
comment: Relazione tra Golf Player e Disease @it
domain: golf player
type: ObjectProperty
range: disease
sub property of: disease
comment: Relation between Golf Player and Disease

links to Hockey Team
comment: Relazione tra Golf Player e Hockey Team @it
comment: Relation between Golf Player and Hockey Team
range: hockey team
type: ObjectProperty
domain: golf player
sub property of: organização

office holder
type: Class
label: Amtsinhaber @de
label: titulaire @fr

baseball player
label: joueur de baseball @fr
type: Class

military conflict
type: Class
label: conflit militaire @fr

links to Award
comment: Relazione tra Golf Player e Award @it
range: award
comment: Relation between Golf Player and Award
domain: golf player
type: ObjectProperty
sub property of: award
type: NamedIndividual
related match: title

grape
type: Class
label: raisin @fr

links to Town
related match: residence
type: NamedIndividual
sub property of: place
domain: golf player
comment: Relazione tra Golf Player e Town @it
range: town
type: ObjectProperty
comment: Relation between Golf Player and Town

website
label: site web @fr
label: Ιστότοπος @el
type: Class
type: ObjectProperty

basketball player
label: joueur de basketball @fr
type: Class

Axiom
dbpedia infobox matching weight: 100.0
annotated property: relatedMatch
annotated source: links to American Football Player
annotated target: after

ice hockey player
label: joueur de hockey sur glace @fr
type: Class

mountain range
label: chaîne de montagne @fr
type: Class

Christian Bishop
type: Class
label: évêque chrétien @fr

beverage
type: ObjectProperty
type: Class
label: boisson @fr

scientist
label: Wissenschaftler @de
type: Class
label: scientifique @fr

Axiom
dbpedia infobox matching weight: 100.0
annotated target: college
annotated property: relatedMatch
annotated source: links to School

links to Basketball Team
type: ObjectProperty
domain: golf player
sub property of: organização
comment: Relation between Golf Player and Basketball Team
comment: Relazione tra Golf Player e Basketball Team @it
range: basketball team

olympics
type: Class
label: Jeux Olympiques @fr

links to Nerve
sub property of: anatomical structure
type: ObjectProperty
domain: golf player
range: nerve
comment: Relation between Golf Player and Nerve
comment: Relazione tra Golf Player e Nerve @it

organização
type: ObjectProperty
label: organisation
label: Organisation @de

baseball league
label: ligue de baseball @fr
type: Class

links to Television Show
comment: Relation between Golf Player and Television Show
sub property of: work
range: television show
comment: Relazione tra Golf Player e Television Show @it
type: ObjectProperty
domain: golf player

broadcast
type: Class
label: Émission de télévision @fr

links to Aircraft
comment: Relation between Golf Player and Aircraft
type: ObjectProperty
sub property of: mean of transportation
domain: golf player
comment: Relazione tra Golf Player e Aircraft @it
range: aircraft

links to Journalist
type: ObjectProperty
domain: golf player
comment: Relazione tra Golf Player e Journalist @it
range: journalist
sub property of: person
comment: Relation between Golf Player and Journalist

links to Baseball League
domain: golf player
comment: Relazione tra Golf Player e Baseball League @it
sub property of: organização
comment: Relation between Golf Player and Baseball League
range: baseball league
type: ObjectProperty

mammal
type: Class
label: mammifère @fr

Axiom
dbpedia infobox matching weight: 100.0
annotated source: links to Boxer
annotated property: relatedMatch
annotated target: before

island
label: île @fr
label: νησί @el
type: Class

comics character
type: Class
label: personnage de bandes dessinées @fr

event
label: évènement @fr
type: ObjectProperty

Formula One racer
label: pilote de formule 1 @fr
type: Class

Axiom
dbpedia infobox matching weight: 100.0
annotated source: links to Soccer Player
annotated property: relatedMatch
annotated target: after

radio station
type: Class
label: station de radio @fr

bone
type: Class
label: Knochen @de
label: os @fr

links to Poker Player
domain: golf player
range: poker player
type: ObjectProperty
comment: Relazione tra Golf Player e Poker Player @it
sub property of: person
comment: Relation between Golf Player and Poker Player

airport
label: aéroport @fr
label: Flughafen @de
type: Class