links to Disease
comment: Relazione tra Historic Building e Disease @it
sub property of: disease
range: disease
domain: historic building
type: ObjectProperty
comment: Relation between Historic Building and Disease

television show
label: émission de télévision @fr
type: Class

disease
type: ObjectProperty
type: Class
label: maladie @fr

links to Writer
sub property of: person
range: writer
comment: Relazione tra Historic Building e Writer @it
comment: Relation between Historic Building and Writer
type: ObjectProperty
domain: historic building

Axiom
dbpedia infobox matching weight: 100.0
annotated property: relatedMatch
annotated target: founder
annotated source: links to Office Holder

links to Bird
comment: Relation between Historic Building and Bird
range: bird
domain: historic building
sub property of: species
comment: Relazione tra Historic Building e Bird @it
type: ObjectProperty

links to Currency
comment: Relation between Historic Building and Currency
domain: historic building
sub property of: currency
range: currency
type: ObjectProperty
comment: Relazione tra Historic Building e Currency @it

colour
type: Class
label: couleur @fr
label: χρώμα @el
type: ObjectProperty

links to Journalist
range: journalist
type: ObjectProperty
sub property of: person
domain: historic building
comment: Relation between Historic Building and Journalist
comment: Relazione tra Historic Building e Journalist @it

links to Baseball Player
sub property of: person
domain: historic building
type: ObjectProperty
range: baseball player
comment: Relation between Historic Building and Baseball Player
comment: Relazione tra Historic Building e Baseball Player @it

Election
label: élection @fr
type: Class

links to Record Label
sub property of: organização
range: record label
comment: Relazione tra Historic Building e Record Label @it
domain: historic building
type: ObjectProperty
comment: Relation between Historic Building and Record Label

links to Basketball Player
range: basketball player
type: ObjectProperty
sub property of: person
domain: historic building
comment: Relation between Historic Building and Basketball Player
comment: Relazione tra Historic Building e Basketball Player @it

mean of transportation
label: moyen de transport @fr
type: ObjectProperty

american football player
type: Class
label: joueur de football américain @fr

links to Bridge
type: ObjectProperty
sub property of: place
range: bridge
comment: Relazione tra Historic Building e Bridge @it
comment: Relation between Historic Building and Bridge
domain: historic building

stadium
label: stade @fr
type: Class

links to Soccer Player
domain: historic building
comment: Relazione tra Historic Building e Soccer Player @it
comment: Relation between Historic Building and Soccer Player
sub property of: person
range: soccer player
type: ObjectProperty

astronaut
type: Class
label: Astronaut @de
label: astronaute @fr

links to College Coach
range: college coach
domain: historic building
comment: Relation between Historic Building and College Coach
sub property of: person
type: ObjectProperty
comment: Relazione tra Historic Building e College Coach @it

links to Boxer
type: ObjectProperty
comment: Relazione tra Historic Building e Boxer @it
comment: Relation between Historic Building and Boxer
range: boxer
domain: historic building
sub property of: person

Axiom
dbpedia infobox matching weight: 100.0
annotated property: relatedMatch
annotated target: before
annotated source: links to Historic Place

Site of Special Scientific Interest
type: Class
label: site d'intérêt scientifique particulier @fr

links to Airport
sub property of: place
type: ObjectProperty
domain: historic building
comment: Relation between Historic Building and Airport
range: airport
comment: Relazione tra Historic Building e Airport @it

pope
type: Class
label: pape @fr

species
label: espèce @fr
type: ObjectProperty

links to River
sub property of: place
type: ObjectProperty
domain: historic building
range: river
comment: Relation between Historic Building and River
comment: Relazione tra Historic Building e River @it

newspaper
label: journal @fr
type: Class

protected area
label: aire protégée @fr
label: προστατευμένη περιοχή @el
type: Class

road
label: route @fr
type: Class

links to Criminal
range: criminal
comment: Relazione tra Historic Building e Criminal @it
sub property of: person
domain: historic building
comment: Relation between Historic Building and Criminal
type: ObjectProperty

links to Astronaut
range: astronaut
comment: Relazione tra Historic Building e Astronaut @it
comment: Relation between Historic Building and Astronaut
type: ObjectProperty
domain: historic building
sub property of: person

boxer
type: Class
label: boxeur @fr

judge
type: Class
label: juge @fr

Axiom
dbpedia infobox matching weight: 100.0
annotated target: dedication
annotated property: relatedMatch
annotated source: links to Pope

World Heritage Site
label: site du patrimoine mondial @fr
type: Class

station
type: Class

language
type: Class
label: langage @fr
type: ObjectProperty

links to Museum
range: museum
comment: Relazione tra Historic Building e Museum @it
sub property of: place
domain: historic building
type: ObjectProperty
comment: Relation between Historic Building and Museum

links to University
comment: Relazione tra Historic Building e University @it
sub property of: organização
type: ObjectProperty
domain: historic building
comment: Relation between Historic Building and University
range: university

links to Town
comment: Relation between Historic Building and Town
comment: Relazione tra Historic Building e Town @it
domain: historic building
type: ObjectProperty
range: town
sub property of: place

links to Film
type: ObjectProperty
comment: Relation between Historic Building and Film
domain: historic building
sub property of: work
comment: Relazione tra Historic Building e Film @it
range: film

links to Comedian
sub property of: person
comment: Relazione tra Historic Building e Comedian @it
type: ObjectProperty
domain: historic building
comment: Relation between Historic Building and Comedian
range: comedian

lake
label: lac @fr
type: Class

links to Village
type: ObjectProperty
comment: Relazione tra Historic Building e Village @it
range: village
comment: Relation between Historic Building and Village
domain: historic building
sub property of: place

governor
type: Class
label: gouverneur @fr

work
type: ObjectProperty
label: travail @fr
label: obra @pt

river
label: rivière @fr
type: Class

school
type: Class
label: école @fr

ship
label: navire @fr
type: Class

fish
type: Class
label: poisson @fr

museum
label: musée @fr
type: Class

tennis player
type: Class
label: joueur de tennis @fr

video game
label: jeux vidéo @fr
type: Class

trade union
label: syndicat professionnel @fr
type: Class

links to Insect
type: ObjectProperty
domain: historic building
sub property of: species
comment: Relation between Historic Building and Insect
comment: Relazione tra Historic Building e Insect @it
range: insect

links to Single
sub property of: work
comment: Relazione tra Historic Building e Single @it
range: single
comment: Relation between Historic Building and Single
type: ObjectProperty
domain: historic building

currency
type: ObjectProperty
label: devise @fr
type: Class

prime minister
type: Class
label: premier ministre @fr

historic place
type: Class
label: site historique @fr

hospital
label: hôpital @fr
type: Class

monument
type: Class

links to Scientist
comment: Relation between Historic Building and Scientist
range: scientist
comment: Relazione tra Historic Building e Scientist @it
domain: historic building
type: ObjectProperty
sub property of: person

HistoricBuilding.owl
imports: cpannotationschema.owl
has author: Andrea Giovanni Nuzzolese
type: Ontology
imports: dbpediainfoboxmatchingweight.owl
has author: Valentina Presutti
has intent: To represent the encyclopedic knowledge expressed by an object typed as HistoricBuilding
extracted from: dbpedia.org
has author: Aldo Gangemi
comment: HistoricBuilding Encyclopedic Knowledge Pattern
extracted from: en.wikipedia.org

continent
label: ήπειρος @el
type: Class

president
type: Class
label: président @fr

links to Award
range: award
comment: Relation between Historic Building and Award
domain: historic building
sub property of: award
comment: Relazione tra Historic Building e Award @it
type: ObjectProperty

album
label: Album @de
type: Class

links to Website
comment: Relation between Historic Building and Website
domain: historic building
type: ObjectProperty
sub property of: website
comment: Relazione tra Historic Building e Website @it
range: website

links to American Football Team
comment: Relazione tra Historic Building e American Football Team @it
domain: historic building
type: ObjectProperty
sub property of: organização
comment: Relation between Historic Building and American Football Team
range: american football team

person
label: personne @fr
label: pessoa @pt
type: ObjectProperty
label: Person @de

military unit
label: unité militaire @fr
type: Class

soccer manager
label: entraîneur de football @fr
type: Class

links to Judge
comment: Relazione tra Historic Building e Judge @it
comment: Relation between Historic Building and Judge
sub property of: person
type: ObjectProperty
domain: historic building
range: judge

basketball team
type: Class

links to Mountain
type: ObjectProperty
comment: Relazione tra Historic Building e Mountain @it
comment: Relation between Historic Building and Mountain
domain: historic building
range: mountain
sub property of: place

links to Olympics
range: olympics
sub property of: event
domain: historic building
type: ObjectProperty
comment: Relation between Historic Building and Olympics
comment: Relazione tra Historic Building e Olympics @it

links to Legislature
type: ObjectProperty
range: legislature
sub property of: organização
domain: historic building
comment: Relazione tra Historic Building e Legislature @it
comment: Relation between Historic Building and Legislature

music genre
type: Class
label: género musical @pt
type: ObjectProperty
label: genre musical @fr

writer
type: Class
label: écrivain @fr

record label
label: label discographique @fr
type: Class

links to Cricketer
sub property of: person
comment: Relazione tra Historic Building e Cricketer @it
domain: historic building
range: cricketer
type: ObjectProperty
comment: Relation between Historic Building and Cricketer

links to Conifer
domain: historic building
range: conifer
comment: Relation between Historic Building and Conifer
sub property of: species
comment: Relazione tra Historic Building e Conifer @it
type: ObjectProperty

links to Music Festival
range: music festival
sub property of: event
comment: Relazione tra Historic Building e Music Festival @it
domain: historic building
comment: Relation between Historic Building and Music Festival
type: ObjectProperty

links to Canal
sub property of: place
type: ObjectProperty
range: canal
comment: Relation between Historic Building and Canal
comment: Relazione tra Historic Building e Canal @it
domain: historic building

links to Ethnic Group
type: ObjectProperty
domain: historic building
comment: Relazione tra Historic Building e Ethnic Group @it
sub property of: ethnic group
range: ethnic group
comment: Relation between Historic Building and Ethnic Group

links to Trade Union
sub property of: organização
comment: Relation between Historic Building and Trade Union
domain: historic building
type: ObjectProperty
range: trade union
comment: Relazione tra Historic Building e Trade Union @it

links to Lake
comment: Relation between Historic Building and Lake
domain: historic building
sub property of: place
type: ObjectProperty
range: lake
comment: Relazione tra Historic Building e Lake @it

links to Chemical Compound
domain: historic building
type: ObjectProperty
comment: Relation between Historic Building and Chemical Compound
comment: Relazione tra Historic Building e Chemical Compound @it
sub property of: chemical compound
range: chemical compound

links to Basketball Team
sub property of: organização
range: basketball team
comment: Relation between Historic Building and Basketball Team
comment: Relazione tra Historic Building e Basketball Team @it
type: ObjectProperty
domain: historic building

links to Anatomical Structure
domain: historic building
range: anatomical structure
comment: Relation between Historic Building and Anatomical Structure
type: ObjectProperty
sub property of: anatomical structure
comment: Relazione tra Historic Building e Anatomical Structure @it

links to Stadium
comment: Relazione tra Historic Building e Stadium @it
domain: historic building
sub property of: place
range: stadium
type: ObjectProperty
comment: Relation between Historic Building and Stadium

links to Skyscraper
range: skyscraper
comment: Relation between Historic Building and Skyscraper
comment: Relazione tra Historic Building e Skyscraper @it
type: ObjectProperty
sub property of: place
domain: historic building
type: NamedIndividual
related match: after

links to Sport
comment: Relazione tra Historic Building e Sport @it
range: sport
sub property of: activity
type: ObjectProperty
comment: Relation between Historic Building and Sport
domain: historic building

links to Music Genre
range: music genre
comment: Relation between Historic Building and Music Genre
domain: historic building
type: ObjectProperty
sub property of: music genre
comment: Relazione tra Historic Building e Music Genre @it

Axiom
dbpedia infobox matching weight: 25.0
annotated source: links to Christian Bishop
annotated target: bishop
annotated property: relatedMatch

soccer player
label: joueur de football @fr
type: Class

reptile
type: Class

legislature
label: pouvoir législatif @fr
type: Class

links to Mammal
domain: historic building
type: ObjectProperty
comment: Relation between Historic Building and Mammal
sub property of: species
comment: Relazione tra Historic Building e Mammal @it
range: mammal

monarch
label: monarque @fr
type: Class

congressman
label: membre du Congrès @fr
type: Class

golf player
label: golfeur @fr
type: Class

activity
type: ObjectProperty
label: Aktivität @de
label: activité @fr

journalist
label: journaliste @fr
type: Class

links to World Heritage Site
range: World Heritage Site
comment: Relazione tra Historic Building e World Heritage Site @it
comment: Relation between Historic Building and World Heritage Site
domain: historic building
sub property of: place
type: ObjectProperty

links to Fictional Character
sub property of: person
comment: Relation between Historic Building and Fictional Character
comment: Relazione tra Historic Building e Fictional Character @it
domain: historic building
type: ObjectProperty
range: fictional character

insect
label: insecte @fr
type: Class

links to Mollusca
comment: Relation between Historic Building and Mollusca
type: ObjectProperty
sub property of: species
domain: historic building
range: mollusca
comment: Relazione tra Historic Building e Mollusca @it

Axiom
dbpedia infobox matching weight: 8.33
annotated source: links to Christian Bishop
annotated target: pastBishop
annotated property: relatedMatch

film
type: Class
label: ταινία @el

american football team
label: équipe américaine de football américain @fr
type: Class

links to Election
range: Election
comment: Relation between Historic Building and Election
sub property of: event
comment: Relazione tra Historic Building e Election @it
domain: historic building
type: ObjectProperty

links to Monarch
comment: Relazione tra Historic Building e Monarch @it
type: ObjectProperty
comment: Relation between Historic Building and Monarch
range: monarch
domain: historic building
sub property of: person

bird
label: oiseau @fr
type: Class

chemical compound
label: produit chimique @fr
type: ObjectProperty
type: Class

links to Historic Place
type: NamedIndividual
related match: before
comment: Relation between Historic Building and Historic Place
type: ObjectProperty
sub property of: place
range: historic place
comment: Relazione tra Historic Building e Historic Place @it
domain: historic building

links to Protected Area
domain: historic building
type: ObjectProperty
sub property of: place
comment: Relation between Historic Building and Protected Area
range: protected area
comment: Relazione tra Historic Building e Protected Area @it

musical artist
label: artista musical @pt
type: Class
label: musicien @fr

links to Member Of Parliament
comment: Relazione tra Historic Building e Member Of Parliament @it
sub property of: person
type: ObjectProperty
comment: Relation between Historic Building and Member Of Parliament
domain: historic building
range: member of parliament

links to Musical
range: musical
type: ObjectProperty
domain: historic building
sub property of: work
comment: Relation between Historic Building and Musical
comment: Relazione tra Historic Building e Musical @it

links to Military Unit
range: military unit
comment: Relazione tra Historic Building e Military Unit @it
sub property of: organização
comment: Relation between Historic Building and Military Unit
type: ObjectProperty
domain: historic building

fictional character
label: personnage de fiction @fr
type: Class

park
label: parc @fr
type: Class

links to Reptile
type: ObjectProperty
sub property of: species
range: reptile
domain: historic building
comment: Relation between Historic Building and Reptile
comment: Relazione tra Historic Building e Reptile @it

cardinal
type: Class

rugby player
label: joueur de rugby @fr
type: Class

links to Magazine
type: ObjectProperty
comment: Relazione tra Historic Building e Magazine @it
range: magazine
sub property of: work
comment: Relation between Historic Building and Magazine
domain: historic building

musical
type: Class
label: musique @fr

actor
label: Schauspieler @de
type: Class
label: acteur @fr

links to Office Holder
related match: founder
type: NamedIndividual
comment: Relazione tra Historic Building e Office Holder @it
comment: Relation between Historic Building and Office Holder
domain: historic building
range: office holder
type: ObjectProperty
sub property of: person

place
label: lugar @pt
label: lieu @fr
label: περιοχή @el
type: ObjectProperty

links to Congressman
range: congressman
comment: Relazione tra Historic Building e Congressman @it
comment: Relation between Historic Building and Congressman
type: ObjectProperty
sub property of: person
domain: historic building

links to Ship
sub property of: mean of transportation
comment: Relazione tra Historic Building e Ship @it
type: ObjectProperty
range: ship
domain: historic building
comment: Relation between Historic Building and Ship

infrastructure
type: ObjectProperty

links to Flowering Plant
domain: historic building
sub property of: species
range: flowering plant
comment: Relation between Historic Building and Flowering Plant
type: ObjectProperty
comment: Relazione tra Historic Building e Flowering Plant @it

mountain
label: Βουνό @el
label: montagne @fr
type: Class

criminal
label: criminel @fr
type: Class

flowering plant
type: Class
label: angiospermes @fr

links to Military Person
comment: Relazione tra Historic Building e Military Person @it
domain: historic building
comment: Relation between Historic Building and Military Person
sub property of: person
range: military person
type: ObjectProperty

senator
label: sénateur @fr
type: Class

comedian
type: Class
label: comédien @fr

links to Park
range: park
sub property of: place
comment: Relazione tra Historic Building e Park @it
comment: Relation between Historic Building and Park
domain: historic building
type: ObjectProperty

links to Island
comment: Relation between Historic Building and Island
type: ObjectProperty
domain: historic building
range: island
sub property of: place
comment: Relazione tra Historic Building e Island @it

links to Newspaper
type: ObjectProperty
comment: Relazione tra Historic Building e Newspaper @it
comment: Relation between Historic Building and Newspaper
domain: historic building
sub property of: work
range: newspaper

book
label: książka @pl
label: llibre @ca
label: βιβλίο @el
label: livre @fr
type: Class

shopping mall
label: centre commercial @fr
type: Class

links to Drug
domain: historic building
range: drug
sub property of: drug
comment: Relazione tra Historic Building e Drug @it
comment: Relation between Historic Building and Drug
type: ObjectProperty

bacteria
label: bactérie @fr
type: Class

links to Governor
comment: Relation between Historic Building and Governor
comment: Relazione tra Historic Building e Governor @it
sub property of: person
type: ObjectProperty
range: governor
domain: historic building

non-profit organisation
type: Class
label: organisation à but non lucratif @fr

links to Golf Player
type: ObjectProperty
comment: Relazione tra Historic Building e Golf Player @it
domain: historic building
range: golf player
sub property of: person
comment: Relation between Historic Building and Golf Player

mollusca
type: Class
label: mollusque @fr

links to Ice Hockey Player
type: ObjectProperty
domain: historic building
range: ice hockey player
sub property of: person
comment: Relazione tra Historic Building e Ice Hockey Player @it
comment: Relation between Historic Building and Ice Hockey Player

links to Book
type: ObjectProperty
sub property of: work
range: book
comment: Relation between Historic Building and Book
domain: historic building
comment: Relazione tra Historic Building e Book @it

links to Philosopher
sub property of: person
domain: historic building
type: ObjectProperty
range: philosopher
comment: Relation between Historic Building and Philosopher
comment: Relazione tra Historic Building e Philosopher @it

drug
type: Class
label: médicament @fr
type: ObjectProperty

links to Actor
type: ObjectProperty
domain: historic building
sub property of: person
range: actor
comment: Relation between Historic Building and Actor
comment: Relazione tra Historic Building e Actor @it

links to Monument
sub property of: place
domain: historic building
comment: Relazione tra Historic Building e Monument @it
type: ObjectProperty
comment: Relation between Historic Building and Monument
range: monument

magazine
label: περιοδικό @el
type: Class

links to Pope
type: NamedIndividual
related match: dedication
range: pope
sub property of: person
comment: Relazione tra Historic Building e Pope @it
domain: historic building
comment: Relation between Historic Building and Pope
type: ObjectProperty

links to Language
domain: historic building
type: ObjectProperty
comment: Relation between Historic Building and Language
range: language
sub property of: language
comment: Relazione tra Historic Building e Language @it

canal
type: Class

links to Military Conflict
sub property of: event
comment: Relazione tra Historic Building e Military Conflict @it
range: military conflict
type: ObjectProperty
comment: Relation between Historic Building and Military Conflict
domain: historic building

military person
type: Class
label: militaire @fr

links to Continent
type: ObjectProperty
range: continent
comment: Relazione tra Historic Building e Continent @it
sub property of: place
comment: Relation between Historic Building and Continent
domain: historic building

philosopher
label: philosophe @fr
type: Class

award
type: Class
label: récompense @fr
type: ObjectProperty

links to Colour
domain: historic building
comment: Relazione tra Historic Building e Colour @it
sub property of: colour
comment: Relation between Historic Building and Colour
type: ObjectProperty
range: colour

links to Site Of Special Scientific Interest
domain: historic building
comment: Relation between Historic Building and Site Of Special Scientific Interest
type: ObjectProperty
range: Site of Special Scientific Interest
comment: Relazione tra Historic Building e Site Of Special Scientific Interest @it
sub property of: place

college
type: Class

anatomical structure
type: Class
type: ObjectProperty
label: structure anatomique @fr

sport
type: Class

cricketer
type: Class
label: joueur de cricket @fr

single
type: Class

links to Television Show
sub property of: work
range: television show
comment: Relation between Historic Building and Television Show
comment: Relazione tra Historic Building e Television Show @it
domain: historic building
type: ObjectProperty

links to Senator
type: ObjectProperty
domain: historic building
comment: Relazione tra Historic Building e Senator @it
sub property of: person
range: senator
comment: Relation between Historic Building and Senator

Band
label: banda @pt
label: Musikgruppe @de
type: Class
label: groupe de musique @fr

town
type: Class
label: ville @fr

links to Shopping Mall
type: ObjectProperty
domain: historic building
comment: Relazione tra Historic Building e Shopping Mall @it
range: shopping mall
sub property of: place
comment: Relation between Historic Building and Shopping Mall

university
label: πανεπιστήμιο @el
label: université @fr
type: Class

links to Hospital
type: ObjectProperty
comment: Relazione tra Historic Building e Hospital @it
comment: Relation between Historic Building and Hospital
range: hospital
sub property of: place
domain: historic building

Axiom
dbpedia infobox matching weight: 100.0
annotated target: after
annotated property: relatedMatch
annotated source: links to Skyscraper

ethnic group
type: Class
type: ObjectProperty
label: groupe ethnique @fr

links to Cardinal
comment: Relation between Historic Building and Cardinal
range: cardinal
sub property of: person
domain: historic building
type: ObjectProperty
comment: Relazione tra Historic Building e Cardinal @it

links to Album
domain: historic building
comment: Relazione tra Historic Building e Album @it
type: ObjectProperty
range: album
comment: Relation between Historic Building and Album
sub property of: work

music festival
label: festival de musique @fr
type: Class

college coach
type: Class
label: entraîneur universitaire @fr

television episode
label: épisode télévisé @fr
type: Class

links to President
comment: Relation between Historic Building and President
comment: Relazione tra Historic Building e President @it
domain: historic building
type: ObjectProperty
range: president
sub property of: person

links to Bacteria
domain: historic building
type: ObjectProperty
range: bacteria
comment: Relation between Historic Building and Bacteria
comment: Relazione tra Historic Building e Bacteria @it
sub property of: species

village
type: Class
label: χωριό @el

soccer club
type: Class
label: club de football @fr

historic building
type: Class
label: bâtiment historique @fr

Axiom
dbpedia infobox matching weight: 66.67
annotated source: links to Christian Bishop
annotated property: relatedMatch
annotated target: dedication

office holder
label: Amtsinhaber @de
type: Class
label: titulaire @fr

baseball player
label: joueur de baseball @fr
type: Class

military conflict
type: Class
label: conflit militaire @fr

links to Fish
range: fish
domain: historic building
sub property of: species
comment: Relation between Historic Building and Fish
type: ObjectProperty
comment: Relazione tra Historic Building e Fish @it

website
label: site web @fr
label: Ιστότοπος @el
type: Class
type: ObjectProperty

links to Television Episode
comment: Relazione tra Historic Building e Television Episode @it
domain: historic building
type: ObjectProperty
comment: Relation between Historic Building and Television Episode
sub property of: work
range: television episode

links to Road
range: road
sub property of: infrastructure
comment: Relazione tra Historic Building e Road @it
domain: historic building
comment: Relation between Historic Building and Road
type: ObjectProperty

links to Soccer Manager
domain: historic building
type: ObjectProperty
comment: Relazione tra Historic Building e Soccer Manager @it
range: soccer manager
comment: Relation between Historic Building and Soccer Manager
sub property of: person

basketball player
type: Class
label: joueur de basketball @fr

links to Christian Bishop
sub property of: person
related match: bishop
related match: dedication
type: ObjectProperty
comment: Relation between Historic Building and Christian Bishop
related match: pastBishop
range: Christian Bishop
comment: Relazione tra Historic Building e Christian Bishop @it
domain: historic building
type: NamedIndividual

links to Radio Station
domain: historic building
type: ObjectProperty
comment: Relation between Historic Building and Radio Station
comment: Relazione tra Historic Building e Radio Station @it
range: radio station
sub property of: organização

links to Prime Minister
domain: historic building
type: ObjectProperty
range: prime minister
comment: Relation between Historic Building and Prime Minister
comment: Relazione tra Historic Building e Prime Minister @it
sub property of: person

ice hockey player
label: joueur de hockey sur glace @fr
type: Class

mountain range
type: Class
label: chaîne de montagne @fr

Christian Bishop
type: Class
label: évêque chrétien @fr

links to Rugby Player
comment: Relazione tra Historic Building e Rugby Player @it
domain: historic building
sub property of: person
range: rugby player
comment: Relation between Historic Building and Rugby Player
type: ObjectProperty

beverage
label: boisson @fr
type: Class
type: ObjectProperty

links to Soccer Club
comment: Relazione tra Historic Building e Soccer Club @it
domain: historic building
range: soccer club
type: ObjectProperty
comment: Relation between Historic Building and Soccer Club
sub property of: organização

links to School
domain: historic building
comment: Relation between Historic Building and School
range: school
sub property of: organização
type: ObjectProperty
comment: Relazione tra Historic Building e School @it

planet
type: Class
label: planète @fr
type: ObjectProperty

links to Beverage
comment: Relation between Historic Building and Beverage
range: beverage
type: ObjectProperty
comment: Relazione tra Historic Building e Beverage @it
domain: historic building
sub property of: beverage

links to Station
type: ObjectProperty
domain: historic building
range: station
comment: Relazione tra Historic Building e Station @it
comment: Relation between Historic Building and Station
sub property of: place

scientist
label: Wissenschaftler @de
type: Class
label: scientifique @fr

links to Band
sub property of: organização
comment: Relation between Historic Building and Band
type: ObjectProperty
range: Band
comment: Relazione tra Historic Building e Band @it
domain: historic building

links to Video Game
range: video game
sub property of: work
comment: Relation between Historic Building and Video Game
comment: Relazione tra Historic Building e Video Game @it
domain: historic building
type: ObjectProperty

olympics
type: Class
label: Jeux Olympiques @fr

organização
type: ObjectProperty
label: organisation
label: Organisation @de

links to Musical Artist
sub property of: person
comment: Relation between Historic Building and Musical Artist
type: ObjectProperty
range: musical artist
comment: Relazione tra Historic Building e Musical Artist @it
domain: historic building

bridge
type: Class
label: pont @fr

links to Non- Profit Organisation
type: ObjectProperty
sub property of: organização
domain: historic building
comment: Relazione tra Historic Building e Non- Profit Organisation @it
range: non-profit organisation
comment: Relation between Historic Building and Non- Profit Organisation

broadcast
type: Class
label: Émission de télévision @fr

links to Mountain Range
domain: historic building
comment: Relazione tra Historic Building e Mountain Range @it
range: mountain range
type: ObjectProperty
comment: Relation between Historic Building and Mountain Range
sub property of: place

mammal
label: mammifère @fr
type: Class

island
label: île @fr
label: νησί @el
type: Class

links to Tennis Player
comment: Relazione tra Historic Building e Tennis Player @it
domain: historic building
comment: Relation between Historic Building and Tennis Player
range: tennis player
type: ObjectProperty
sub property of: person

event
label: évènement @fr
type: ObjectProperty

skyscraper
type: Class
label: gratte-ciel @fr

links to College
comment: Relation between Historic Building and College
domain: historic building
sub property of: organização
type: ObjectProperty
range: college
comment: Relazione tra Historic Building e College @it

links to Broadcast
sub property of: organização
domain: historic building
comment: Relazione tra Historic Building e Broadcast @it
comment: Relation between Historic Building and Broadcast
range: broadcast
type: ObjectProperty

radio station
label: station de radio @fr
type: Class

links to American Football Player
domain: historic building
type: ObjectProperty
range: american football player
comment: Relazione tra Historic Building e American Football Player @it
comment: Relation between Historic Building and American Football Player
sub property of: person

member of parliament
label: membre du Parlement @fr
type: Class

links to Planet
type: ObjectProperty
domain: historic building
sub property of: planet
comment: Relation between Historic Building and Planet
comment: Relazione tra Historic Building e Planet @it
range: planet

conifer
type: Class
label: conifères @fr

airport
type: Class
label: Flughafen @de
label: aéroport @fr