links to Olympic Result
comment: Relation between Ice Hockey Player and Olympic Result
domain: ice hockey player
comment: Relazione tra Ice Hockey Player e Olympic Result @it
sub property of: olympic result
type: ObjectProperty
range: olympic result

links to Formula One Racer
domain: ice hockey player
range: Formula One racer
type: ObjectProperty
comment: Relation between Ice Hockey Player and Formula One Racer
sub property of: person
comment: Relazione tra Ice Hockey Player e Formula One Racer @it

television show
type: Class
label: émission de télévision @fr

disease
label: maladie @fr
type: Class
type: ObjectProperty

colour
type: ObjectProperty
label: χρώμα @el
label: couleur @fr
type: Class

automobile
type: Class

links to Baseball Player
related match: after
type: NamedIndividual
comment: Relazione tra Ice Hockey Player e Baseball Player @it
range: baseball player
comment: Relation between Ice Hockey Player and Baseball Player
type: ObjectProperty
domain: ice hockey player
sub property of: person

links to Park
domain: ice hockey player
type: ObjectProperty
range: park
comment: Relazione tra Ice Hockey Player e Park @it
comment: Relation between Ice Hockey Player and Park
sub property of: place

links to Golf Player
comment: Relazione tra Ice Hockey Player e Golf Player @it
type: ObjectProperty
comment: Relation between Ice Hockey Player and Golf Player
domain: ice hockey player
sub property of: person
range: golf player

Election
type: Class
label: élection @fr

american football player
label: joueur de football américain @fr
type: Class

mean of transportation
type: ObjectProperty
label: moyen de transport @fr

Legal Case
label: cas juridique @fr
type: ObjectProperty

links to Muscle
comment: Relation between Ice Hockey Player and Muscle
type: ObjectProperty
domain: ice hockey player
comment: Relazione tra Ice Hockey Player e Muscle @it
range: muscle
sub property of: anatomical structure

stadium
type: Class
label: stade @fr

soccer league
type: Class
label: ligue de football @fr

links to Comics Creator
sub property of: person
comment: Relazione tra Ice Hockey Player e Comics Creator @it
type: ObjectProperty
comment: Relation between Ice Hockey Player and Comics Creator
range: comics creator
domain: ice hockey player

links to British Royalty
comment: Relazione tra Ice Hockey Player e British Royalty @it
comment: Relation between Ice Hockey Player and British Royalty
type: ObjectProperty
sub property of: person
domain: ice hockey player
range: British royalty

wrestler
label: lutteur @fr
type: Class

mayor
label: maire @fr
type: Class

species
type: Class
label: espèce @fr
type: ObjectProperty

links to Reptile
sub property of: species
domain: ice hockey player
type: ObjectProperty
comment: Relation between Ice Hockey Player and Reptile
range: reptile
comment: Relazione tra Ice Hockey Player e Reptile @it

links to Rugby League
comment: Relation between Ice Hockey Player and Rugby League
type: ObjectProperty
domain: ice hockey player
sub property of: organização
comment: Relazione tra Ice Hockey Player e Rugby League @it
range: rugby league

IceHockeyPlayer.owl
has author: Aldo Gangemi
has intent: To represent the encyclopedic knowledge expressed by an object typed as IceHockeyPlayer
imports: dbpediainfoboxmatchingweight.owl
has author: Andrea Giovanni Nuzzolese
comment: IceHockeyPlayer Encyclopedic Knowledge Pattern
imports: cpannotationschema.owl
extracted from: dbpedia.org
has author: Valentina Presutti
type: Ontology
extracted from: en.wikipedia.org

newspaper
type: Class
label: journal @fr

links to Soccer Player
range: soccer player
sub property of: person
comment: Relazione tra Ice Hockey Player e Soccer Player @it
domain: ice hockey player
comment: Relation between Ice Hockey Player and Soccer Player
type: ObjectProperty

game
type: Class
label: jeu @fr

road
type: Class
label: route @fr

links to Military Conflict
sub property of: event
type: ObjectProperty
comment: Relation between Ice Hockey Player and Military Conflict
domain: ice hockey player
range: military conflict
comment: Relazione tra Ice Hockey Player e Military Conflict @it

links to Hospital
sub property of: place
domain: ice hockey player
range: hospital
comment: Relazione tra Ice Hockey Player e Hospital @it
comment: Relation between Ice Hockey Player and Hospital
type: ObjectProperty

boxer
label: boxeur @fr
type: Class

World Heritage Site
type: Class
label: site du patrimoine mondial @fr

station
type: Class

language
type: ObjectProperty
label: langage @fr
type: Class

tennis league
label: ligue de tennis @fr
type: Class

lake
label: lac @fr
type: Class

links to Governor
comment: Relazione tra Ice Hockey Player e Governor @it
domain: ice hockey player
comment: Relation between Ice Hockey Player and Governor
range: governor
type: ObjectProperty
sub property of: person

links to Museum
range: museum
sub property of: place
comment: Relazione tra Ice Hockey Player e Museum @it
domain: ice hockey player
type: ObjectProperty
comment: Relation between Ice Hockey Player and Museum

governor
label: gouverneur @fr
type: Class

work
label: obra @pt
label: travail @fr
type: ObjectProperty

river
label: rivière @fr
type: Class

lacrosse league
label: ligue de crosse @fr
type: Class

school
label: école @fr
type: Class

ship
label: navire @fr
type: Class

fish
label: poisson @fr
type: Class

museum
type: Class
label: musée @fr

tennis player
type: Class
label: joueur de tennis @fr

links to Bird
type: ObjectProperty
comment: Relation between Ice Hockey Player and Bird
comment: Relazione tra Ice Hockey Player e Bird @it
range: bird
sub property of: species
domain: ice hockey player

links to Member Of Parliament
sub property of: person
comment: Relation between Ice Hockey Player and Member Of Parliament
domain: ice hockey player
comment: Relazione tra Ice Hockey Player e Member Of Parliament @it
range: member of parliament
type: ObjectProperty
related match: after
type: NamedIndividual

video game
label: jeux vidéo @fr
type: Class

links to Legislature
type: ObjectProperty
comment: Relation between Ice Hockey Player and Legislature
comment: Relazione tra Ice Hockey Player e Legislature @it
range: legislature
domain: ice hockey player
sub property of: organização

trade union
type: Class
label: syndicat professionnel @fr

currency
type: ObjectProperty
type: Class
label: devise @fr

prime minister
label: premier ministre @fr
type: Class

links to Automobile
range: automobile
domain: ice hockey player
comment: Relazione tra Ice Hockey Player e Automobile @it
type: ObjectProperty
sub property of: mean of transportation
comment: Relation between Ice Hockey Player and Automobile

British royalty
label: royauté Britannique @fr
type: Class

historic place
type: Class
label: site historique @fr

links to Writer
comment: Relazione tra Ice Hockey Player e Writer @it
comment: Relation between Ice Hockey Player and Writer
type: ObjectProperty
range: writer
sub property of: person
domain: ice hockey player

hospital
type: Class
label: hôpital @fr

links to Book
range: book
sub property of: work
comment: Relazione tra Ice Hockey Player e Book @it
domain: ice hockey player
type: ObjectProperty
comment: Relation between Ice Hockey Player and Book

links to Canadian Football Team
domain: ice hockey player
type: ObjectProperty
comment: Relation between Ice Hockey Player and Canadian Football Team
comment: Relazione tra Ice Hockey Player e Canadian Football Team @it
sub property of: organização
range: canadian football team

links to Continent
type: ObjectProperty
domain: ice hockey player
range: continent
sub property of: place
comment: Relazione tra Ice Hockey Player e Continent @it
comment: Relation between Ice Hockey Player and Continent

Axiom
dbpedia infobox matching weight: 40.0
annotated target: playedFor
annotated source: links to Soccer Club
annotated property: relatedMatch

continent
label: ήπειρος @el
type: Class

links to Airline
sub property of: organização
comment: Relation between Ice Hockey Player and Airline
domain: ice hockey player
range: airline
comment: Relazione tra Ice Hockey Player e Airline @it
type: ObjectProperty

president
label: président @fr
type: Class

album
type: Class
label: Album @de

figure skater
type: Class
label: patineur artistique @fr

person
label: personne @fr
type: ObjectProperty
label: pessoa @pt
label: Person @de

military unit
type: Class
label: unité militaire @fr

links to Senator
comment: Relation between Ice Hockey Player and Senator
sub property of: person
domain: ice hockey player
comment: Relazione tra Ice Hockey Player e Senator @it
range: senator
type: ObjectProperty

soccer manager
type: Class
label: entraîneur de football @fr

links to Election
comment: Relation between Ice Hockey Player and Election
comment: Relazione tra Ice Hockey Player e Election @it
type: ObjectProperty
sub property of: event
range: Election
domain: ice hockey player

basketball team
type: Class

links to American Football League
domain: ice hockey player
sub property of: organização
comment: Relation between Ice Hockey Player and American Football League
type: ObjectProperty
comment: Relazione tra Ice Hockey Player e American Football League @it
range: american football league

links to Baseball League
sub property of: organização
domain: ice hockey player
comment: Relation between Ice Hockey Player and Baseball League
comment: Relazione tra Ice Hockey Player e Baseball League @it
type: ObjectProperty
range: baseball league

canadian football team
label: équipe canadienne de football américain @fr
type: Class

music genre
type: Class
label: género musical @pt
type: ObjectProperty
label: genre musical @fr

links to College Coach
domain: ice hockey player
range: college coach
comment: Relazione tra Ice Hockey Player e College Coach @it
type: ObjectProperty
sub property of: person
comment: Relation between Ice Hockey Player and College Coach

writer
type: Class
label: écrivain @fr

model
type: Class
label: mannequin @fr

olympic result
label: résultat de Jeux Olympiques @fr
type: Class
type: ObjectProperty

links to Band
sub property of: organização
comment: Relation between Ice Hockey Player and Band
type: ObjectProperty
range: Band
comment: Relazione tra Ice Hockey Player e Band @it
domain: ice hockey player

links to Lake
comment: Relation between Ice Hockey Player and Lake
domain: ice hockey player
sub property of: place
comment: Relazione tra Ice Hockey Player e Lake @it
range: lake
type: ObjectProperty

links to Vein
sub property of: anatomical structure
domain: ice hockey player
comment: Relazione tra Ice Hockey Player e Vein @it
range: vein
comment: Relation between Ice Hockey Player and Vein
type: ObjectProperty

links to Wrestler
type: ObjectProperty
comment: Relazione tra Ice Hockey Player e Wrestler @it
comment: Relation between Ice Hockey Player and Wrestler
domain: ice hockey player
range: wrestler
sub property of: person

links to Soccer League
type: ObjectProperty
comment: Relazione tra Ice Hockey Player e Soccer League @it
range: soccer league
domain: ice hockey player
sub property of: organização
comment: Relation between Ice Hockey Player and Soccer League

links to Mayor
comment: Relazione tra Ice Hockey Player e Mayor @it
domain: ice hockey player
type: ObjectProperty
sub property of: person
comment: Relation between Ice Hockey Player and Mayor
range: mayor

links to Figure Skater
comment: Relation between Ice Hockey Player and Figure Skater
type: ObjectProperty
sub property of: person
domain: ice hockey player
range: figure skater
comment: Relazione tra Ice Hockey Player e Figure Skater @it

links to Scientist
comment: Relazione tra Ice Hockey Player e Scientist @it
domain: ice hockey player
comment: Relation between Ice Hockey Player and Scientist
sub property of: person
type: ObjectProperty
range: scientist

comics creator
label: créateur de bandes dessinées @fr
type: Class

aircraft
label: avion @fr
type: Class
label: αεροσκάφος @el

links to Planet
domain: ice hockey player
comment: Relation between Ice Hockey Player and Planet
comment: Relazione tra Ice Hockey Player e Planet @it
sub property of: planet
type: ObjectProperty
range: planet

soccer player
type: Class
label: joueur de football @fr

links to School
sub property of: organização
comment: Relation between Ice Hockey Player and School
comment: Relazione tra Ice Hockey Player e School @it
type: ObjectProperty
range: school
domain: ice hockey player

links to Wrestling Event
range: wrestling event
sub property of: event
comment: Relation between Ice Hockey Player and Wrestling Event
type: ObjectProperty
domain: ice hockey player
comment: Relazione tra Ice Hockey Player e Wrestling Event @it

reptile
type: Class

legislature
type: Class
label: pouvoir législatif @fr

airline
type: Class
label: compagnie aérienne @fr

links to Mammal
type: ObjectProperty
range: mammal
comment: Relation between Ice Hockey Player and Mammal
domain: ice hockey player
sub property of: species
comment: Relazione tra Ice Hockey Player e Mammal @it

Axiom
dbpedia infobox matching weight: 100.0
annotated property: relatedMatch
annotated source: links to Member Of Parliament
annotated target: after

golf player
type: Class
label: golfeur @fr

nascar driver
type: Class
label: pilote de la nascar @fr

activity
type: ObjectProperty
label: Aktivität @de
label: activité @fr

journalist
label: journaliste @fr
type: Class

links to Radio Station
comment: Relation between Ice Hockey Player and Radio Station
type: ObjectProperty
domain: ice hockey player
sub property of: organização
comment: Relazione tra Ice Hockey Player e Radio Station @it
range: radio station

links to World Heritage Site
type: ObjectProperty
sub property of: place
comment: Relazione tra Ice Hockey Player e World Heritage Site @it
comment: Relation between Ice Hockey Player and World Heritage Site
range: World Heritage Site
domain: ice hockey player

film
type: Class
label: ταινία @el

links to Comics Character
range: comics character
domain: ice hockey player
type: ObjectProperty
sub property of: person
comment: Relation between Ice Hockey Player and Comics Character
comment: Relazione tra Ice Hockey Player e Comics Character @it

links to Aircraft
sub property of: mean of transportation
domain: ice hockey player
comment: Relazione tra Ice Hockey Player e Aircraft @it
range: aircraft
type: ObjectProperty
comment: Relation between Ice Hockey Player and Aircraft

links to Road
comment: Relation between Ice Hockey Player and Road
domain: ice hockey player
range: road
type: ObjectProperty
sub property of: infrastructure
comment: Relazione tra Ice Hockey Player e Road @it

american football team
type: Class
label: équipe américaine de football américain @fr

Supreme Court of the United States case
type: Class
label: cas juridique de la Cour suprême des États-Unis @fr

links to Criminal
domain: ice hockey player
comment: Relation between Ice Hockey Player and Criminal
range: criminal
comment: Relazione tra Ice Hockey Player e Criminal @it
sub property of: person
type: ObjectProperty

links to Boxer
type: ObjectProperty
domain: ice hockey player
comment: Relation between Ice Hockey Player and Boxer
comment: Relazione tra Ice Hockey Player e Boxer @it
range: boxer
sub property of: person

bird
label: oiseau @fr
type: Class

chemical compound
label: produit chimique @fr
type: ObjectProperty
type: Class

links to Ethnic Group
sub property of: ethnic group
domain: ice hockey player
type: ObjectProperty
comment: Relation between Ice Hockey Player and Ethnic Group
range: ethnic group
comment: Relazione tra Ice Hockey Player e Ethnic Group @it

links to Bridge
comment: Relation between Ice Hockey Player and Bridge
range: bridge
type: ObjectProperty
comment: Relazione tra Ice Hockey Player e Bridge @it
sub property of: place
domain: ice hockey player

links to Skyscraper
comment: Relazione tra Ice Hockey Player e Skyscraper @it
comment: Relation between Ice Hockey Player and Skyscraper
sub property of: place
range: skyscraper
domain: ice hockey player
type: ObjectProperty

links to Colour
type: ObjectProperty
domain: ice hockey player
comment: Relazione tra Ice Hockey Player e Colour @it
range: colour
sub property of: colour
comment: Relation between Ice Hockey Player and Colour

musical artist
label: artista musical @pt
type: Class
label: musicien @fr

links to Basketball Player
type: ObjectProperty
comment: Relation between Ice Hockey Player and Basketball Player
sub property of: person
comment: Relazione tra Ice Hockey Player e Basketball Player @it
range: basketball player
domain: ice hockey player
related match: before
type: NamedIndividual

links to Military Person
type: ObjectProperty
domain: ice hockey player
range: military person
comment: Relazione tra Ice Hockey Player e Military Person @it
sub property of: person
comment: Relation between Ice Hockey Player and Military Person

Axiom
dbpedia infobox matching weight: 100.0
annotated target: after
annotated property: relatedMatch
annotated source: links to Office Holder

links to Fish
range: fish
sub property of: species
type: ObjectProperty
comment: Relation between Ice Hockey Player and Fish
domain: ice hockey player
comment: Relazione tra Ice Hockey Player e Fish @it

links to Basketball League
type: ObjectProperty
range: basketball league
comment: Relazione tra Ice Hockey Player e Basketball League @it
comment: Relation between Ice Hockey Player and Basketball League
domain: ice hockey player
sub property of: organização

park
type: Class
label: parc @fr

brain
type: Class
label: cerveau @fr

rugby player
type: Class
label: joueur de rugby @fr

links to Stadium
type: ObjectProperty
domain: ice hockey player
comment: Relazione tra Ice Hockey Player e Stadium @it
sub property of: place
range: stadium
comment: Relation between Ice Hockey Player and Stadium

links to Office Holder
comment: Relazione tra Ice Hockey Player e Office Holder @it
domain: ice hockey player
type: ObjectProperty
sub property of: person
range: office holder
comment: Relation between Ice Hockey Player and Office Holder
type: NamedIndividual
related match: after

american football league
type: Class

musical
label: musique @fr
type: Class

links to Award
sub property of: award
range: award
comment: Relazione tra Ice Hockey Player e Award @it
type: ObjectProperty
domain: ice hockey player
comment: Relation between Ice Hockey Player and Award

Axiom
dbpedia infobox matching weight: 66.67
annotated source: links to American Football Player
annotated property: relatedMatch
annotated target: after

links to Magazine
comment: Relation between Ice Hockey Player and Magazine
comment: Relazione tra Ice Hockey Player e Magazine @it
type: ObjectProperty
range: magazine
sub property of: work
domain: ice hockey player

actor
label: Schauspieler @de
type: Class
label: acteur @fr

cyclist
label: cycliste @fr
type: Class

place
label: lugar @pt
label: lieu @fr
label: περιοχή @el
type: ObjectProperty

links to President
range: president
type: ObjectProperty
sub property of: person
domain: ice hockey player
comment: Relation between Ice Hockey Player and President
comment: Relazione tra Ice Hockey Player e President @it

links to Actor
related match: after
type: NamedIndividual
sub property of: person
comment: Relation between Ice Hockey Player and Actor
range: actor
type: ObjectProperty
domain: ice hockey player
comment: Relazione tra Ice Hockey Player e Actor @it

links to Ski Area
comment: Relation between Ice Hockey Player and Ski Area
type: ObjectProperty
comment: Relazione tra Ice Hockey Player e Ski Area @it
domain: ice hockey player
sub property of: place
range: ski area

wrestling event
type: Class
label: match de catch @fr

links to Olympics
range: olympics
comment: Relation between Ice Hockey Player and Olympics
comment: Relazione tra Ice Hockey Player e Olympics @it
sub property of: event
domain: ice hockey player
type: ObjectProperty
related match: years
type: NamedIndividual

links to Nerve
domain: ice hockey player
comment: Relazione tra Ice Hockey Player e Nerve @it
type: ObjectProperty
range: nerve
comment: Relation between Ice Hockey Player and Nerve
sub property of: anatomical structure

infrastructure
type: ObjectProperty

links to Prime Minister
type: ObjectProperty
domain: ice hockey player
comment: Relazione tra Ice Hockey Player e Prime Minister @it
comment: Relation between Ice Hockey Player and Prime Minister
sub property of: person
range: prime minister

basketball league
type: Class
label: ligue de basketball @fr

mountain
label: Βουνό @el
label: montagne @fr
type: Class

links to Mountain
comment: Relation between Ice Hockey Player and Mountain
type: ObjectProperty
comment: Relazione tra Ice Hockey Player e Mountain @it
domain: ice hockey player
range: mountain
sub property of: place

criminal
type: Class
label: criminel @fr

links to Ship
domain: ice hockey player
comment: Relazione tra Ice Hockey Player e Ship @it
range: ship
sub property of: mean of transportation
type: ObjectProperty
comment: Relation between Ice Hockey Player and Ship

senator
type: Class
label: sénateur @fr

Axiom
dbpedia infobox matching weight: 100.0
annotated target: before
annotated property: relatedMatch
annotated source: links to Basketball Player

comedian
type: Class
label: comédien @fr

links to Brain
domain: ice hockey player
comment: Relation between Ice Hockey Player and Brain
comment: Relazione tra Ice Hockey Player e Brain @it
sub property of: anatomical structure
range: brain
type: ObjectProperty

Playboy Playmate
label: playmate pour Playboy @fr
type: Class

book
type: Class
label: livre @fr
label: βιβλίο @el
label: książka @pl
label: llibre @ca

links to Town
domain: ice hockey player
sub property of: place
comment: Relazione tra Ice Hockey Player e Town @it
comment: Relation between Ice Hockey Player and Town
type: ObjectProperty
range: town

device
type: ObjectProperty
label: appareil @fr

shopping mall
label: centre commercial @fr
type: Class

links to Television Show
comment: Relazione tra Ice Hockey Player e Television Show @it
type: ObjectProperty
range: television show
comment: Relation between Ice Hockey Player and Television Show
domain: ice hockey player
sub property of: work

links to Newspaper
type: ObjectProperty
comment: Relation between Ice Hockey Player and Newspaper
sub property of: work
range: newspaper
domain: ice hockey player
comment: Relazione tra Ice Hockey Player e Newspaper @it

links to Comedian
comment: Relazione tra Ice Hockey Player e Comedian @it
range: comedian
domain: ice hockey player
sub property of: person
comment: Relation between Ice Hockey Player and Comedian
type: ObjectProperty

ski area
label: domaine skiable @fr
type: Class

links to American Football Team
sub property of: organização
comment: Relazione tra Ice Hockey Player e American Football Team @it
domain: ice hockey player
type: ObjectProperty
comment: Relation between Ice Hockey Player and American Football Team
range: american football team

non-profit organisation
type: Class
label: organisation à but non lucratif @fr

links to Playboy Playmate
domain: ice hockey player
range: Playboy Playmate
type: ObjectProperty
comment: Relazione tra Ice Hockey Player e Playboy Playmate @it
sub property of: person
comment: Relation between Ice Hockey Player and Playboy Playmate

canadian football league
type: Class

links to Journalist
sub property of: person
domain: ice hockey player
comment: Relation between Ice Hockey Player and Journalist
comment: Relazione tra Ice Hockey Player e Journalist @it
range: journalist
type: ObjectProperty

links to Cyclist
type: ObjectProperty
domain: ice hockey player
range: cyclist
comment: Relation between Ice Hockey Player and Cyclist
comment: Relazione tra Ice Hockey Player e Cyclist @it
sub property of: person

rugby league
type: Class
label: ligue de rugby @fr

links to Military Unit
domain: ice hockey player
comment: Relation between Ice Hockey Player and Military Unit
range: military unit
type: ObjectProperty
sub property of: organização
comment: Relazione tra Ice Hockey Player e Military Unit @it

links to Species
domain: ice hockey player
type: ObjectProperty
sub property of: species
comment: Relazione tra Ice Hockey Player e Species @it
range: species
comment: Relation between Ice Hockey Player and Species

Axiom
dbpedia infobox matching weight: 100.0
annotated property: relatedMatch
annotated source: links to Olympics
annotated target: years

weapon
type: Class
label: arme @fr

links to Island
range: island
domain: ice hockey player
sub property of: place
comment: Relazione tra Ice Hockey Player e Island @it
comment: Relation between Ice Hockey Player and Island
type: ObjectProperty

drug
type: ObjectProperty
label: médicament @fr
type: Class

links to Canadian Football League
comment: Relation between Ice Hockey Player and Canadian Football League
domain: ice hockey player
type: ObjectProperty
sub property of: organização
comment: Relazione tra Ice Hockey Player e Canadian Football League @it
range: canadian football league

links to Cricketer
domain: ice hockey player
sub property of: person
comment: Relazione tra Ice Hockey Player e Cricketer @it
comment: Relation between Ice Hockey Player and Cricketer
type: ObjectProperty
range: cricketer

links to Non- Profit Organisation
domain: ice hockey player
type: ObjectProperty
range: non-profit organisation
sub property of: organização
comment: Relazione tra Ice Hockey Player e Non- Profit Organisation @it
comment: Relation between Ice Hockey Player and Non- Profit Organisation

magazine
type: Class
label: περιοδικό @el

military person
label: militaire @fr
type: Class

award
type: ObjectProperty
label: récompense @fr
type: Class

links to Tennis Player
range: tennis player
domain: ice hockey player
type: ObjectProperty
sub property of: person
comment: Relation between Ice Hockey Player and Tennis Player
comment: Relazione tra Ice Hockey Player e Tennis Player @it

anatomical structure
label: structure anatomique @fr
type: ObjectProperty

Axiom
dbpedia infobox matching weight: 100.0
annotated property: relatedMatch
annotated source: links to Music Genre
annotated target: formerTeams

links to Station
comment: Relation between Ice Hockey Player and Station
domain: ice hockey player
comment: Relazione tra Ice Hockey Player e Station @it
range: station
type: ObjectProperty
sub property of: place

cricketer
type: Class
label: joueur de cricket @fr

nerve
label: nerf @fr
type: Class

single
type: Class

links to Airport
type: ObjectProperty
domain: ice hockey player
sub property of: place
range: airport
comment: Relazione tra Ice Hockey Player e Airport @it
comment: Relation between Ice Hockey Player and Airport

Band
label: groupe de musique @fr
type: Class
label: Musikgruppe @de
label: banda @pt

links to Trade Union
type: ObjectProperty
domain: ice hockey player
sub property of: organização
comment: Relazione tra Ice Hockey Player e Trade Union @it
comment: Relation between Ice Hockey Player and Trade Union
range: trade union

town
label: ville @fr
type: Class

links to Game
comment: Relazione tra Ice Hockey Player e Game @it
comment: Relation between Ice Hockey Player and Game
domain: ice hockey player
sub property of: activity
range: game
type: ObjectProperty

links to Lacrosse League
type: ObjectProperty
sub property of: organização
domain: ice hockey player
comment: Relazione tra Ice Hockey Player e Lacrosse League @it
range: lacrosse league
comment: Relation between Ice Hockey Player and Lacrosse League

links to Village
range: village
sub property of: place
type: ObjectProperty
domain: ice hockey player
comment: Relazione tra Ice Hockey Player e Village @it
comment: Relation between Ice Hockey Player and Village

ethnic group
type: Class
type: ObjectProperty
label: groupe ethnique @fr

artery
label: Arterie @de
type: Class
label: artère @fr

links to Video Game
type: ObjectProperty
range: video game
sub property of: work
comment: Relazione tra Ice Hockey Player e Video Game @it
comment: Relation between Ice Hockey Player and Video Game
domain: ice hockey player

links to Single
comment: Relation between Ice Hockey Player and Single
type: ObjectProperty
domain: ice hockey player
range: single
sub property of: work
comment: Relazione tra Ice Hockey Player e Single @it

links to Language
comment: Relazione tra Ice Hockey Player e Language @it
range: language
sub property of: language
type: ObjectProperty
comment: Relation between Ice Hockey Player and Language
domain: ice hockey player

links to Chemical Compound
domain: ice hockey player
sub property of: chemical compound
comment: Relazione tra Ice Hockey Player e Chemical Compound @it
type: ObjectProperty
comment: Relation between Ice Hockey Player and Chemical Compound
range: chemical compound

links to Musical
sub property of: work
comment: Relation between Ice Hockey Player and Musical
domain: ice hockey player
range: musical
comment: Relazione tra Ice Hockey Player e Musical @it
type: ObjectProperty

links to Nascar Driver
comment: Relazione tra Ice Hockey Player e Nascar Driver @it
type: ObjectProperty
sub property of: person
comment: Relation between Ice Hockey Player and Nascar Driver
range: nascar driver
domain: ice hockey player

links to Tennis League
domain: ice hockey player
comment: Relazione tra Ice Hockey Player e Tennis League @it
comment: Relation between Ice Hockey Player and Tennis League
type: ObjectProperty
range: tennis league
sub property of: organização

links to Album
range: album
type: ObjectProperty
comment: Relazione tra Ice Hockey Player e Album @it
comment: Relation between Ice Hockey Player and Album
domain: ice hockey player
sub property of: work

college coach
type: Class
label: entraîneur universitaire @fr

links to Plant
domain: ice hockey player
comment: Relazione tra Ice Hockey Player e Plant @it
sub property of: species
range: plant
type: ObjectProperty
comment: Relation between Ice Hockey Player and Plant

links to Bone
domain: ice hockey player
comment: Relation between Ice Hockey Player and Bone
comment: Relazione tra Ice Hockey Player e Bone @it
sub property of: anatomical structure
range: bone
type: ObjectProperty

muscle
type: Class

links to River
domain: ice hockey player
type: ObjectProperty
sub property of: place
comment: Relation between Ice Hockey Player and River
comment: Relazione tra Ice Hockey Player e River @it
range: river

village
type: Class
label: χωριό @el

links to Basketball Team
range: basketball team
domain: ice hockey player
sub property of: organização
comment: Relazione tra Ice Hockey Player e Basketball Team @it
comment: Relation between Ice Hockey Player and Basketball Team
type: ObjectProperty

links to Disease
type: ObjectProperty
domain: ice hockey player
sub property of: disease
range: disease
comment: Relation between Ice Hockey Player and Disease
comment: Relazione tra Ice Hockey Player e Disease @it

inline hockey league
label: ligue de roller inline hockey @fr
type: Class

links to Beverage
comment: Relazione tra Ice Hockey Player e Beverage @it
sub property of: beverage
range: beverage
domain: ice hockey player
type: ObjectProperty
comment: Relation between Ice Hockey Player and Beverage

links to Website
comment: Relazione tra Ice Hockey Player e Website @it
comment: Relation between Ice Hockey Player and Website
type: ObjectProperty
domain: ice hockey player
sub property of: website
range: website

soccer club
type: Class
label: club de football @fr

links to Musical Artist
comment: Relazione tra Ice Hockey Player e Musical Artist @it
comment: Relation between Ice Hockey Player and Musical Artist
range: musical artist
domain: ice hockey player
type: ObjectProperty
sub property of: person

links to Music Genre
related match: formerTeams
type: NamedIndividual
comment: Relation between Ice Hockey Player and Music Genre
range: music genre
type: ObjectProperty
comment: Relazione tra Ice Hockey Player e Music Genre @it
domain: ice hockey player
sub property of: music genre

Axiom
dbpedia infobox matching weight: 100.0
annotated target: after
annotated property: relatedMatch
annotated source: links to Actor

historic building
label: bâtiment historique @fr
type: Class

baseball player
label: joueur de baseball @fr
type: Class

office holder
label: titulaire @fr
label: Amtsinhaber @de
type: Class

military conflict
type: Class
label: conflit militaire @fr

website
label: Ιστότοπος @el
label: site web @fr
type: Class
type: ObjectProperty

links to Golf League
domain: ice hockey player
comment: Relation between Ice Hockey Player and Golf League
range: golf league
comment: Relazione tra Ice Hockey Player e Golf League @it
type: ObjectProperty
sub property of: organização

basketball player
type: Class
label: joueur de basketball @fr

ice hockey player
type: Class
label: joueur de hockey sur glace @fr

mountain range
label: chaîne de montagne @fr
type: Class

links to Mountain Range
domain: ice hockey player
range: mountain range
sub property of: place
type: ObjectProperty
comment: Relazione tra Ice Hockey Player e Mountain Range @it
comment: Relation between Ice Hockey Player and Mountain Range

links to Shopping Mall
domain: ice hockey player
sub property of: place
type: ObjectProperty
comment: Relation between Ice Hockey Player and Shopping Mall
range: shopping mall
comment: Relazione tra Ice Hockey Player e Shopping Mall @it

beverage
type: ObjectProperty
type: Class
label: boisson @fr

Axiom
dbpedia infobox matching weight: 33.33
annotated property: relatedMatch
annotated source: links to American Football Player
annotated target: years

links to Model
comment: Relazione tra Ice Hockey Player e Model @it
range: model
comment: Relation between Ice Hockey Player and Model
type: ObjectProperty
sub property of: person
domain: ice hockey player

planet
type: Class
label: planète @fr
type: ObjectProperty

links to Broadcast
sub property of: organização
type: ObjectProperty
comment: Relazione tra Ice Hockey Player e Broadcast @it
range: broadcast
domain: ice hockey player
comment: Relation between Ice Hockey Player and Broadcast

scientist
label: scientifique @fr
type: Class
label: Wissenschaftler @de

golf league
label: ligue de golf @fr
type: Class

olympics
label: Jeux Olympiques @fr
type: Class

organização
type: ObjectProperty
label: organisation
label: Organisation @de

baseball league
label: ligue de baseball @fr
type: Class

Axiom
dbpedia infobox matching weight: 100.0
annotated property: relatedMatch
annotated target: after
annotated source: links to Baseball Player

bridge
label: pont @fr
type: Class

links to Inline Hockey League
type: ObjectProperty
comment: Relation between Ice Hockey Player and Inline Hockey League
range: inline hockey league
domain: ice hockey player
sub property of: organização
comment: Relazione tra Ice Hockey Player e Inline Hockey League @it

links to Film
comment: Relation between Ice Hockey Player and Film
sub property of: work
range: film
domain: ice hockey player
type: ObjectProperty
comment: Relazione tra Ice Hockey Player e Film @it

links to Supreme Court Of The United States Case
domain: ice hockey player
type: ObjectProperty
comment: Relation between Ice Hockey Player and Supreme Court Of The United States Case
comment: Relazione tra Ice Hockey Player e Supreme Court Of The United States Case @it
range: Supreme Court of the United States case
sub property of: Legal Case

plant
label: plante @fr
type: Class

broadcast
type: Class
label: Émission de télévision @fr

links to Currency
domain: ice hockey player
sub property of: currency
comment: Relation between Ice Hockey Player and Currency
type: ObjectProperty
range: currency
comment: Relazione tra Ice Hockey Player e Currency @it

vein
label: veine @fr
type: Class

mammal
type: Class
label: mammifère @fr

links to Historic Place
type: ObjectProperty
domain: ice hockey player
range: historic place
comment: Relation between Ice Hockey Player and Historic Place
comment: Relazione tra Ice Hockey Player e Historic Place @it
sub property of: place

links to Weapon
domain: ice hockey player
comment: Relazione tra Ice Hockey Player e Weapon @it
range: weapon
comment: Relation between Ice Hockey Player and Weapon
sub property of: device
type: ObjectProperty

island
label: île @fr
label: νησί @el
type: Class

comics character
label: personnage de bandes dessinées @fr
type: Class

links to Rugby Player
comment: Relazione tra Ice Hockey Player e Rugby Player @it
sub property of: person
range: rugby player
domain: ice hockey player
comment: Relation between Ice Hockey Player and Rugby Player
type: ObjectProperty

links to Soccer Manager
type: ObjectProperty
sub property of: person
comment: Relation between Ice Hockey Player and Soccer Manager
range: soccer manager
domain: ice hockey player
comment: Relazione tra Ice Hockey Player e Soccer Manager @it

event
label: évènement @fr
type: ObjectProperty

skyscraper
label: gratte-ciel @fr
type: Class

Formula One racer
type: Class
label: pilote de formule 1 @fr

links to American Football Player
comment: Relation between Ice Hockey Player and American Football Player
range: american football player
type: ObjectProperty
related match: after
type: NamedIndividual
comment: Relazione tra Ice Hockey Player e American Football Player @it
related match: years
domain: ice hockey player
sub property of: person

radio station
type: Class
label: station de radio @fr

bone
type: Class
label: Knochen @de
label: os @fr

member of parliament
label: membre du Parlement @fr
type: Class

Axiom
dbpedia infobox matching weight: 60.0
annotated target: formerTeams
annotated source: links to Soccer Club
annotated property: relatedMatch

links to Drug
domain: ice hockey player
comment: Relazione tra Ice Hockey Player e Drug @it
type: ObjectProperty
sub property of: drug
comment: Relation between Ice Hockey Player and Drug
range: drug

links to Historic Building
range: historic building
type: ObjectProperty
domain: ice hockey player
comment: Relazione tra Ice Hockey Player e Historic Building @it
sub property of: place
comment: Relation between Ice Hockey Player and Historic Building

links to Soccer Club
comment: Relazione tra Ice Hockey Player e Soccer Club @it
related match: playedFor
range: soccer club
comment: Relation between Ice Hockey Player and Soccer Club
domain: ice hockey player
type: NamedIndividual
related match: formerTeams
type: ObjectProperty
sub property of: organização

links to Artery
comment: Relation between Ice Hockey Player and Artery
domain: ice hockey player
type: ObjectProperty
sub property of: anatomical structure
range: artery
comment: Relazione tra Ice Hockey Player e Artery @it

airport
label: aéroport @fr
label: Flughafen @de
type: Class