links to Comedian
sub property of: person
type: ObjectProperty
comment: Relazione tra Journalist e Comedian @it
range: comedian
comment: Relation between Journalist and Comedian
domain: journalist

links to Canadian Football League
comment: Relation between Journalist and Canadian Football League
type: ObjectProperty
range: canadian football league
comment: Relazione tra Journalist e Canadian Football League @it
sub property of: organisation
domain: journalist

links to Protected Area
comment: Relation between Journalist and Protected Area
type: ObjectProperty
domain: journalist
sub property of: place
comment: Relazione tra Journalist e Protected Area @it
range: protected area

rocket
type: Class
label: fusée @fr

Axiom
dbpedia infobox matching weight: 100.0
annotated property: relatedMatch
annotated target: after
annotated source: links to College Coach

links to Hospital
comment: Relation between Journalist and Hospital
type: ObjectProperty
range: hospital
sub property of: place
domain: journalist
comment: Relazione tra Journalist e Hospital @it

links to Musical Artist
related match: after
type: NamedIndividual
comment: Relazione tra Journalist e Musical Artist @it
range: musical artist
domain: journalist
type: ObjectProperty
sub property of: person
comment: Relation between Journalist and Musical Artist

colour
type: Class
label: couleur @fr
label: χρώμα @el
type: ObjectProperty

automobile
type: Class

links to Village
sub property of: place
comment: Relazione tra Journalist e Village @it
range: village
domain: journalist
type: ObjectProperty
comment: Relation between Journalist and Village
type: NamedIndividual
related match: birthPlace

Election
label: élection @fr
type: Class

links to American Football Team
comment: Relazione tra Journalist e American Football Team @it
range: american football team
type: ObjectProperty
comment: Relation between Journalist and American Football Team
sub property of: organisation
domain: journalist

links to American Football Player
range: american football player
related match: before
related match: after
comment: Relation between Journalist and American Football Player
comment: Relazione tra Journalist e American Football Player @it
type: NamedIndividual
sub property of: person
type: ObjectProperty
related match: years
domain: journalist

links to Bacteria
comment: Relazione tra Journalist e Bacteria @it
type: ObjectProperty
sub property of: species
domain: journalist
comment: Relation between Journalist and Bacteria
range: bacteria

american football player
type: Class
label: joueur de football américain @fr

mean of transportation
type: ObjectProperty
label: moyen de transport @fr

links to Town
comment: Relazione tra Journalist e Town @it
comment: Relation between Journalist and Town
sub property of: place
range: town
type: ObjectProperty
domain: journalist

links to National Collegiate Athletic Association Athlete
comment: Relation between Journalist and National Collegiate Athletic Association Athlete
sub property of: person
type: ObjectProperty
comment: Relazione tra Journalist e National Collegiate Athletic Association Athlete @it
domain: journalist
range: national collegiate athletic association athlete

Legal Case
type: ObjectProperty
label: cas juridique @fr

links to Rugby Player
range: rugby player
comment: Relation between Journalist and Rugby Player
sub property of: person
comment: Relazione tra Journalist e Rugby Player @it
domain: journalist
type: ObjectProperty

stadium
label: stade @fr
type: Class

links to Historic Place
sub property of: place
comment: Relazione tra Journalist e Historic Place @it
domain: journalist
range: historic place
comment: Relation between Journalist and Historic Place
type: ObjectProperty

soccer league
label: ligue de football @fr
type: Class

links to Drug
comment: Relazione tra Journalist e Drug @it
type: ObjectProperty
sub property of: drug
domain: journalist
range: drug
comment: Relation between Journalist and Drug

astronaut
type: Class
label: Astronaut @de
label: astronaute @fr

Journalist.owl
extracted from: en.wikipedia.org
comment: Journalist Encyclopedic Knowledge Pattern
has author: Andrea Giovanni Nuzzolese
imports: dbpediainfoboxmatchingweight.owl
has intent: To represent the encyclopedic knowledge expressed by an object typed as Journalist
imports: cpannotationschema.owl
has author: Valentina Presutti
type: Ontology
has author: Aldo Gangemi
extracted from: dbpedia.org

Axiom
dbpedia infobox matching weight: 100.0
annotated property: relatedMatch
annotated source: links to Astronaut
annotated target: years

links to Trade Union
type: ObjectProperty
comment: Relation between Journalist and Trade Union
domain: journalist
comment: Relazione tra Journalist e Trade Union @it
range: trade union
sub property of: organisation

links to Monarch
comment: Relation between Journalist and Monarch
range: monarch
domain: journalist
type: ObjectProperty
sub property of: person
comment: Relazione tra Journalist e Monarch @it

wrestler
label: lutteur @fr
type: Class

links to Record Label
domain: journalist
comment: Relazione tra Journalist e Record Label @it
sub property of: organisation
comment: Relation between Journalist and Record Label
type: ObjectProperty
range: record label

mayor
type: Class
label: maire @fr

links to Hotel
comment: Relazione tra Journalist e Hotel @it
domain: journalist
range: hotel
sub property of: place
comment: Relation between Journalist and Hotel
type: ObjectProperty

pope
label: pape @fr
type: Class

species
label: espèce @fr
type: ObjectProperty

links to Member Of Parliament
related match: spouse
comment: Relation between Journalist and Member Of Parliament
domain: journalist
type: ObjectProperty
related match: relatives
type: NamedIndividual
range: member of parliament
comment: Relazione tra Journalist e Member Of Parliament @it
sub property of: person

links to Mountain Range
domain: journalist
comment: Relazione tra Journalist e Mountain Range @it
range: mountain range
comment: Relation between Journalist and Mountain Range
type: ObjectProperty
sub property of: place

links to Stadium
range: stadium
domain: journalist
sub property of: place
comment: Relation between Journalist and Stadium
type: ObjectProperty
comment: Relazione tra Journalist e Stadium @it

protected area
label: aire protégée @fr
label: προστατευμένη περιοχή @el
type: Class

road
type: Class
label: route @fr

links to Cyclist
sub property of: person
comment: Relazione tra Journalist e Cyclist @it
type: ObjectProperty
range: cyclist
domain: journalist
comment: Relation between Journalist and Cyclist

boxer
type: Class
label: boxeur @fr

judge
label: juge @fr
type: Class

World Heritage Site
label: site du patrimoine mondial @fr
type: Class

links to Senator
range: senator
comment: Relation between Journalist and Senator
sub property of: person
comment: Relazione tra Journalist e Senator @it
type: ObjectProperty
domain: journalist

Axiom
dbpedia infobox matching weight: 100.0
annotated property: relatedMatch
annotated target: birthPlace
annotated source: links to Village

links to Golf Player
domain: journalist
range: golf player
comment: Relation between Journalist and Golf Player
comment: Relazione tra Journalist e Golf Player @it
type: ObjectProperty
sub property of: person

station
type: Class

language
type: ObjectProperty
label: langage @fr
type: Class

links to Soccer Manager
type: ObjectProperty
domain: journalist
sub property of: person
comment: Relazione tra Journalist e Soccer Manager @it
range: soccer manager
comment: Relation between Journalist and Soccer Manager

links to Election
range: Election
type: ObjectProperty
sub property of: event
comment: Relazione tra Journalist e Election @it
comment: Relation between Journalist and Election
domain: journalist

lake
label: lac @fr
type: Class

links to Scientist
type: ObjectProperty
domain: journalist
range: scientist
comment: Relation between Journalist and Scientist
comment: Relazione tra Journalist e Scientist @it
sub property of: person

links to Cricketer
domain: journalist
comment: Relation between Journalist and Cricketer
sub property of: person
comment: Relazione tra Journalist e Cricketer @it
type: ObjectProperty
range: cricketer

arachnid
type: Class
label: arachnides @fr

links to Historic Building
domain: journalist
comment: Relazione tra Journalist e Historic Building @it
comment: Relation between Journalist and Historic Building
sub property of: place
type: ObjectProperty
range: historic building

governor
type: Class
label: gouverneur @fr

links to Road
domain: journalist
comment: Relazione tra Journalist e Road @it
range: road
type: ObjectProperty
sub property of: infrastructure
comment: Relation between Journalist and Road

poker player
type: Class
label: joueur de poker @fr

work
type: ObjectProperty
label: travail @fr
label: obra @pt

river
label: rivière @fr
type: Class

links to Television Episode
comment: Relazione tra Journalist e Television Episode @it
domain: journalist
sub property of: work
range: television episode
comment: Relation between Journalist and Television Episode
type: ObjectProperty

ship
type: Class
label: navire @fr

links to Chancellor
sub property of: person
type: ObjectProperty
comment: Relazione tra Journalist e Chancellor @it
domain: journalist
comment: Relation between Journalist and Chancellor
range: chancellor

museum
type: Class
label: musée @fr

fish
type: Class
label: poisson @fr

tennis player
type: Class
label: joueur de tennis @fr

Axiom
dbpedia infobox matching weight: 33.33
annotated property: relatedMatch
annotated source: links to American Football Player
annotated target: after

video game
type: Class
label: jeux vidéo @fr

links to Website
sub property of: website
domain: journalist
type: ObjectProperty
range: website
comment: Relazione tra Journalist e Website @it
comment: Relation between Journalist and Website

trade union
label: syndicat professionnel @fr
type: Class

currency
type: ObjectProperty
type: Class
label: devise @fr

prime minister
label: premier ministre @fr
type: Class

British royalty
type: Class
label: royauté Britannique @fr

race
type: Class
label: course @fr

historic place
label: site historique @fr
type: Class

hospital
type: Class
label: hôpital @fr

links to Mayor
domain: journalist
type: ObjectProperty
comment: Relation between Journalist and Mayor
comment: Relazione tra Journalist e Mayor @it
sub property of: person
range: mayor

links to Non- Profit Organisation
comment: Relazione tra Journalist e Non- Profit Organisation @it
domain: journalist
type: ObjectProperty
sub property of: organisation
comment: Relation between Journalist and Non- Profit Organisation
range: non-profit organisation

lunar crater
label: cratère lunaire @fr
type: Class

links to Adult Actor
comment: Relazione tra Journalist e Adult Actor @it
range: adult actor
type: ObjectProperty
comment: Relation between Journalist and Adult Actor
sub property of: person
domain: journalist

links to Lake
comment: Relazione tra Journalist e Lake @it
comment: Relation between Journalist and Lake
domain: journalist
type: ObjectProperty
range: lake
sub property of: place

links to World Heritage Site
range: World Heritage Site
comment: Relazione tra Journalist e World Heritage Site @it
domain: journalist
comment: Relation between Journalist and World Heritage Site
type: ObjectProperty
sub property of: place

links to Single
domain: journalist
type: ObjectProperty
sub property of: work
comment: Relazione tra Journalist e Single @it
comment: Relation between Journalist and Single
range: single

links to Lunar Crater
range: lunar crater
sub property of: place
comment: Relation between Journalist and Lunar Crater
domain: journalist
comment: Relazione tra Journalist e Lunar Crater @it
type: ObjectProperty

continent
label: ήπειρος @el
type: Class

links to Golf League
domain: journalist
type: ObjectProperty
comment: Relation between Journalist and Golf League
sub property of: organisation
range: golf league
comment: Relazione tra Journalist e Golf League @it

album
label: Album @de
type: Class

figure skater
type: Class
label: patineur artistique @fr

links to Airline
comment: Relazione tra Journalist e Airline @it
domain: journalist
type: ObjectProperty
comment: Relation between Journalist and Airline
range: airline
sub property of: organisation

links to Chemical Compound
sub property of: chemical compound
type: ObjectProperty
comment: Relazione tra Journalist e Chemical Compound @it
comment: Relation between Journalist and Chemical Compound
range: chemical compound
domain: journalist

person
label: Person @de
label: pessoa @pt
type: ObjectProperty
label: personne @fr

military unit
label: unité militaire @fr
type: Class

links to Figure Skater
comment: Relation between Journalist and Figure Skater
domain: journalist
comment: Relazione tra Journalist e Figure Skater @it
sub property of: person
type: ObjectProperty
range: figure skater

links to Ski Area
comment: Relation between Journalist and Ski Area
type: ObjectProperty
range: ski area
comment: Relazione tra Journalist e Ski Area @it
domain: journalist
sub property of: place

links to Station
range: station
comment: Relation between Journalist and Station
comment: Relazione tra Journalist e Station @it
sub property of: place
type: ObjectProperty
domain: journalist

soccer manager
type: Class
label: entraîneur de football @fr

basketball team
type: Class

music genre
label: genre musical @fr
type: ObjectProperty
label: género musical @pt
type: Class

links to Reptile
comment: Relation between Journalist and Reptile
type: ObjectProperty
comment: Relazione tra Journalist e Reptile @it
sub property of: species
range: reptile
domain: journalist

record label
type: Class
label: label discographique @fr

links to Shopping Mall
comment: Relazione tra Journalist e Shopping Mall @it
sub property of: place
domain: journalist
range: shopping mall
comment: Relation between Journalist and Shopping Mall
type: ObjectProperty

links to Space Shuttle
comment: Relazione tra Journalist e Space Shuttle @it
domain: journalist
comment: Relation between Journalist and Space Shuttle
range: space shuttle
sub property of: mean of transportation
type: ObjectProperty

architect
label: architecte @fr
type: Class

model
type: Class
label: mannequin @fr

ambassador
type: Class
label: ambassadeur @fr

links to College Coach
domain: journalist
comment: Relation between Journalist and College Coach
type: ObjectProperty
sub property of: person
comment: Relazione tra Journalist e College Coach @it
range: college coach
type: NamedIndividual
related match: after

links to Philosopher
domain: journalist
comment: Relation between Journalist and Philosopher
comment: Relazione tra Journalist e Philosopher @it
type: ObjectProperty
sub property of: person
range: philosopher

links to Architect
comment: Relation between Journalist and Architect
range: architect
sub property of: person
domain: journalist
comment: Relazione tra Journalist e Architect @it
type: ObjectProperty

links to Park
sub property of: place
domain: journalist
comment: Relation between Journalist and Park
type: ObjectProperty
range: park
comment: Relazione tra Journalist e Park @it

links to Saint
type: ObjectProperty
domain: journalist
range: saint
sub property of: person
comment: Relazione tra Journalist e Saint @it
comment: Relation between Journalist and Saint

links to Continent
range: continent
type: ObjectProperty
comment: Relazione tra Journalist e Continent @it
domain: journalist
sub property of: place
comment: Relation between Journalist and Continent

film festival
label: festival du film @fr
type: Class

links to Nascar Driver
comment: Relazione tra Journalist e Nascar Driver @it
range: nascar driver
comment: Relation between Journalist and Nascar Driver
domain: journalist
sub property of: person
type: ObjectProperty

links to Music Genre
type: ObjectProperty
sub property of: music genre
range: music genre
domain: journalist
comment: Relazione tra Journalist e Music Genre @it
comment: Relation between Journalist and Music Genre

links to Congressman
comment: Relazione tra Journalist e Congressman @it
comment: Relation between Journalist and Congressman
range: congressman
domain: journalist
sub property of: person
type: ObjectProperty

links to Island
range: island
type: ObjectProperty
sub property of: place
comment: Relation between Journalist and Island
domain: journalist
comment: Relazione tra Journalist e Island @it

Grand Prix
type: Class
label: grand prix @fr

links to Ice Hockey League
range: ice hockey league
type: ObjectProperty
comment: Relazione tra Journalist e Ice Hockey League @it
domain: journalist
sub property of: organisation
comment: Relation between Journalist and Ice Hockey League

chancellor
type: Class
label: chancelier @fr

comics creator
type: Class
label: créateur de bandes dessinées @fr

links to Skyscraper
range: skyscraper
comment: Relation between Journalist and Skyscraper
type: ObjectProperty
comment: Relazione tra Journalist e Skyscraper @it
domain: journalist
sub property of: place

aircraft
label: αεροσκάφος @el
type: Class
label: avion @fr

links to Insect
range: insect
sub property of: species
comment: Relation between Journalist and Insect
type: ObjectProperty
domain: journalist
comment: Relazione tra Journalist e Insect @it

hockey team
label: équipe de hockey @fr
type: Class

soccer player
type: Class
label: joueur de football @fr

reptile
type: Class

legislature
type: Class
label: pouvoir législatif @fr

links to Military Unit
range: military unit
comment: Relazione tra Journalist e Military Unit @it
type: ObjectProperty
comment: Relation between Journalist and Military Unit
sub property of: organisation
domain: journalist

links to Model
type: ObjectProperty
range: model
domain: journalist
comment: Relazione tra Journalist e Model @it
comment: Relation between Journalist and Model
sub property of: person

links to Poker Player
sub property of: person
range: poker player
comment: Relazione tra Journalist e Poker Player @it
comment: Relation between Journalist and Poker Player
domain: journalist
type: ObjectProperty

airline
type: Class
label: compagnie aérienne @fr

monarch
type: Class
label: monarque @fr

congressman
type: Class
label: membre du Congrès @fr

links to Cardinal
sub property of: person
comment: Relazione tra Journalist e Cardinal @it
range: cardinal
domain: journalist
comment: Relation between Journalist and Cardinal
type: ObjectProperty

links to Arachnid
comment: Relation between Journalist and Arachnid
range: arachnid
comment: Relazione tra Journalist e Arachnid @it
sub property of: species
domain: journalist
type: ObjectProperty

links to Race
comment: Relation between Journalist and Race
sub property of: event
domain: journalist
type: ObjectProperty
comment: Relazione tra Journalist e Race @it
range: race

golf player
type: Class
label: golfeur @fr

nascar driver
label: pilote de la nascar @fr
type: Class

activity
type: ObjectProperty
label: Aktivität @de
label: activité @fr

links to Airport
sub property of: place
range: airport
comment: Relation between Journalist and Airport
type: ObjectProperty
domain: journalist
comment: Relazione tra Journalist e Airport @it

space mission
label: mission spatiale @fr
label: διαστημική αποστολή @el
type: Class

journalist
type: Class
label: journaliste @fr

links to Baseball League
range: baseball league
comment: Relation between Journalist and Baseball League
sub property of: organisation
comment: Relazione tra Journalist e Baseball League @it
domain: journalist
type: ObjectProperty

insect
type: Class
label: insecte @fr

links to Legislature
domain: journalist
comment: Relazione tra Journalist e Legislature @it
range: legislature
comment: Relation between Journalist and Legislature
sub property of: organisation
type: ObjectProperty

film
type: Class
label: ταινία @el

links to Album
range: album
comment: Relation between Journalist and Album
domain: journalist
sub property of: work
type: ObjectProperty
comment: Relazione tra Journalist e Album @it

american football team
label: équipe américaine de football américain @fr
type: Class

links to Ice Hockey Player
sub property of: person
comment: Relazione tra Journalist e Ice Hockey Player @it
domain: journalist
comment: Relation between Journalist and Ice Hockey Player
range: ice hockey player
type: ObjectProperty

Supreme Court of the United States case
label: cas juridique de la Cour suprême des États-Unis @fr
type: Class

links to Colour
comment: Relation between Journalist and Colour
range: colour
sub property of: colour
comment: Relazione tra Journalist e Colour @it
type: ObjectProperty
domain: journalist

links to Basketball League
comment: Relazione tra Journalist e Basketball League @it
comment: Relation between Journalist and Basketball League
range: basketball league
domain: journalist
sub property of: organisation
type: ObjectProperty

chemical compound
label: produit chimique @fr
type: ObjectProperty
type: Class

links to Aircraft
comment: Relation between Journalist and Aircraft
range: aircraft
sub property of: mean of transportation
comment: Relazione tra Journalist e Aircraft @it
domain: journalist
type: ObjectProperty

links to River
range: river
comment: Relazione tra Journalist e River @it
comment: Relation between Journalist and River
type: ObjectProperty
sub property of: place
domain: journalist

links to Mountain
type: ObjectProperty
sub property of: place
domain: journalist
range: mountain
comment: Relation between Journalist and Mountain
comment: Relazione tra Journalist e Mountain @it

musical artist
label: artista musical @pt
type: Class
label: musicien @fr

park
type: Class
label: parc @fr

cardinal
type: Class

Axiom
dbpedia infobox matching weight: 33.33
annotated source: links to American Football Player
annotated property: relatedMatch
annotated target: before

links to Criminal
domain: journalist
type: ObjectProperty
comment: Relazione tra Journalist e Criminal @it
range: criminal
sub property of: person
comment: Relation between Journalist and Criminal

rugby player
type: Class
label: joueur de rugby @fr

american football league
type: Class

musical
type: Class
label: musique @fr

links to Soccer Player
comment: Relazione tra Journalist e Soccer Player @it
sub property of: person
range: soccer player
domain: journalist
comment: Relation between Journalist and Soccer Player
type: ObjectProperty

links to Mixed Martial Arts Event
type: ObjectProperty
domain: journalist
comment: Relazione tra Journalist e Mixed Martial Arts Event @it
comment: Relation between Journalist and Mixed Martial Arts Event
sub property of: event
range: mixed martial arts event

links to Governor
sub property of: person
range: governor
type: ObjectProperty
comment: Relation between Journalist and Governor
comment: Relazione tra Journalist e Governor @it
domain: journalist

cyclist
type: Class
label: cycliste @fr

links to Bridge
sub property of: place
domain: journalist
range: bridge
comment: Relation between Journalist and Bridge
type: ObjectProperty
comment: Relazione tra Journalist e Bridge @it

place
type: ObjectProperty
label: περιοχή @el
label: lieu @fr
label: lugar @pt

national collegiate athletic association athlete
type: Class
label: athlète de la national collegiate athletic association @fr

Axiom
dbpedia infobox matching weight: 50.0
annotated target: spouse
annotated property: relatedMatch
annotated source: links to Member Of Parliament

infrastructure
type: ObjectProperty

links to Baseball Player
type: ObjectProperty
range: baseball player
domain: journalist
sub property of: person
comment: Relazione tra Journalist e Baseball Player @it
comment: Relation between Journalist and Baseball Player

basketball league
label: ligue de basketball @fr
type: Class

mountain
type: Class
label: montagne @fr
label: Βουνό @el

links to Music Festival
comment: Relation between Journalist and Music Festival
domain: journalist
comment: Relazione tra Journalist e Music Festival @it
type: ObjectProperty
sub property of: event
range: music festival

criminal
label: criminel @fr
type: Class

links to Book
type: ObjectProperty
sub property of: work
comment: Relazione tra Journalist e Book @it
range: book
domain: journalist
comment: Relation between Journalist and Book

space shuttle
label: navette spatiale @fr
type: Class

flowering plant
label: angiospermes @fr
type: Class

links to Video Game
range: video game
type: ObjectProperty
comment: Relation between Journalist and Video Game
sub property of: work
domain: journalist
comment: Relazione tra Journalist e Video Game @it

senator
label: sénateur @fr
type: Class

saint
type: Class

comedian
type: Class
label: comédien @fr

song
label: chanson @fr
type: Class

links to Military Person
sub property of: person
domain: journalist
range: military person
comment: Relazione tra Journalist e Military Person @it
type: ObjectProperty
comment: Relation between Journalist and Military Person

convention
type: Class
label: congrès @fr

book
type: Class
label: livre @fr
label: βιβλίο @el
label: llibre @ca
label: książka @pl

device
label: appareil @fr
type: ObjectProperty

shopping mall
label: centre commercial @fr
type: Class

links to Film Festival
comment: Relazione tra Journalist e Film Festival @it
comment: Relation between Journalist and Film Festival
range: film festival
domain: journalist
type: ObjectProperty
sub property of: event

links to Sport
domain: journalist
comment: Relazione tra Journalist e Sport @it
sub property of: activity
type: ObjectProperty
comment: Relation between Journalist and Sport
range: sport

bacteria
label: bactérie @fr
type: Class

ski area
type: Class
label: domaine skiable @fr

non-profit organisation
label: organisation à but non lucratif @fr
type: Class

space station
label: station spatiale @fr
type: Class

links to Astronaut
related match: years
type: NamedIndividual
comment: Relazione tra Journalist e Astronaut @it
sub property of: person
type: ObjectProperty
comment: Relation between Journalist and Astronaut
range: astronaut
domain: journalist

canadian football league
type: Class

links to Judge
range: judge
comment: Relazione tra Journalist e Judge @it
domain: journalist
comment: Relation between Journalist and Judge
type: ObjectProperty
sub property of: person

links to Ambassador
domain: journalist
range: ambassador
type: ObjectProperty
sub property of: person
comment: Relation between Journalist and Ambassador
comment: Relazione tra Journalist e Ambassador @it

weapon
label: arme @fr
type: Class

drug
type: Class
label: médicament @fr
type: ObjectProperty

links to Restaurant
range: restaurant
comment: Relazione tra Journalist e Restaurant @it
domain: journalist
type: ObjectProperty
comment: Relation between Journalist and Restaurant
sub property of: place

links to Planet
sub property of: planet
domain: journalist
type: ObjectProperty
range: planet
comment: Relation between Journalist and Planet
comment: Relazione tra Journalist e Planet @it

canal
type: Class

military person
type: Class
label: militaire @fr

links to Supreme Court Of The United States Case
sub property of: Legal Case
comment: Relation between Journalist and Supreme Court Of The United States Case
comment: Relazione tra Journalist e Supreme Court Of The United States Case @it
type: ObjectProperty
domain: journalist
range: Supreme Court of the United States case

links to Musical
range: musical
comment: Relation between Journalist and Musical
domain: journalist
sub property of: work
type: ObjectProperty
comment: Relazione tra Journalist e Musical @it

philosopher
label: philosophe @fr
type: Class

links to Christian Bishop
comment: Relazione tra Journalist e Christian Bishop @it
sub property of: person
comment: Relation between Journalist and Christian Bishop
type: ObjectProperty
domain: journalist
range: Christian Bishop

Axiom
dbpedia infobox matching weight: 100.0
annotated property: relatedMatch
annotated target: after
annotated source: links to Musical Artist

links to Formula One Racer
domain: journalist
comment: Relation between Journalist and Formula One Racer
type: ObjectProperty
range: Formula One racer
comment: Relazione tra Journalist e Formula One Racer @it
sub property of: person

links to British Royalty
comment: Relation between Journalist and British Royalty
comment: Relazione tra Journalist e British Royalty @it
sub property of: person
domain: journalist
type: ObjectProperty
range: British royalty

college
type: Class

anatomical structure
label: structure anatomique @fr
type: ObjectProperty

sport
type: Class

links to Language
type: ObjectProperty
range: language
domain: journalist
comment: Relazione tra Journalist e Language @it
sub property of: language
comment: Relation between Journalist and Language

restaurant
type: Class

links to Ship
range: ship
comment: Relation between Journalist and Ship
type: ObjectProperty
sub property of: mean of transportation
comment: Relazione tra Journalist e Ship @it
domain: journalist

cricketer
type: Class
label: joueur de cricket @fr

single
type: Class

mixed martial arts event
type: Class
label: évènement d'arts martiaux mixtes @fr

Band
label: groupe de musique @fr
type: Class
label: Musikgruppe @de
label: banda @pt

town
label: ville @fr
type: Class

links to Song
comment: Relazione tra Journalist e Song @it
sub property of: work
comment: Relation between Journalist and Song
type: ObjectProperty
domain: journalist
range: song

links to Grand Prix
domain: journalist
sub property of: event
comment: Relation between Journalist and Grand Prix
comment: Relazione tra Journalist e Grand Prix @it
type: ObjectProperty
range: Grand Prix

links to Weapon
comment: Relation between Journalist and Weapon
comment: Relazione tra Journalist e Weapon @it
domain: journalist
sub property of: device
type: ObjectProperty
range: weapon

hotel
type: Class
label: hôtel @fr

music festival
label: festival de musique @fr
type: Class

links to Museum
range: museum
type: ObjectProperty
comment: Relation between Journalist and Museum
comment: Relazione tra Journalist e Museum @it
sub property of: place
domain: journalist

links to Basketball Player
sub property of: person
comment: Relazione tra Journalist e Basketball Player @it
range: basketball player
comment: Relation between Journalist and Basketball Player
type: ObjectProperty
domain: journalist

college coach
type: Class
label: entraîneur universitaire @fr

television episode
type: Class
label: épisode télévisé @fr

links to Convention
sub property of: event
comment: Relation between Journalist and Convention
domain: journalist
type: ObjectProperty
range: convention
comment: Relazione tra Journalist e Convention @it

links to Hockey Team
comment: Relation between Journalist and Hockey Team
comment: Relazione tra Journalist e Hockey Team @it
type: ObjectProperty
range: hockey team
sub property of: organisation
domain: journalist

village
label: χωριό @el
type: Class

links to Currency
comment: Relazione tra Journalist e Currency @it
comment: Relation between Journalist and Currency
domain: journalist
type: ObjectProperty
range: currency
sub property of: currency

ice hockey league
label: ligue d'hockey sur glace @fr
type: Class

inline hockey league
label: ligue de roller inline hockey @fr
type: Class

links to Space Station
comment: Relation between Journalist and Space Station
range: space station
sub property of: mean of transportation
domain: journalist
comment: Relazione tra Journalist e Space Station @it
type: ObjectProperty

soccer club
label: club de football @fr
type: Class

links to Space Mission
comment: Relation between Journalist and Space Mission
range: space mission
comment: Relazione tra Journalist e Space Mission @it
sub property of: event
domain: journalist
type: ObjectProperty

links to Soccer Club
sub property of: organisation
type: ObjectProperty
range: soccer club
comment: Relazione tra Journalist e Soccer Club @it
domain: journalist
comment: Relation between Journalist and Soccer Club

historic building
label: bâtiment historique @fr
type: Class

baseball player
type: Class
label: joueur de baseball @fr

links to Beverage
range: beverage
comment: Relazione tra Journalist e Beverage @it
domain: journalist
comment: Relation between Journalist and Beverage
type: ObjectProperty
sub property of: beverage

website
label: Ιστότοπος @el
label: site web @fr
type: Class
type: ObjectProperty

links to Canal
comment: Relazione tra Journalist e Canal @it
comment: Relation between Journalist and Canal
domain: journalist
type: ObjectProperty
sub property of: place
range: canal

links to Wrestler
range: wrestler
sub property of: person
domain: journalist
comment: Relation between Journalist and Wrestler
comment: Relazione tra Journalist e Wrestler @it
type: ObjectProperty

links to Comics Creator
type: ObjectProperty
comment: Relation between Journalist and Comics Creator
range: comics creator
comment: Relazione tra Journalist e Comics Creator @it
sub property of: person
domain: journalist

links to Tennis Player
sub property of: person
comment: Relazione tra Journalist e Tennis Player @it
range: tennis player
domain: journalist
comment: Relation between Journalist and Tennis Player
type: ObjectProperty

basketball player
label: joueur de basketball @fr
type: Class

adult actor
label: acteur adulte @fr
type: Class
label: erwachsener Schauspieler @de

ice hockey player
type: Class
label: joueur de hockey sur glace @fr

links to Band
type: ObjectProperty
comment: Relazione tra Journalist e Band @it
range: Band
domain: journalist
sub property of: organisation
comment: Relation between Journalist and Band

mountain range
type: Class
label: chaîne de montagne @fr

Christian Bishop
type: Class
label: évêque chrétien @fr

beverage
label: boisson @fr
type: Class
type: ObjectProperty

links to Basketball Team
comment: Relazione tra Journalist e Basketball Team @it
domain: journalist
comment: Relation between Journalist and Basketball Team
type: ObjectProperty
range: basketball team
sub property of: organisation

links to Automobile
range: automobile
type: ObjectProperty
comment: Relation between Journalist and Automobile
domain: journalist
comment: Relazione tra Journalist e Automobile @it
sub property of: mean of transportation

links to Mammal
domain: journalist
comment: Relation between Journalist and Mammal
range: mammal
type: ObjectProperty
comment: Relazione tra Journalist e Mammal @it
sub property of: species

links to Pope
type: ObjectProperty
comment: Relation between Journalist and Pope
range: pope
comment: Relazione tra Journalist e Pope @it
domain: journalist
sub property of: person

planet
type: ObjectProperty
label: planète @fr
type: Class

scientist
label: Wissenschaftler @de
type: Class
label: scientifique @fr

golf league
type: Class
label: ligue de golf @fr

links to Film
type: ObjectProperty
domain: journalist
range: film
comment: Relazione tra Journalist e Film @it
comment: Relation between Journalist and Film
sub property of: work

links to Flowering Plant
type: ObjectProperty
domain: journalist
comment: Relazione tra Journalist e Flowering Plant @it
range: flowering plant
comment: Relation between Journalist and Flowering Plant
sub property of: species

olympics
label: Jeux Olympiques @fr
type: Class

organisation
label: Organisation @de
label: organização @pt
type: ObjectProperty

Axiom
dbpedia infobox matching weight: 50.0
annotated source: links to Member Of Parliament
annotated property: relatedMatch
annotated target: relatives

baseball league
label: ligue de baseball @fr
type: Class

links to American Football League
domain: journalist
type: ObjectProperty
comment: Relation between Journalist and American Football League
range: american football league
comment: Relazione tra Journalist e American Football League @it
sub property of: organisation

links to Inline Hockey League
sub property of: organisation
comment: Relazione tra Journalist e Inline Hockey League @it
range: inline hockey league
comment: Relation between Journalist and Inline Hockey League
domain: journalist
type: ObjectProperty

bridge
label: pont @fr
type: Class

links to Rocket
comment: Relazione tra Journalist e Rocket @it
range: rocket
sub property of: mean of transportation
type: ObjectProperty
domain: journalist
comment: Relation between Journalist and Rocket

links to Boxer
type: ObjectProperty
comment: Relation between Journalist and Boxer
comment: Relazione tra Journalist e Boxer @it
sub property of: person
range: boxer
domain: journalist

mammal
type: Class
label: mammifère @fr

island
label: île @fr
label: νησί @el
type: Class

links to College
range: college
comment: Relation between Journalist and College
type: ObjectProperty
comment: Relazione tra Journalist e College @it
sub property of: organisation
domain: journalist

comics character
type: Class
label: personnage de bandes dessinées @fr

links to Bone
comment: Relation between Journalist and Bone
comment: Relazione tra Journalist e Bone @it
domain: journalist
type: ObjectProperty
sub property of: anatomical structure
range: bone

links to Comics Character
domain: journalist
type: ObjectProperty
range: comics character
comment: Relazione tra Journalist e Comics Character @it
comment: Relation between Journalist and Comics Character
sub property of: person

event
label: évènement @fr
type: ObjectProperty

skyscraper
type: Class
label: gratte-ciel @fr

Formula One racer
type: Class
label: pilote de formule 1 @fr

links to Fish
sub property of: species
domain: journalist
comment: Relazione tra Journalist e Fish @it
type: ObjectProperty
range: fish
comment: Relation between Journalist and Fish

bone
type: Class
label: Knochen @de
label: os @fr

member of parliament
label: membre du Parlement @fr
type: Class

Axiom
dbpedia infobox matching weight: 33.33
annotated source: links to American Football Player
annotated property: relatedMatch
annotated target: years

links to Olympics
type: ObjectProperty
range: olympics
comment: Relation between Journalist and Olympics
comment: Relazione tra Journalist e Olympics @it
sub property of: event
domain: journalist

links to Soccer League
range: soccer league
type: ObjectProperty
sub property of: organisation
domain: journalist
comment: Relazione tra Journalist e Soccer League @it
comment: Relation between Journalist and Soccer League

airport
type: Class
label: Flughafen @de
label: aéroport @fr

links to Prime Minister
comment: Relation between Journalist and Prime Minister
domain: journalist
sub property of: person
comment: Relazione tra Journalist e Prime Minister @it
type: ObjectProperty
range: prime minister