links to Canadian Football Team
comment: Relazione tra Member Of Parliament e Canadian Football Team @it
sub property of: organisation
domain: member of parliament
range: canadian football team
comment: Relation between Member Of Parliament and Canadian Football Team
type: ObjectProperty

television show
type: Class
label: émission de télévision @fr

links to Olympics
range: olympics
comment: Relazione tra Member Of Parliament e Olympics @it
sub property of: event
domain: member of parliament
comment: Relation between Member Of Parliament and Olympics
type: ObjectProperty

disease
label: maladie @fr
type: Class
type: ObjectProperty

links to Mountain
comment: Relazione tra Member Of Parliament e Mountain @it
sub property of: place
comment: Relation between Member Of Parliament and Mountain
range: mountain
domain: member of parliament
type: ObjectProperty

Axiom
dbpedia infobox matching weight: 100.0
annotated property: relatedMatch
annotated target: post5preceded
annotated source: links to Ambassador

Axiom
dbpedia infobox matching weight: 100.0
annotated target: before
annotated property: relatedMatch
annotated source: links to Actor

automobile
type: Class

colour
type: Class
label: couleur @fr
label: χρώμα @el
type: ObjectProperty

links to Protected Area
type: ObjectProperty
comment: Relazione tra Member Of Parliament e Protected Area @it
sub property of: place
domain: member of parliament
comment: Relation between Member Of Parliament and Protected Area
range: protected area

links to Disease
comment: Relazione tra Member Of Parliament e Disease @it
comment: Relation between Member Of Parliament and Disease
range: disease
domain: member of parliament
sub property of: disease
type: ObjectProperty

links to Skyscraper
type: ObjectProperty
comment: Relation between Member Of Parliament and Skyscraper
range: skyscraper
sub property of: place
comment: Relazione tra Member Of Parliament e Skyscraper @it
domain: member of parliament

mean of transportation
type: ObjectProperty
label: moyen de transport @fr

american football player
type: Class
label: joueur de football américain @fr

links to Soccer Manager
comment: Relation between Member Of Parliament and Soccer Manager
comment: Relazione tra Member Of Parliament e Soccer Manager @it
sub property of: person
range: soccer manager
domain: member of parliament
type: ObjectProperty

stadium
label: stade @fr
type: Class

links to Ambassador
sub property of: person
comment: Relazione tra Member Of Parliament e Ambassador @it
range: ambassador
domain: member of parliament
type: ObjectProperty
comment: Relation between Member Of Parliament and Ambassador
related match: post5preceded
type: NamedIndividual

soccer league
label: ligue de football @fr
type: Class

astronaut
type: Class
label: Astronaut @de
label: astronaute @fr

links to Christian Bishop
sub property of: person
comment: Relation between Member Of Parliament and Christian Bishop
comment: Relazione tra Member Of Parliament e Christian Bishop @it
range: Christian Bishop
domain: member of parliament
type: ObjectProperty

links to Station
domain: member of parliament
comment: Relation between Member Of Parliament and Station
sub property of: place
range: station
comment: Relazione tra Member Of Parliament e Station @it
type: ObjectProperty

Axiom
dbpedia infobox matching weight: 26.32
annotated property: relatedMatch
annotated target: after
annotated source: links to President

links to Music Genre
comment: Relazione tra Member Of Parliament e Music Genre @it
type: ObjectProperty
sub property of: music genre
comment: Relation between Member Of Parliament and Music Genre
range: music genre
domain: member of parliament

mayor
type: Class
label: maire @fr

MemberOfParliament.owl
imports: cpannotationschema.owl
imports: dbpediainfoboxmatchingweight.owl
extracted from: dbpedia.org
has author: Andrea Giovanni Nuzzolese
has intent: To represent the encyclopedic knowledge expressed by an object typed as MemberOfParliament
has author: Aldo Gangemi
has author: Valentina Presutti
type: Ontology
extracted from: en.wikipedia.org
comment: MemberOfParliament Encyclopedic Knowledge Pattern

pope
type: Class
label: pape @fr

species
type: ObjectProperty
label: espèce @fr

links to Soccer Club
comment: Relazione tra Member Of Parliament e Soccer Club @it
range: soccer club
type: ObjectProperty
sub property of: organisation
comment: Relation between Member Of Parliament and Soccer Club
domain: member of parliament

links to Ice Hockey Player
type: ObjectProperty
comment: Relation between Member Of Parliament and Ice Hockey Player
range: ice hockey player
domain: member of parliament
sub property of: person
comment: Relazione tra Member Of Parliament e Ice Hockey Player @it
type: NamedIndividual
related match: after

newspaper
label: journal @fr
type: Class

protected area
type: Class
label: προστατευμένη περιοχή @el
label: aire protégée @fr

game
type: Class
label: jeu @fr

Axiom
dbpedia infobox matching weight: 100.0
annotated property: relatedMatch
annotated source: links to Astronaut
annotated target: after

road
label: route @fr
type: Class

links to Television Show
sub property of: work
domain: member of parliament
comment: Relation between Member Of Parliament and Television Show
type: ObjectProperty
comment: Relazione tra Member Of Parliament e Television Show @it
range: television show

boxer
label: boxeur @fr
type: Class

judge
label: juge @fr
type: Class

World Heritage Site
label: site du patrimoine mondial @fr
type: Class

language
type: Class
label: langage @fr
type: ObjectProperty

station
type: Class

links to Writer
type: ObjectProperty
comment: Relation between Member Of Parliament and Writer
comment: Relazione tra Member Of Parliament e Writer @it
sub property of: person
range: writer
domain: member of parliament

links to Record Label
comment: Relazione tra Member Of Parliament e Record Label @it
type: ObjectProperty
comment: Relation between Member Of Parliament and Record Label
range: record label
sub property of: organisation
domain: member of parliament

links to Ice Hockey League
range: ice hockey league
domain: member of parliament
comment: Relazione tra Member Of Parliament e Ice Hockey League @it
comment: Relation between Member Of Parliament and Ice Hockey League
sub property of: organisation
type: ObjectProperty

links to Ship
sub property of: mean of transportation
type: ObjectProperty
domain: member of parliament
comment: Relation between Member Of Parliament and Ship
comment: Relazione tra Member Of Parliament e Ship @it
range: ship

lake
label: lac @fr
type: Class

links to Shopping Mall
type: ObjectProperty
comment: Relation between Member Of Parliament and Shopping Mall
range: shopping mall
comment: Relazione tra Member Of Parliament e Shopping Mall @it
domain: member of parliament
sub property of: place

Axiom
dbpedia infobox matching weight: 100.0
annotated source: links to Band
annotated property: relatedMatch
annotated target: associatedActs

links to Non- Profit Organisation
domain: member of parliament
type: ObjectProperty
range: non-profit organisation
sub property of: organisation
comment: Relazione tra Member Of Parliament e Non- Profit Organisation @it
comment: Relation between Member Of Parliament and Non- Profit Organisation

links to Cyclist
comment: Relazione tra Member Of Parliament e Cyclist @it
domain: member of parliament
type: ObjectProperty
comment: Relation between Member Of Parliament and Cyclist
range: cyclist
sub property of: person

links to Military Conflict
range: military conflict
comment: Relazione tra Member Of Parliament e Military Conflict @it
domain: member of parliament
sub property of: event
comment: Relation between Member Of Parliament and Military Conflict
type: ObjectProperty
related match: battles
type: NamedIndividual

links to Hockey Team
range: hockey team
comment: Relation between Member Of Parliament and Hockey Team
type: ObjectProperty
comment: Relazione tra Member Of Parliament e Hockey Team @it
domain: member of parliament
sub property of: organisation

links to Television Episode
domain: member of parliament
comment: Relation between Member Of Parliament and Television Episode
range: television episode
sub property of: work
comment: Relazione tra Member Of Parliament e Television Episode @it
type: ObjectProperty

links to Boxer
comment: Relation between Member Of Parliament and Boxer
domain: member of parliament
type: ObjectProperty
sub property of: person
comment: Relazione tra Member Of Parliament e Boxer @it
range: boxer

governor
label: gouverneur @fr
type: Class

Axiom
dbpedia infobox matching weight: 100.0
annotated property: relatedMatch
annotated target: battles
annotated source: links to Military Conflict

work
type: ObjectProperty
label: travail @fr
label: obra @pt

Axiom
dbpedia infobox matching weight: 100.0
annotated target: before
annotated property: relatedMatch
annotated source: links to Philosopher

river
label: rivière @fr
type: Class

links to Golf Player
sub property of: person
range: golf player
type: ObjectProperty
comment: Relation between Member Of Parliament and Golf Player
domain: member of parliament
comment: Relazione tra Member Of Parliament e Golf Player @it

links to Conifer
comment: Relazione tra Member Of Parliament e Conifer @it
domain: member of parliament
comment: Relation between Member Of Parliament and Conifer
sub property of: species
type: ObjectProperty
range: conifer

museum
label: musée @fr
type: Class

ship
type: Class
label: navire @fr

fish
type: Class
label: poisson @fr

tennis player
type: Class
label: joueur de tennis @fr

links to Trade Union
sub property of: organisation
domain: member of parliament
range: trade union
comment: Relation between Member Of Parliament and Trade Union
type: ObjectProperty
comment: Relazione tra Member Of Parliament e Trade Union @it

links to Book
range: book
type: ObjectProperty
domain: member of parliament
comment: Relazione tra Member Of Parliament e Book @it
sub property of: work
comment: Relation between Member Of Parliament and Book

video game
label: jeux vidéo @fr
type: Class

trade union
type: Class
label: syndicat professionnel @fr

currency
type: ObjectProperty
type: Class
label: devise @fr

links to Stadium
range: stadium
sub property of: place
domain: member of parliament
comment: Relazione tra Member Of Parliament e Stadium @it
type: ObjectProperty
comment: Relation between Member Of Parliament and Stadium

British royalty
label: royauté Britannique @fr
type: Class

links to Figure Skater
sub property of: person
range: figure skater
comment: Relation between Member Of Parliament and Figure Skater
domain: member of parliament
type: ObjectProperty
comment: Relazione tra Member Of Parliament e Figure Skater @it

historic place
label: site historique @fr
type: Class

Axiom
dbpedia infobox matching weight: 100.0
annotated target: almaMater
annotated property: relatedMatch
annotated source: links to College

hospital
type: Class
label: hôpital @fr

links to Film
domain: member of parliament
comment: Relazione tra Member Of Parliament e Film @it
range: film
sub property of: work
type: ObjectProperty
comment: Relation between Member Of Parliament and Film

links to Magazine
type: ObjectProperty
range: magazine
domain: member of parliament
comment: Relazione tra Member Of Parliament e Magazine @it
comment: Relation between Member Of Parliament and Magazine
sub property of: work

links to Criminal
comment: Relazione tra Member Of Parliament e Criminal @it
range: criminal
domain: member of parliament
comment: Relation between Member Of Parliament and Criminal
type: ObjectProperty
sub property of: person

links to Broadcast
type: ObjectProperty
comment: Relazione tra Member Of Parliament e Broadcast @it
range: broadcast
sub property of: organisation
comment: Relation between Member Of Parliament and Broadcast
domain: member of parliament

links to Gaelic Games Player
domain: member of parliament
sub property of: person
comment: Relazione tra Member Of Parliament e Gaelic Games Player @it
type: ObjectProperty
comment: Relation between Member Of Parliament and Gaelic Games Player
range: Gaelic games player

links to Cardinal
type: ObjectProperty
comment: Relazione tra Member Of Parliament e Cardinal @it
range: cardinal
domain: member of parliament
sub property of: person
comment: Relation between Member Of Parliament and Cardinal

continent
type: Class
label: ήπειρος @el

album
type: Class
label: Album @de

president
label: président @fr
type: Class

links to Film Festival
sub property of: event
comment: Relazione tra Member Of Parliament e Film Festival @it
domain: member of parliament
type: ObjectProperty
range: film festival
comment: Relation between Member Of Parliament and Film Festival

figure skater
label: patineur artistique @fr
type: Class

links to Philosopher
type: NamedIndividual
related match: before
comment: Relation between Member Of Parliament and Philosopher
sub property of: person
comment: Relazione tra Member Of Parliament e Philosopher @it
domain: member of parliament
range: philosopher
type: ObjectProperty

links to Currency
domain: member of parliament
comment: Relazione tra Member Of Parliament e Currency @it
type: ObjectProperty
sub property of: currency
comment: Relation between Member Of Parliament and Currency
range: currency

links to Village
comment: Relation between Member Of Parliament and Village
type: ObjectProperty
sub property of: place
range: village
domain: member of parliament
comment: Relazione tra Member Of Parliament e Village @it

person
label: personne @fr
type: ObjectProperty
label: pessoa @pt
label: Person @de

military unit
type: Class
label: unité militaire @fr

links to Website
type: ObjectProperty
sub property of: website
domain: member of parliament
comment: Relation between Member Of Parliament and Website
range: website
comment: Relazione tra Member Of Parliament e Website @it

links to Governor
type: NamedIndividual
sub property of: person
comment: Relation between Member Of Parliament and Governor
comment: Relazione tra Member Of Parliament e Governor @it
related match: post1preceded
related match: governorGeneral
domain: member of parliament
range: governor
type: ObjectProperty
related match: post4preceded

soccer manager
type: Class
label: entraîneur de football @fr

basketball team
type: Class

canadian football team
type: Class
label: équipe canadienne de football américain @fr

links to Hospital
comment: Relation between Member Of Parliament and Hospital
sub property of: place
range: hospital
type: ObjectProperty
comment: Relazione tra Member Of Parliament e Hospital @it
domain: member of parliament

music genre
label: genre musical @fr
type: ObjectProperty
label: género musical @pt
type: Class

Axiom
dbpedia infobox matching weight: 100.0
annotated property: relatedMatch
annotated target: partner
annotated source: links to Journalist

writer
type: Class
label: écrivain @fr

record label
type: Class
label: label discographique @fr

architect
label: architecte @fr
type: Class

links to Video Game
range: video game
sub property of: work
type: ObjectProperty
domain: member of parliament
comment: Relazione tra Member Of Parliament e Video Game @it
comment: Relation between Member Of Parliament and Video Game

model
label: mannequin @fr
type: Class

ambassador
type: Class
label: ambassadeur @fr

olympic result
label: résultat de Jeux Olympiques @fr
type: Class
type: ObjectProperty

crustacean
type: Class
label: crustacés @fr

links to Newspaper
sub property of: work
type: ObjectProperty
range: newspaper
comment: Relation between Member Of Parliament and Newspaper
domain: member of parliament
comment: Relazione tra Member Of Parliament e Newspaper @it

links to River
range: river
type: ObjectProperty
comment: Relazione tra Member Of Parliament e River @it
domain: member of parliament
sub property of: place
comment: Relation between Member Of Parliament and River

links to Mountain Range
domain: member of parliament
sub property of: place
type: ObjectProperty
range: mountain range
comment: Relazione tra Member Of Parliament e Mountain Range @it
comment: Relation between Member Of Parliament and Mountain Range

links to Crustacean
comment: Relazione tra Member Of Parliament e Crustacean @it
sub property of: species
range: crustacean
type: ObjectProperty
comment: Relation between Member Of Parliament and Crustacean
domain: member of parliament

film festival
type: Class
label: festival du film @fr

links to Airline
domain: member of parliament
range: airline
sub property of: organisation
comment: Relation between Member Of Parliament and Airline
comment: Relazione tra Member Of Parliament e Airline @it
type: ObjectProperty

Axiom
dbpedia infobox matching weight: 5.26
annotated property: relatedMatch
annotated target: before
annotated source: links to President

links to Insect
comment: Relazione tra Member Of Parliament e Insect @it
range: insect
type: ObjectProperty
domain: member of parliament
sub property of: species
comment: Relation between Member Of Parliament and Insect

chancellor
type: Class
label: chancelier @fr

comics creator
label: créateur de bandes dessinées @fr
type: Class

aircraft
label: avion @fr
type: Class
label: αεροσκάφος @el

links to Town
type: NamedIndividual
related match: deathPlace
domain: member of parliament
comment: Relazione tra Member Of Parliament e Town @it
range: town
sub property of: place
comment: Relation between Member Of Parliament and Town
type: ObjectProperty

hockey team
label: équipe de hockey @fr
type: Class

links to Cricketer
sub property of: person
type: ObjectProperty
comment: Relazione tra Member Of Parliament e Cricketer @it
comment: Relation between Member Of Parliament and Cricketer
domain: member of parliament
range: cricketer

links to Comics Creator
comment: Relation between Member Of Parliament and Comics Creator
domain: member of parliament
comment: Relazione tra Member Of Parliament e Comics Creator @it
sub property of: person
range: comics creator
type: ObjectProperty

soccer player
type: Class
label: joueur de football @fr

links to Chemical Compound
domain: member of parliament
type: ObjectProperty
sub property of: chemical compound
range: chemical compound
comment: Relation between Member Of Parliament and Chemical Compound
comment: Relazione tra Member Of Parliament e Chemical Compound @it

links to Tennis Player
sub property of: person
comment: Relazione tra Member Of Parliament e Tennis Player @it
comment: Relation between Member Of Parliament and Tennis Player
domain: member of parliament
type: ObjectProperty
range: tennis player

links to Continent
sub property of: place
type: ObjectProperty
domain: member of parliament
range: continent
comment: Relation between Member Of Parliament and Continent
comment: Relazione tra Member Of Parliament e Continent @it

airline
type: Class
label: compagnie aérienne @fr

monarch
label: monarque @fr
type: Class

links to Soccer League
domain: member of parliament
type: ObjectProperty
comment: Relazione tra Member Of Parliament e Soccer League @it
range: soccer league
sub property of: organisation
comment: Relation between Member Of Parliament and Soccer League

congressman
label: membre du Congrès @fr
type: Class

links to Sport
comment: Relazione tra Member Of Parliament e Sport @it
domain: member of parliament
range: sport
comment: Relation between Member Of Parliament and Sport
sub property of: activity
type: ObjectProperty

Axiom
dbpedia infobox matching weight: 5.26
annotated property: relatedMatch
annotated target: successor
annotated source: links to President

golf player
label: golfeur @fr
type: Class

activity
label: activité @fr
label: Aktivität @de
type: ObjectProperty

journalist
type: Class
label: journaliste @fr

links to Automobile
domain: member of parliament
type: ObjectProperty
sub property of: mean of transportation
comment: Relation between Member Of Parliament and Automobile
comment: Relazione tra Member Of Parliament e Automobile @it
range: automobile

links to Language
comment: Relation between Member Of Parliament and Language
range: language
sub property of: language
type: ObjectProperty
domain: member of parliament
comment: Relazione tra Member Of Parliament e Language @it

links to Road
comment: Relazione tra Member Of Parliament e Road @it
comment: Relation between Member Of Parliament and Road
range: road
domain: member of parliament
sub property of: infrastructure
type: ObjectProperty

links to Rugby Player
range: rugby player
sub property of: person
comment: Relazione tra Member Of Parliament e Rugby Player @it
comment: Relation between Member Of Parliament and Rugby Player
domain: member of parliament
type: ObjectProperty

links to Senator
sub property of: person
range: senator
domain: member of parliament
comment: Relazione tra Member Of Parliament e Senator @it
type: ObjectProperty
comment: Relation between Member Of Parliament and Senator

insect
type: Class
label: insecte @fr

film
type: Class
label: ταινία @el

links to Baseball Player
domain: member of parliament
comment: Relation between Member Of Parliament and Baseball Player
type: ObjectProperty
comment: Relazione tra Member Of Parliament e Baseball Player @it
range: baseball player
sub property of: person

links to College
related match: almaMater
type: NamedIndividual
type: ObjectProperty
sub property of: organisation
domain: member of parliament
comment: Relazione tra Member Of Parliament e College @it
range: college
comment: Relation between Member Of Parliament and College

links to Anatomical Structure
type: ObjectProperty
comment: Relation between Member Of Parliament and Anatomical Structure
range: anatomical structure
comment: Relazione tra Member Of Parliament e Anatomical Structure @it
sub property of: anatomical structure
domain: member of parliament

links to Wine Region
sub property of: place
type: ObjectProperty
comment: Relation between Member Of Parliament and Wine Region
comment: Relazione tra Member Of Parliament e Wine Region @it
domain: member of parliament
range: wine region

links to Weapon
domain: member of parliament
sub property of: device
comment: Relazione tra Member Of Parliament e Weapon @it
comment: Relation between Member Of Parliament and Weapon
type: ObjectProperty
range: weapon

chemical compound
type: Class
type: ObjectProperty
label: produit chimique @fr

bird
label: oiseau @fr
type: Class

power station
type: Class

Gaelic games player
label: joueur de sports gaéliques @fr
type: Class

musical artist
label: musicien @fr
type: Class
label: artista musical @pt

links to Actor
comment: Relation between Member Of Parliament and Actor
sub property of: person
comment: Relazione tra Member Of Parliament e Actor @it
type: ObjectProperty
domain: member of parliament
range: actor
related match: before
type: NamedIndividual

Axiom
dbpedia infobox matching weight: 33.33
annotated target: before
annotated source: links to Military Person
annotated property: relatedMatch

links to Pope
comment: Relation between Member Of Parliament and Pope
comment: Relazione tra Member Of Parliament e Pope @it
type: ObjectProperty
domain: member of parliament
sub property of: person
range: pope

park
label: parc @fr
type: Class

links to Scientist
range: scientist
comment: Relazione tra Member Of Parliament e Scientist @it
type: ObjectProperty
comment: Relation between Member Of Parliament and Scientist
domain: member of parliament
sub property of: person

fictional character
type: Class
label: personnage de fiction @fr

links to British Royalty
comment: Relazione tra Member Of Parliament e British Royalty @it
sub property of: person
comment: Relation between Member Of Parliament and British Royalty
type: ObjectProperty
range: British royalty
domain: member of parliament
related match: monarch
type: NamedIndividual

links to Basketball Team
comment: Relazione tra Member Of Parliament e Basketball Team @it
domain: member of parliament
range: basketball team
sub property of: organisation
type: ObjectProperty
comment: Relation between Member Of Parliament and Basketball Team

links to Locomotive
comment: Relation between Member Of Parliament and Locomotive
type: ObjectProperty
domain: member of parliament
comment: Relazione tra Member Of Parliament e Locomotive @it
sub property of: mean of transportation
range: locomotive

cardinal
type: Class

links to Canadian Football League
comment: Relazione tra Member Of Parliament e Canadian Football League @it
range: canadian football league
domain: member of parliament
type: ObjectProperty
comment: Relation between Member Of Parliament and Canadian Football League
sub property of: organisation

rugby player
type: Class
label: joueur de rugby @fr

links to Architect
domain: member of parliament
range: architect
sub property of: person
comment: Relation between Member Of Parliament and Architect
type: ObjectProperty
comment: Relazione tra Member Of Parliament e Architect @it

links to Historic Place
range: historic place
comment: Relation between Member Of Parliament and Historic Place
type: ObjectProperty
domain: member of parliament
comment: Relazione tra Member Of Parliament e Historic Place @it
sub property of: place

actor
label: acteur @fr
type: Class
label: Schauspieler @de

cyclist
type: Class
label: cycliste @fr

place
type: ObjectProperty
label: περιοχή @el
label: lieu @fr
label: lugar @pt

links to Ethnic Group
sub property of: ethnic group
domain: member of parliament
range: ethnic group
comment: Relazione tra Member Of Parliament e Ethnic Group @it
type: ObjectProperty
comment: Relation between Member Of Parliament and Ethnic Group

links to Model
domain: member of parliament
comment: Relazione tra Member Of Parliament e Model @it
range: model
sub property of: person
comment: Relation between Member Of Parliament and Model
type: ObjectProperty

links to Band
comment: Relation between Member Of Parliament and Band
domain: member of parliament
range: Band
type: ObjectProperty
comment: Relazione tra Member Of Parliament e Band @it
sub property of: organisation
related match: associatedActs
type: NamedIndividual

infrastructure
type: ObjectProperty

links to Music Festival
type: ObjectProperty
comment: Relazione tra Member Of Parliament e Music Festival @it
domain: member of parliament
comment: Relation between Member Of Parliament and Music Festival
sub property of: event
range: music festival

mountain
type: Class
label: montagne @fr
label: Βουνό @el

criminal
label: criminel @fr
type: Class

flowering plant
type: Class
label: angiospermes @fr

links to Military Unit
type: NamedIndividual
comment: Relation between Member Of Parliament and Military Unit
related match: occupation
related match: unit
type: ObjectProperty
sub property of: organisation
range: military unit
comment: Relazione tra Member Of Parliament e Military Unit @it
domain: member of parliament

senator
label: sénateur @fr
type: Class

saint
type: Class

comedian
type: Class
label: comédien @fr

song
label: chanson @fr
type: Class

links to World Heritage Site
comment: Relation between Member Of Parliament and World Heritage Site
type: ObjectProperty
range: World Heritage Site
comment: Relazione tra Member Of Parliament e World Heritage Site @it
sub property of: place
domain: member of parliament

links to President
related match: before
related match: after
comment: Relazione tra Member Of Parliament e President @it
related match: successor
domain: member of parliament
type: ObjectProperty
related match: alongside
type: NamedIndividual
comment: Relation between Member Of Parliament and President
range: president
sub property of: person

book
label: llibre @ca
label: książka @pl
label: βιβλίο @el
label: livre @fr
type: Class

links to Judge
range: judge
sub property of: person
type: ObjectProperty
comment: Relation between Member Of Parliament and Judge
comment: Relazione tra Member Of Parliament e Judge @it
domain: member of parliament

links to Radio Station
range: radio station
comment: Relazione tra Member Of Parliament e Radio Station @it
sub property of: organisation
type: ObjectProperty
comment: Relation between Member Of Parliament and Radio Station
domain: member of parliament

links to Canal
sub property of: place
comment: Relation between Member Of Parliament and Canal
type: ObjectProperty
range: canal
domain: member of parliament
comment: Relazione tra Member Of Parliament e Canal @it

device
type: ObjectProperty
label: appareil @fr

shopping mall
label: centre commercial @fr
type: Class

links to Fictional Character
type: ObjectProperty
comment: Relazione tra Member Of Parliament e Fictional Character @it
domain: member of parliament
range: fictional character
comment: Relation between Member Of Parliament and Fictional Character
sub property of: person

bacteria
label: bactérie @fr
type: Class

ski area
type: Class
label: domaine skiable @fr

links to Bridge
range: bridge
comment: Relation between Member Of Parliament and Bridge
comment: Relazione tra Member Of Parliament e Bridge @it
sub property of: place
type: ObjectProperty
domain: member of parliament

non-profit organisation
type: Class
label: organisation à but non lucratif @fr

canadian football league
type: Class

Axiom
dbpedia infobox matching weight: 66.67
annotated property: relatedMatch
annotated target: governorGeneral
annotated source: links to Governor

links to Song
comment: Relazione tra Member Of Parliament e Song @it
range: song
comment: Relation between Member Of Parliament and Song
domain: member of parliament
sub property of: work
type: ObjectProperty

links to Island
domain: member of parliament
type: ObjectProperty
range: island
comment: Relazione tra Member Of Parliament e Island @it
comment: Relation between Member Of Parliament and Island
sub property of: place

wine region
type: Class
label: région viticole @fr

links to Mayor
sub property of: person
comment: Relation between Member Of Parliament and Mayor
domain: member of parliament
type: ObjectProperty
range: mayor
comment: Relazione tra Member Of Parliament e Mayor @it

weapon
type: Class
label: arme @fr

links to Formula One Racer
comment: Relation between Member Of Parliament and Formula One Racer
type: ObjectProperty
domain: member of parliament
sub property of: person
comment: Relazione tra Member Of Parliament e Formula One Racer @it
range: Formula One racer

drug
type: ObjectProperty
label: médicament @fr
type: Class

magazine
type: Class
label: περιοδικό @el

canal
type: Class

military person
label: militaire @fr
type: Class

philosopher
type: Class
label: philosophe @fr

award
type: ObjectProperty
label: récompense @fr
type: Class

locomotive
type: Class

Axiom
dbpedia infobox matching weight: 63.16
annotated target: alongside
annotated property: relatedMatch
annotated source: links to President

college
type: Class

anatomical structure
type: Class
type: ObjectProperty
label: structure anatomique @fr

sport
type: Class

links to Chancellor
comment: Relazione tra Member Of Parliament e Chancellor @it
range: chancellor
comment: Relation between Member Of Parliament and Chancellor
sub property of: person
type: ObjectProperty
domain: member of parliament

cricketer
label: joueur de cricket @fr
type: Class

single
type: Class

links to Astronaut
type: NamedIndividual
related match: after
type: ObjectProperty
domain: member of parliament
range: astronaut
comment: Relazione tra Member Of Parliament e Astronaut @it
sub property of: person
comment: Relation between Member Of Parliament and Astronaut

Band
label: banda @pt
label: Musikgruppe @de
type: Class
label: groupe de musique @fr

links to Baseball League
range: baseball league
type: ObjectProperty
domain: member of parliament
sub property of: organisation
comment: Relation between Member Of Parliament and Baseball League
comment: Relazione tra Member Of Parliament e Baseball League @it

links to Comedian
comment: Relazione tra Member Of Parliament e Comedian @it
type: ObjectProperty
range: comedian
sub property of: person
comment: Relation between Member Of Parliament and Comedian
domain: member of parliament

town
type: Class
label: ville @fr

links to Airport
sub property of: place
range: airport
comment: Relazione tra Member Of Parliament e Airport @it
comment: Relation between Member Of Parliament and Airport
type: ObjectProperty
domain: member of parliament

links to Single
range: single
type: ObjectProperty
comment: Relazione tra Member Of Parliament e Single @it
domain: member of parliament
sub property of: work
comment: Relation between Member Of Parliament and Single

ethnic group
type: Class
type: ObjectProperty
label: groupe ethnique @fr

links to Musical Artist
comment: Relation between Member Of Parliament and Musical Artist
range: musical artist
type: ObjectProperty
domain: member of parliament
comment: Relazione tra Member Of Parliament e Musical Artist @it
sub property of: person

links to Saint
domain: member of parliament
comment: Relazione tra Member Of Parliament e Saint @it
sub property of: person
range: saint
comment: Relation between Member Of Parliament and Saint
type: ObjectProperty

hotel
type: Class
label: hôtel @fr

music festival
label: festival de musique @fr
type: Class

links to Colour
comment: Relation between Member Of Parliament and Colour
domain: member of parliament
sub property of: colour
range: colour
type: ObjectProperty
comment: Relazione tra Member Of Parliament e Colour @it

television episode
type: Class
label: épisode télévisé @fr

Axiom
dbpedia infobox matching weight: 100.0
annotated target: after
annotated source: links to Ice Hockey Player
annotated property: relatedMatch

village
type: Class
label: χωριό @el

ice hockey league
label: ligue d'hockey sur glace @fr
type: Class

links to Hotel
comment: Relazione tra Member Of Parliament e Hotel @it
comment: Relation between Member Of Parliament and Hotel
range: hotel
type: ObjectProperty
sub property of: place
domain: member of parliament

links to Congressman
sub property of: person
domain: member of parliament
type: ObjectProperty
range: congressman
comment: Relazione tra Member Of Parliament e Congressman @it
comment: Relation between Member Of Parliament and Congressman

links to Golf League
comment: Relazione tra Member Of Parliament e Golf League @it
domain: member of parliament
type: ObjectProperty
comment: Relation between Member Of Parliament and Golf League
range: golf league
sub property of: organisation

links to Planet
sub property of: planet
comment: Relazione tra Member Of Parliament e Planet @it
comment: Relation between Member Of Parliament and Planet
type: ObjectProperty
range: planet
domain: member of parliament

soccer club
type: Class
label: club de football @fr

Axiom
dbpedia infobox matching weight: 100.0
annotated property: relatedMatch
annotated target: deathPlace
annotated source: links to Town

links to Lake
comment: Relazione tra Member Of Parliament e Lake @it
domain: member of parliament
comment: Relation between Member Of Parliament and Lake
range: lake
sub property of: place
type: ObjectProperty

links to Soccer Player
comment: Relazione tra Member Of Parliament e Soccer Player @it
range: soccer player
sub property of: person
domain: member of parliament
type: ObjectProperty
comment: Relation between Member Of Parliament and Soccer Player

Axiom
dbpedia infobox matching weight: 16.67
annotated property: relatedMatch
annotated target: post1preceded
annotated source: links to Governor

historic building
type: Class
label: bâtiment historique @fr

links to Game
comment: Relation between Member Of Parliament and Game
sub property of: activity
domain: member of parliament
comment: Relazione tra Member Of Parliament e Game @it
type: ObjectProperty
range: game

baseball player
type: Class
label: joueur de baseball @fr

military conflict
label: conflit militaire @fr
type: Class

website
label: site web @fr
label: Ιστότοπος @el
type: Class
type: ObjectProperty

links to Bird
domain: member of parliament
comment: Relation between Member Of Parliament and Bird
range: bird
sub property of: species
type: ObjectProperty
comment: Relazione tra Member Of Parliament e Bird @it

links to Flowering Plant
comment: Relazione tra Member Of Parliament e Flowering Plant @it
sub property of: species
range: flowering plant
comment: Relation between Member Of Parliament and Flowering Plant
domain: member of parliament
type: ObjectProperty

links to Military Person
type: ObjectProperty
type: NamedIndividual
related match: before
sub property of: person
comment: Relazione tra Member Of Parliament e Military Person @it
range: military person
comment: Relation between Member Of Parliament and Military Person
domain: member of parliament
related match: after

links to Drug
comment: Relazione tra Member Of Parliament e Drug @it
comment: Relation between Member Of Parliament and Drug
domain: member of parliament
sub property of: drug
range: drug
type: ObjectProperty

Axiom
dbpedia infobox matching weight: 50.0
annotated property: relatedMatch
annotated source: links to Military Unit
annotated target: occupation

ice hockey player
label: joueur de hockey sur glace @fr
type: Class

links to Fish
comment: Relation between Member Of Parliament and Fish
type: ObjectProperty
range: fish
domain: member of parliament
sub property of: species
comment: Relazione tra Member Of Parliament e Fish @it

Christian Bishop
type: Class
label: évêque chrétien @fr

mountain range
label: chaîne de montagne @fr
type: Class

Axiom
dbpedia infobox matching weight: 16.67
annotated property: relatedMatch
annotated source: links to Governor
annotated target: post4preceded

beverage
label: boisson @fr
type: Class
type: ObjectProperty

links to American Football Player
range: american football player
sub property of: person
comment: Relation between Member Of Parliament and American Football Player
type: ObjectProperty
comment: Relazione tra Member Of Parliament e American Football Player @it
domain: member of parliament

links to Park
type: ObjectProperty
range: park
sub property of: place
comment: Relation between Member Of Parliament and Park
comment: Relazione tra Member Of Parliament e Park @it
domain: member of parliament

links to Album
comment: Relazione tra Member Of Parliament e Album @it
range: album
type: ObjectProperty
comment: Relation between Member Of Parliament and Album
domain: member of parliament
sub property of: work

links to Power Station
comment: Relation between Member Of Parliament and Power Station
sub property of: infrastructure
domain: member of parliament
range: power station
comment: Relazione tra Member Of Parliament e Power Station @it
type: ObjectProperty

Axiom
dbpedia infobox matching weight: 50.0
annotated source: links to Military Unit
annotated property: relatedMatch
annotated target: unit

planet
type: Class
label: planète @fr
type: ObjectProperty

links to Beverage
comment: Relazione tra Member Of Parliament e Beverage @it
domain: member of parliament
comment: Relation between Member Of Parliament and Beverage
type: ObjectProperty
range: beverage
sub property of: beverage

links to Journalist
type: ObjectProperty
comment: Relation between Member Of Parliament and Journalist
domain: member of parliament
comment: Relazione tra Member Of Parliament e Journalist @it
sub property of: person
range: journalist
related match: partner
type: NamedIndividual

scientist
label: scientifique @fr
type: Class
label: Wissenschaftler @de

links to Historic Building
comment: Relazione tra Member Of Parliament e Historic Building @it
comment: Relation between Member Of Parliament and Historic Building
range: historic building
sub property of: place
domain: member of parliament
type: ObjectProperty

golf league
type: Class
label: ligue de golf @fr

Axiom
dbpedia infobox matching weight: 66.67
annotated source: links to Military Person
annotated property: relatedMatch
annotated target: after

links to Bacteria
domain: member of parliament
comment: Relazione tra Member Of Parliament e Bacteria @it
type: ObjectProperty
range: bacteria
sub property of: species
comment: Relation between Member Of Parliament and Bacteria

olympics
type: Class
label: Jeux Olympiques @fr

organisation
label: Organisation @de
label: organização @pt
type: ObjectProperty

baseball league
type: Class
label: ligue de baseball @fr

bridge
type: Class
label: pont @fr

links to Monarch
domain: member of parliament
comment: Relazione tra Member Of Parliament e Monarch @it
sub property of: person
comment: Relation between Member Of Parliament and Monarch
range: monarch
type: ObjectProperty

links to Aircraft
comment: Relazione tra Member Of Parliament e Aircraft @it
range: aircraft
sub property of: mean of transportation
type: ObjectProperty
domain: member of parliament
comment: Relation between Member Of Parliament and Aircraft

broadcast
type: Class
label: Émission de télévision @fr

links to Museum
comment: Relazione tra Member Of Parliament e Museum @it
comment: Relation between Member Of Parliament and Museum
range: museum
domain: member of parliament
type: ObjectProperty
sub property of: place

mammal
label: mammifère @fr
type: Class

links to Award
comment: Relation between Member Of Parliament and Award
range: award
sub property of: award
comment: Relazione tra Member Of Parliament e Award @it
type: ObjectProperty
domain: member of parliament

island
label: île @fr
label: νησί @el
type: Class

event
label: évènement @fr
type: ObjectProperty

Axiom
dbpedia infobox matching weight: 100.0
annotated source: links to British Royalty
annotated property: relatedMatch
annotated target: monarch

Formula One racer
label: pilote de formule 1 @fr
type: Class

skyscraper
type: Class
label: gratte-ciel @fr

links to Mammal
sub property of: species
comment: Relazione tra Member Of Parliament e Mammal @it
domain: member of parliament
comment: Relation between Member Of Parliament and Mammal
range: mammal
type: ObjectProperty

radio station
type: Class
label: station de radio @fr

member of parliament
label: membre du Parlement @fr
type: Class

links to Ski Area
type: ObjectProperty
range: ski area
comment: Relation between Member Of Parliament and Ski Area
domain: member of parliament
comment: Relazione tra Member Of Parliament e Ski Area @it
sub property of: place

conifer
label: conifères @fr
type: Class

airport
type: Class
label: Flughafen @de
label: aéroport @fr

links to Olympic Result
comment: Relazione tra Member Of Parliament e Olympic Result @it
range: olympic result
comment: Relation between Member Of Parliament and Olympic Result
type: ObjectProperty
sub property of: olympic result
domain: member of parliament