Axiom
dbpedia infobox matching weight: 50.0
annotated property: relatedMatch
annotated source: links to Cricketer
annotated target: after

links to Legislature
range: legislature
type: NamedIndividual
comment: Relazione tra Military Person e Legislature @it
comment: Relation between Military Person and Legislature
sub property of: organização
related match: title
type: ObjectProperty
related match: laterwork
domain: military person

television show
type: Class
label: émission de télévision @fr

rocket
type: Class
label: fusée @fr

disease
type: ObjectProperty
type: Class
label: maladie @fr

Axiom
dbpedia infobox matching weight: 87.5
annotated target: laterwork
annotated source: links to Legislature
annotated property: relatedMatch

links to Bone
sub property of: anatomical structure
comment: Relation between Military Person and Bone
type: ObjectProperty
comment: Relazione tra Military Person e Bone @it
domain: military person
range: bone

links to Album
comment: Relation between Military Person and Album
type: ObjectProperty
comment: Relazione tra Military Person e Album @it
range: album
domain: military person
sub property of: work

automobile
type: Class

colour
type: ObjectProperty
label: χρώμα @el
label: couleur @fr
type: Class

links to Space Station
range: space station
comment: Relazione tra Military Person e Space Station @it
domain: military person
comment: Relation between Military Person and Space Station
type: ObjectProperty
sub property of: mean of transportation

Election
label: élection @fr
type: Class

links to Shopping Mall
comment: Relazione tra Military Person e Shopping Mall @it
type: ObjectProperty
comment: Relation between Military Person and Shopping Mall
range: shopping mall
sub property of: place
domain: military person

links to Newspaper
domain: military person
comment: Relation between Military Person and Newspaper
sub property of: work
comment: Relazione tra Military Person e Newspaper @it
range: newspaper
type: ObjectProperty

mean of transportation
label: moyen de transport @fr
type: ObjectProperty

american football player
type: Class
label: joueur de football américain @fr

Legal Case
label: cas juridique @fr
type: ObjectProperty

stadium
type: Class
label: stade @fr

Axiom
dbpedia infobox matching weight: 100.0
annotated source: links to Film
annotated target: laterwork
annotated property: relatedMatch

soccer league
label: ligue de football @fr
type: Class

Axiom
dbpedia infobox matching weight: 20.0
annotated source: links to Historic Place
annotated property: relatedMatch
annotated target: commands

astronaut
type: Class
label: Astronaut @de
label: astronaute @fr

links to Village
related match: placeofbirth
type: NamedIndividual
type: ObjectProperty
sub property of: place
comment: Relation between Military Person and Village
comment: Relazione tra Military Person e Village @it
range: village
domain: military person

links to Astronaut
comment: Relazione tra Military Person e Astronaut @it
sub property of: person
type: ObjectProperty
domain: military person
range: astronaut
comment: Relation between Military Person and Astronaut

links to Monarch
type: NamedIndividual
related match: regent
comment: Relation between Military Person and Monarch
comment: Relazione tra Military Person e Monarch @it
range: monarch
type: ObjectProperty
domain: military person
sub property of: person

links to Museum
related match: laterwork
type: NamedIndividual
comment: Relation between Military Person and Museum
type: ObjectProperty
sub property of: place
domain: military person
range: museum
comment: Relazione tra Military Person e Museum @it

links to American Football Team
type: ObjectProperty
comment: Relazione tra Military Person e American Football Team @it
comment: Relation between Military Person and American Football Team
sub property of: organização
domain: military person
range: american football team

Axiom
dbpedia infobox matching weight: 50.0
annotated property: relatedMatch
annotated source: links to Island
annotated target: battles

Axiom
dbpedia infobox matching weight: 27.78
annotated target: before
annotated property: relatedMatch
annotated source: links to British Royalty

mayor
label: maire @fr
type: Class

amphibian
type: Class
label: amphibien @fr

pope
type: Class
label: pape @fr

species
type: ObjectProperty
label: espèce @fr

links to Christian Bishop
comment: Relazione tra Military Person e Christian Bishop @it
range: Christian Bishop
sub property of: person
domain: military person
type: ObjectProperty
comment: Relation between Military Person and Christian Bishop

links to Cardinal
range: cardinal
type: ObjectProperty
sub property of: person
domain: military person
comment: Relation between Military Person and Cardinal
comment: Relazione tra Military Person e Cardinal @it

links to Sport
type: ObjectProperty
comment: Relazione tra Military Person e Sport @it
sub property of: activity
range: sport
domain: military person
comment: Relation between Military Person and Sport

newspaper
label: journal @fr
type: Class

protected area
label: aire protégée @fr
label: προστατευμένη περιοχή @el
type: Class

game
label: jeu @fr
type: Class

road
type: Class
label: route @fr

Axiom
dbpedia infobox matching weight: 50.0
annotated property: relatedMatch
annotated source: links to Cricketer
annotated target: before

boxer
label: boxeur @fr
type: Class

judge
label: juge @fr
type: Class

World Heritage Site
label: site du patrimoine mondial @fr
type: Class

Axiom
dbpedia infobox matching weight: 1.85
annotated target: title
annotated source: links to Airport
annotated property: relatedMatch

language
type: Class
label: langage @fr
type: ObjectProperty

station
type: Class

links to Moss
range: moss
comment: Relazione tra Military Person e Moss @it
sub property of: species
domain: military person
type: ObjectProperty
comment: Relation between Military Person and Moss

links to Airport
type: ObjectProperty
sub property of: place
related match: commands
range: airport
comment: Relazione tra Military Person e Airport @it
type: NamedIndividual
related match: title
related match: unit
comment: Relation between Military Person and Airport
domain: military person

Axiom
dbpedia infobox matching weight: 12.5
annotated target: title
annotated property: relatedMatch
annotated source: links to Legislature

lake
label: lac @fr
type: Class

links to Hospital
comment: Relation between Military Person and Hospital
range: hospital
comment: Relazione tra Military Person e Hospital @it
domain: military person
sub property of: place
type: ObjectProperty
type: NamedIndividual
related match: placeOfDeath

links to Crustacean
comment: Relation between Military Person and Crustacean
type: ObjectProperty
domain: military person
sub property of: species
comment: Relazione tra Military Person e Crustacean @it
range: crustacean

links to Book
range: book
type: ObjectProperty
sub property of: work
comment: Relazione tra Military Person e Book @it
comment: Relation between Military Person and Book
domain: military person

Axiom
dbpedia infobox matching weight: 4.0
annotated property: relatedMatch
annotated target: data
annotated source: links to Historic Place

links to Language
domain: military person
type: ObjectProperty
sub property of: language
range: language
comment: Relazione tra Military Person e Language @it
comment: Relation between Military Person and Language

Axiom
dbpedia infobox matching weight: 37.5
annotated target: before
annotated property: relatedMatch
annotated source: links to Senator

arachnid
type: Class
label: arachnides @fr

links to Bacteria
type: ObjectProperty
sub property of: species
domain: military person
comment: Relation between Military Person and Bacteria
comment: Relazione tra Military Person e Bacteria @it
range: bacteria

governor
label: gouverneur @fr
type: Class

links to Trade Union
comment: Relazione tra Military Person e Trade Union @it
range: trade union
type: ObjectProperty
sub property of: organização
comment: Relation between Military Person and Trade Union
domain: military person

links to Continent
comment: Relazione tra Military Person e Continent @it
comment: Relation between Military Person and Continent
sub property of: place
type: ObjectProperty
range: continent
domain: military person

links to American Football Player
comment: Relazione tra Military Person e American Football Player @it
range: american football player
related match: after
type: NamedIndividual
domain: military person
comment: Relation between Military Person and American Football Player
related match: before
related match: years
type: ObjectProperty
sub property of: person

work
label: obra @pt
label: travail @fr
type: ObjectProperty

river
label: rivière @fr
type: Class

Axiom
dbpedia infobox matching weight: 16.67
annotated property: relatedMatch
annotated source: links to American Football Player
annotated target: before

school
label: école @fr
type: Class

museum
type: Class
label: musée @fr

fish
type: Class
label: poisson @fr

tennis player
type: Class
label: joueur de tennis @fr

links to Comedian
range: comedian
sub property of: person
comment: Relation between Military Person and Comedian
type: ObjectProperty
comment: Relazione tra Military Person e Comedian @it
domain: military person

video game
type: Class
label: jeux vidéo @fr

trade union
type: Class
label: syndicat professionnel @fr

links to Colour
type: ObjectProperty
comment: Relazione tra Military Person e Colour @it
sub property of: colour
range: colour
domain: military person
comment: Relation between Military Person and Colour

links to Rugby Player
type: NamedIndividual
related match: after
comment: Relation between Military Person and Rugby Player
type: ObjectProperty
sub property of: person
range: rugby player
domain: military person
comment: Relazione tra Military Person e Rugby Player @it

links to Writer
domain: military person
type: ObjectProperty
sub property of: person
comment: Relation between Military Person and Writer
comment: Relazione tra Military Person e Writer @it
range: writer

currency
type: ObjectProperty
type: Class
label: devise @fr

links to Magazine
domain: military person
range: magazine
sub property of: work
comment: Relazione tra Military Person e Magazine @it
comment: Relation between Military Person and Magazine
type: ObjectProperty

prime minister
type: Class
label: premier ministre @fr

British royalty
label: royauté Britannique @fr
type: Class

historic place
type: Class
label: site historique @fr

hospital
type: Class
label: hôpital @fr

Axiom
dbpedia infobox matching weight: 50.0
annotated property: relatedMatch
annotated source: links to Basketball Player
annotated target: years

lunar crater
type: Class
label: cratère lunaire @fr

links to Aircraft
comment: Relazione tra Military Person e Aircraft @it
domain: military person
comment: Relation between Military Person and Aircraft
sub property of: mean of transportation
type: ObjectProperty
range: aircraft

Axiom
dbpedia infobox matching weight: 66.67
annotated target: after
annotated source: links to American Football Player
annotated property: relatedMatch

Axiom
dbpedia infobox matching weight: 64.0
annotated target: placeofburial
annotated property: relatedMatch
annotated source: links to Historic Place

continent
type: Class
label: ήπειρος @el

links to Adult Actor
domain: military person
sub property of: person
comment: Relazione tra Military Person e Adult Actor @it
range: adult actor
type: ObjectProperty
comment: Relation between Military Person and Adult Actor

Axiom
dbpedia infobox matching weight: 100.0
annotated property: relatedMatch
annotated source: links to Hospital
annotated target: placeOfDeath

links to Television Episode
domain: military person
sub property of: work
type: ObjectProperty
range: television episode
comment: Relation between Military Person and Television Episode
comment: Relazione tra Military Person e Television Episode @it

album
label: Album @de
type: Class

links to Election
related match: years
type: NamedIndividual
range: Election
sub property of: event
domain: military person
comment: Relazione tra Military Person e Election @it
comment: Relation between Military Person and Election
type: ObjectProperty

figure skater
label: patineur artistique @fr
type: Class

moss
label: mousses @fr
type: Class

Axiom
dbpedia infobox matching weight: 40.0
annotated source: links to Airline
annotated target: laterwork
annotated property: relatedMatch

links to Golf Player
comment: Relation between Military Person and Golf Player
domain: military person
comment: Relazione tra Military Person e Golf Player @it
type: ObjectProperty
range: golf player
sub property of: person

links to Chemical Compound
type: ObjectProperty
domain: military person
comment: Relation between Military Person and Chemical Compound
comment: Relazione tra Military Person e Chemical Compound @it
sub property of: chemical compound
range: chemical compound

links to Planet
domain: military person
range: planet
comment: Relazione tra Military Person e Planet @it
sub property of: planet
comment: Relation between Military Person and Planet
type: ObjectProperty

person
label: Person @de
label: pessoa @pt
type: ObjectProperty
label: personne @fr

soccer manager
label: entraîneur de football @fr
type: Class

basketball team
type: Class

links to Beverage
sub property of: beverage
type: ObjectProperty
comment: Relazione tra Military Person e Beverage @it
domain: military person
range: beverage
comment: Relation between Military Person and Beverage

Axiom
dbpedia infobox matching weight: 33.33
annotated source: links to Congressman
annotated target: before
annotated property: relatedMatch

canadian football team
label: équipe canadienne de football américain @fr
type: Class

links to Airline
range: airline
comment: Relation between Military Person and Airline
type: NamedIndividual
type: ObjectProperty
comment: Relazione tra Military Person e Airline @it
sub property of: organização
domain: military person
related match: laterwork
related match: commands

music genre
type: Class
label: género musical @pt
type: ObjectProperty
label: genre musical @fr

links to Award
domain: military person
sub property of: award
comment: Relation between Military Person and Award
comment: Relazione tra Military Person e Award @it
range: award
type: ObjectProperty

writer
type: Class
label: écrivain @fr

record label
label: label discographique @fr
type: Class

architect
label: architecte @fr
type: Class

model
label: mannequin @fr
type: Class

ambassador
type: Class
label: ambassadeur @fr

Axiom
dbpedia infobox matching weight: 46.67
annotated source: links to Prime Minister
annotated property: relatedMatch
annotated target: before

links to Journalist
type: ObjectProperty
sub property of: person
comment: Relation between Military Person and Journalist
comment: Relazione tra Military Person e Journalist @it
domain: military person
range: journalist

olympic result
label: résultat de Jeux Olympiques @fr
type: Class
type: ObjectProperty

crustacean
type: Class
label: crustacés @fr

links to Mountain Range
range: mountain range
type: ObjectProperty
comment: Relazione tra Military Person e Mountain Range @it
sub property of: place
comment: Relation between Military Person and Mountain Range
domain: military person

Axiom
dbpedia infobox matching weight: 100.0
annotated property: relatedMatch
annotated source: links to Village
annotated target: placeofbirth

film festival
type: Class
label: festival du film @fr

links to Playboy Playmate
comment: Relation between Military Person and Playboy Playmate
range: Playboy Playmate
sub property of: person
type: ObjectProperty
comment: Relazione tra Military Person e Playboy Playmate @it
domain: military person

links to Musical Artist
comment: Relazione tra Military Person e Musical Artist @it
range: musical artist
comment: Relation between Military Person and Musical Artist
type: ObjectProperty
sub property of: person
domain: military person

links to Non- Profit Organisation
range: non-profit organisation
comment: Relazione tra Military Person e Non- Profit Organisation @it
domain: military person
comment: Relation between Military Person and Non- Profit Organisation
type: ObjectProperty
sub property of: organização

links to Historic Building
type: ObjectProperty
comment: Relazione tra Military Person e Historic Building @it
sub property of: place
comment: Relation between Military Person and Historic Building
domain: military person
range: historic building

links to Soccer Player
sub property of: person
comment: Relazione tra Military Person e Soccer Player @it
type: ObjectProperty
domain: military person
comment: Relation between Military Person and Soccer Player
range: soccer player

links to Record Label
comment: Relazione tra Military Person e Record Label @it
comment: Relation between Military Person and Record Label
type: ObjectProperty
domain: military person
range: record label
sub property of: organização

links to Canal
sub property of: place
type: ObjectProperty
comment: Relazione tra Military Person e Canal @it
range: canal
domain: military person
comment: Relation between Military Person and Canal

Axiom
dbpedia infobox matching weight: 100.0
annotated property: relatedMatch
annotated source: links to Member Of Parliament
annotated target: after

links to Convention
type: ObjectProperty
domain: military person
comment: Relazione tra Military Person e Convention @it
sub property of: event
comment: Relation between Military Person and Convention
range: convention

links to Bridge
type: ObjectProperty
domain: military person
comment: Relazione tra Military Person e Bridge @it
sub property of: place
range: bridge
comment: Relation between Military Person and Bridge

links to Prime Minister
range: prime minister
related match: after
type: NamedIndividual
sub property of: person
related match: before
comment: Relazione tra Military Person e Prime Minister @it
type: ObjectProperty
comment: Relation between Military Person and Prime Minister
domain: military person

lighthouse
type: Class
label: phare @fr

chancellor
label: chancelier @fr
type: Class

comics creator
label: créateur de bandes dessinées @fr
type: Class

aircraft
label: avion @fr
type: Class
label: αεροσκάφος @el

Axiom
dbpedia infobox matching weight: 50.0
annotated property: relatedMatch
annotated source: links to Senator
annotated target: after

links to British Royalty
comment: Relazione tra Military Person e British Royalty @it
type: NamedIndividual
related match: allegiance
comment: Relation between Military Person and British Royalty
range: British royalty
sub property of: person
related match: after
related match: issue
domain: military person
type: ObjectProperty
related match: reason
related match: before

hockey team
label: équipe de hockey @fr
type: Class

soccer player
type: Class
label: joueur de football @fr

Axiom
dbpedia infobox matching weight: 92.59
annotated target: commands
annotated source: links to Airport
annotated property: relatedMatch

reptile
type: Class

legislature
label: pouvoir législatif @fr
type: Class

links to Philosopher
type: ObjectProperty
sub property of: person
range: philosopher
domain: military person
comment: Relation between Military Person and Philosopher
comment: Relazione tra Military Person e Philosopher @it

cave
type: Class
label: grotte @fr

Axiom
dbpedia infobox matching weight: 25.0
annotated target: placeOfDeath
annotated source: links to Island
annotated property: relatedMatch

links to Muscle
comment: Relation between Military Person and Muscle
type: ObjectProperty
sub property of: anatomical structure
comment: Relazione tra Military Person e Muscle @it
range: muscle
domain: military person

airline
label: compagnie aérienne @fr
type: Class

monarch
type: Class
label: monarque @fr

links to Arachnid
sub property of: species
range: arachnid
comment: Relation between Military Person and Arachnid
type: ObjectProperty
comment: Relazione tra Military Person e Arachnid @it
domain: military person

Axiom
dbpedia infobox matching weight: 50.0
annotated target: after
annotated property: relatedMatch
annotated source: links to Congressman

congressman
type: Class
label: membre du Congrès @fr

MilitaryPerson.owl
comment: MilitaryPerson Encyclopedic Knowledge Pattern
imports: dbpediainfoboxmatchingweight.owl
type: Ontology
has author: Valentina Presutti
has author: Aldo Gangemi
extracted from: dbpedia.org
has intent: To represent the encyclopedic knowledge expressed by an object typed as MilitaryPerson
extracted from: en.wikipedia.org
imports: cpannotationschema.owl
has author: Andrea Giovanni Nuzzolese

golf player
type: Class
label: golfeur @fr

activity
label: activité @fr
label: Aktivität @de
type: ObjectProperty

journalist
type: Class
label: journaliste @fr

space mission
type: Class
label: διαστημική αποστολή @el
label: mission spatiale @fr

links to Senator
type: ObjectProperty
related match: before
comment: Relation between Military Person and Senator
related match: alongside
related match: after
domain: military person
type: NamedIndividual
sub property of: person
range: senator
comment: Relazione tra Military Person e Senator @it

links to Grape
sub property of: species
comment: Relazione tra Military Person e Grape @it
range: grape
domain: military person
comment: Relation between Military Person and Grape
type: ObjectProperty

links to Cave
comment: Relation between Military Person and Cave
domain: military person
range: cave
comment: Relazione tra Military Person e Cave @it
type: ObjectProperty
sub property of: place

links to Broadcast
comment: Relazione tra Military Person e Broadcast @it
range: broadcast
domain: military person
sub property of: organização
type: ObjectProperty
comment: Relation between Military Person and Broadcast

insect
label: insecte @fr
type: Class

Axiom
dbpedia infobox matching weight: 11.11
annotated source: links to British Royalty
annotated property: relatedMatch
annotated target: issue

film
label: ταινία @el
type: Class

american football team
type: Class
label: équipe américaine de football américain @fr

links to Music Genre
comment: Relazione tra Military Person e Music Genre @it
comment: Relation between Military Person and Music Genre
type: ObjectProperty
domain: military person
range: music genre
sub property of: music genre

links to Insect
range: insect
type: ObjectProperty
comment: Relazione tra Military Person e Insect @it
comment: Relation between Military Person and Insect
domain: military person
sub property of: species

links to Scientist
domain: military person
comment: Relation between Military Person and Scientist
sub property of: person
type: ObjectProperty
range: scientist
comment: Relazione tra Military Person e Scientist @it

links to Fish
range: fish
comment: Relazione tra Military Person e Fish @it
type: ObjectProperty
domain: military person
sub property of: species
comment: Relation between Military Person and Fish

links to Soccer Manager
domain: military person
comment: Relation between Military Person and Soccer Manager
range: soccer manager
sub property of: person
type: ObjectProperty
comment: Relazione tra Military Person e Soccer Manager @it

links to Chancellor
comment: Relazione tra Military Person e Chancellor @it
type: ObjectProperty
range: chancellor
comment: Relation between Military Person and Chancellor
sub property of: person
domain: military person

Supreme Court of the United States case
type: Class
label: cas juridique de la Cour suprême des États-Unis @fr

Axiom
dbpedia infobox matching weight: 100.0
annotated source: links to Election
annotated target: years
annotated property: relatedMatch

links to Station
domain: military person
comment: Relazione tra Military Person e Station @it
type: ObjectProperty
sub property of: place
comment: Relation between Military Person and Station
range: station

chemical compound
label: produit chimique @fr
type: ObjectProperty
type: Class

links to Locomotive
comment: Relation between Military Person and Locomotive
domain: military person
range: locomotive
comment: Relazione tra Military Person e Locomotive @it
sub property of: mean of transportation
type: ObjectProperty

bird
type: Class
label: oiseau @fr

Gaelic games player
label: joueur de sports gaéliques @fr
type: Class

links to Musical
comment: Relazione tra Military Person e Musical @it
type: ObjectProperty
comment: Relation between Military Person and Musical
sub property of: work
domain: military person
range: musical

Axiom
dbpedia infobox matching weight: 8.0
annotated source: links to Historic Place
annotated property: relatedMatch
annotated target: unit

musical artist
label: artista musical @pt
type: Class
label: musicien @fr

links to Comics Creator
type: ObjectProperty
domain: military person
comment: Relazione tra Military Person e Comics Creator @it
range: comics creator
comment: Relation between Military Person and Comics Creator
sub property of: person

Axiom
dbpedia infobox matching weight: 4.0
annotated property: relatedMatch
annotated source: links to Historic Place
annotated target: laterwork

links to American Football League
sub property of: organização
type: ObjectProperty
comment: Relazione tra Military Person e American Football League @it
comment: Relation between Military Person and American Football League
range: american football league
domain: military person
type: NamedIndividual
related match: laterwork

Axiom
dbpedia infobox matching weight: 5.56
annotated source: links to British Royalty
annotated property: relatedMatch
annotated target: reason

links to Formula One Racer
range: Formula One racer
comment: Relation between Military Person and Formula One Racer
domain: military person
sub property of: person
type: ObjectProperty
comment: Relazione tra Military Person e Formula One Racer @it

links to Protected Area
type: ObjectProperty
sub property of: place
comment: Relation between Military Person and Protected Area
domain: military person
comment: Relazione tra Military Person e Protected Area @it
range: protected area

Axiom
dbpedia infobox matching weight: 16.67
annotated source: links to Congressman
annotated target: alongside
annotated property: relatedMatch

park
label: parc @fr
type: Class

cardinal
type: Class

rugby player
type: Class
label: joueur de rugby @fr

links to Rocket
comment: Relation between Military Person and Rocket
range: rocket
type: ObjectProperty
domain: military person
comment: Relazione tra Military Person e Rocket @it
sub property of: mean of transportation

american football league
type: Class

links to Judge
comment: Relazione tra Military Person e Judge @it
type: ObjectProperty
comment: Relation between Military Person and Judge
sub property of: person
range: judge
domain: military person
related match: after
type: NamedIndividual

musical
type: Class
label: musique @fr

Axiom
dbpedia infobox matching weight: 16.67
annotated source: links to American Football Player
annotated property: relatedMatch
annotated target: years

links to Congressman
sub property of: person
comment: Relazione tra Military Person e Congressman @it
related match: after
range: congressman
domain: military person
comment: Relation between Military Person and Congressman
type: ObjectProperty
type: NamedIndividual
related match: alongside
related match: before

links to Space Shuttle
domain: military person
range: space shuttle
sub property of: mean of transportation
comment: Relation between Military Person and Space Shuttle
type: ObjectProperty
comment: Relazione tra Military Person e Space Shuttle @it

links to Hockey Team
type: ObjectProperty
comment: Relazione tra Military Person e Hockey Team @it
range: hockey team
sub property of: organização
domain: military person
comment: Relation between Military Person and Hockey Team

place
type: ObjectProperty
label: περιοχή @el
label: lieu @fr
label: lugar @pt

links to Island
related match: commands
related match: placeOfDeath
domain: military person
type: NamedIndividual
comment: Relation between Military Person and Island
type: ObjectProperty
related match: battles
range: island
sub property of: place
comment: Relazione tra Military Person e Island @it

links to Model
sub property of: person
type: ObjectProperty
range: model
domain: military person
comment: Relazione tra Military Person e Model @it
comment: Relation between Military Person and Model

Axiom
dbpedia infobox matching weight: 60.0
annotated source: links to Airline
annotated target: commands
annotated property: relatedMatch

links to Band
type: ObjectProperty
range: Band
comment: Relation between Military Person and Band
domain: military person
sub property of: organização
comment: Relazione tra Military Person e Band @it

infrastructure
type: ObjectProperty

links to Comics Character
sub property of: person
type: ObjectProperty
comment: Relation between Military Person and Comics Character
range: comics character
comment: Relazione tra Military Person e Comics Character @it
domain: military person

Axiom
dbpedia infobox matching weight: 50.0
annotated property: relatedMatch
annotated source: links to British Royalty
annotated target: after

basketball league
label: ligue de basketball @fr
type: Class

mountain
type: Class
label: montagne @fr
label: Βουνό @el

criminal
type: Class
label: criminel @fr

space shuttle
label: navette spatiale @fr
type: Class

links to Conifer
comment: Relation between Military Person and Conifer
range: conifer
type: ObjectProperty
domain: military person
comment: Relazione tra Military Person e Conifer @it
sub property of: species

links to Basketball Player
type: ObjectProperty
comment: Relation between Military Person and Basketball Player
sub property of: person
related match: years
type: NamedIndividual
comment: Relazione tra Military Person e Basketball Player @it
domain: military person
related match: after
range: basketball player

senator
type: Class
label: sénateur @fr

saint
type: Class

Axiom
dbpedia infobox matching weight: 100.0
annotated property: relatedMatch
annotated target: after
annotated source: links to Judge

valley
type: Class
label: vallée @fr

comedian
label: comédien @fr
type: Class

song
type: Class
label: chanson @fr

links to Tennis Player
sub property of: person
type: ObjectProperty
comment: Relation between Military Person and Tennis Player
comment: Relazione tra Military Person e Tennis Player @it
domain: military person
range: tennis player

links to Ski Area
comment: Relation between Military Person and Ski Area
sub property of: place
domain: military person
comment: Relazione tra Military Person e Ski Area @it
type: ObjectProperty
range: ski area

Axiom
dbpedia infobox matching weight: 100.0
annotated target: laterwork
annotated property: relatedMatch
annotated source: links to American Football League

Playboy Playmate
type: Class
label: playmate pour Playboy @fr

convention
type: Class
label: congrès @fr

links to Bird
type: ObjectProperty
comment: Relazione tra Military Person e Bird @it
sub property of: species
range: bird
domain: military person
comment: Relation between Military Person and Bird

book
type: Class
label: livre @fr
label: βιβλίο @el
label: llibre @ca
label: książka @pl

links to Park
sub property of: place
range: park
type: ObjectProperty
domain: military person
comment: Relation between Military Person and Park
comment: Relazione tra Military Person e Park @it

device
label: appareil @fr
type: ObjectProperty

links to Ice Hockey League
sub property of: organização
comment: Relazione tra Military Person e Ice Hockey League @it
comment: Relation between Military Person and Ice Hockey League
range: ice hockey league
type: ObjectProperty
domain: military person

shopping mall
label: centre commercial @fr
type: Class

links to Weapon
comment: Relation between Military Person and Weapon
domain: military person
comment: Relazione tra Military Person e Weapon @it
type: ObjectProperty
sub property of: device
range: weapon

links to Space Mission
comment: Relazione tra Military Person e Space Mission @it
comment: Relation between Military Person and Space Mission
sub property of: event
domain: military person
type: ObjectProperty
range: space mission

bacteria
label: bactérie @fr
type: Class

ski area
label: domaine skiable @fr
type: Class

links to Radio Station
domain: military person
range: radio station
comment: Relation between Military Person and Radio Station
comment: Relazione tra Military Person e Radio Station @it
sub property of: organização
type: ObjectProperty

space station
label: station spatiale @fr
type: Class

non-profit organisation
label: organisation à but non lucratif @fr
type: Class

canadian football league
type: Class

links to Cricketer
sub property of: person
comment: Relation between Military Person and Cricketer
domain: military person
range: cricketer
related match: before
related match: after
type: NamedIndividual
type: ObjectProperty
comment: Relazione tra Military Person e Cricketer @it

links to Member Of Parliament
related match: after
type: NamedIndividual
comment: Relazione tra Military Person e Member Of Parliament @it
range: member of parliament
sub property of: person
comment: Relation between Military Person and Member Of Parliament
type: ObjectProperty
domain: military person

links to Figure Skater
type: ObjectProperty
comment: Relation between Military Person and Figure Skater
sub property of: person
comment: Relazione tra Military Person e Figure Skater @it
domain: military person
range: figure skater

mollusca
type: Class
label: mollusque @fr

links to Architect
comment: Relation between Military Person and Architect
domain: military person
range: architect
comment: Relazione tra Military Person e Architect @it
sub property of: person
type: ObjectProperty

Axiom
dbpedia infobox matching weight: 50.0
annotated property: relatedMatch
annotated target: laterwork
annotated source: links to School

weapon
label: arme @fr
type: Class

drug
type: Class
label: médicament @fr
type: ObjectProperty

links to College
type: NamedIndividual
related match: awards
comment: Relazione tra Military Person e College @it
comment: Relation between Military Person and College
type: ObjectProperty
sub property of: organização
range: college
domain: military person

links to Soccer League
domain: military person
comment: Relation between Military Person and Soccer League
type: ObjectProperty
sub property of: organização
comment: Relazione tra Military Person e Soccer League @it
range: soccer league

links to World Heritage Site
domain: military person
range: World Heritage Site
type: ObjectProperty
sub property of: place
comment: Relation between Military Person and World Heritage Site
comment: Relazione tra Military Person e World Heritage Site @it

Axiom
dbpedia infobox matching weight: 5.56
annotated source: links to British Royalty
annotated property: relatedMatch
annotated target: allegiance

magazine
label: περιοδικό @el
type: Class

links to Gaelic Games Player
sub property of: person
comment: Relation between Military Person and Gaelic Games Player
domain: military person
comment: Relazione tra Military Person e Gaelic Games Player @it
type: ObjectProperty
range: Gaelic games player

links to Ethnic Group
related match: allegiance
type: NamedIndividual
domain: military person
type: ObjectProperty
range: ethnic group
sub property of: ethnic group
comment: Relation between Military Person and Ethnic Group
comment: Relazione tra Military Person e Ethnic Group @it

links to Boxer
type: ObjectProperty
range: boxer
comment: Relation between Military Person and Boxer
sub property of: person
comment: Relazione tra Military Person e Boxer @it
domain: military person

links to College Coach
comment: Relation between Military Person and College Coach
type: ObjectProperty
range: college coach
comment: Relazione tra Military Person e College Coach @it
domain: military person
sub property of: person

canal
type: Class

military person
type: Class
label: militaire @fr

philosopher
type: Class
label: philosophe @fr

award
type: ObjectProperty
label: récompense @fr
type: Class

links to Baseball League
type: ObjectProperty
comment: Relation between Military Person and Baseball League
domain: military person
range: baseball league
sub property of: organização
comment: Relazione tra Military Person e Baseball League @it

locomotive
type: Class

links to Game
type: ObjectProperty
domain: military person
range: game
comment: Relation between Military Person and Game
comment: Relazione tra Military Person e Game @it
sub property of: activity

college
type: Class

anatomical structure
type: ObjectProperty
label: structure anatomique @fr

sport
type: Class

links to Currency
sub property of: currency
comment: Relation between Military Person and Currency
type: ObjectProperty
range: currency
comment: Relazione tra Military Person e Currency @it
domain: military person

cricketer
label: joueur de cricket @fr
type: Class

links to Reptile
type: ObjectProperty
comment: Relation between Military Person and Reptile
sub property of: species
range: reptile
comment: Relazione tra Military Person e Reptile @it
domain: military person

single
type: Class

links to Stadium
comment: Relation between Military Person and Stadium
type: ObjectProperty
sub property of: place
domain: military person
range: stadium
comment: Relazione tra Military Person e Stadium @it

Band
label: banda @pt
label: Musikgruppe @de
type: Class
label: groupe de musique @fr

links to Mayor
sub property of: person
range: mayor
comment: Relation between Military Person and Mayor
type: ObjectProperty
comment: Relazione tra Military Person e Mayor @it
domain: military person

Axiom
dbpedia infobox matching weight: 100.0
annotated property: relatedMatch
annotated target: allegiance
annotated source: links to Ethnic Group

links to Mountain
type: ObjectProperty
comment: Relazione tra Military Person e Mountain @it
domain: military person
comment: Relation between Military Person and Mountain
range: mountain
sub property of: place

ethnic group
type: Class
type: ObjectProperty
label: groupe ethnique @fr

Axiom
dbpedia infobox matching weight: 100.0
annotated source: links to Monarch
annotated target: regent
annotated property: relatedMatch

links to Artery
type: ObjectProperty
domain: military person
sub property of: anatomical structure
comment: Relation between Military Person and Artery
comment: Relazione tra Military Person e Artery @it
range: artery

artery
label: Arterie @de
type: Class
label: artère @fr

links to Basketball Team
range: basketball team
comment: Relation between Military Person and Basketball Team
domain: military person
comment: Relazione tra Military Person e Basketball Team @it
sub property of: organização
type: ObjectProperty

links to Drug
domain: military person
type: ObjectProperty
comment: Relazione tra Military Person e Drug @it
range: drug
sub property of: drug
comment: Relation between Military Person and Drug

links to Ice Hockey Player
range: ice hockey player
sub property of: person
comment: Relation between Military Person and Ice Hockey Player
comment: Relazione tra Military Person e Ice Hockey Player @it
type: ObjectProperty
domain: military person

hotel
label: hôtel @fr
type: Class

Axiom
dbpedia infobox matching weight: 53.33
annotated source: links to Prime Minister
annotated property: relatedMatch
annotated target: after

college coach
type: Class
label: entraîneur universitaire @fr

television episode
label: épisode télévisé @fr
type: Class

Axiom
dbpedia infobox matching weight: 4.0
annotated source: links to Governor
annotated property: relatedMatch
annotated target: alongside

muscle
type: Class

village
type: Class
label: χωριό @el

ice hockey league
type: Class
label: ligue d'hockey sur glace @fr

links to Song
domain: military person
comment: Relation between Military Person and Song
sub property of: work
type: ObjectProperty
range: song
comment: Relazione tra Military Person e Song @it

Axiom
dbpedia infobox matching weight: 12.5
annotated target: alongside
annotated property: relatedMatch
annotated source: links to Senator

soccer club
label: club de football @fr
type: Class

links to Olympic Result
comment: Relation between Military Person and Olympic Result
sub property of: olympic result
comment: Relazione tra Military Person e Olympic Result @it
type: ObjectProperty
range: olympic result
domain: military person

links to Disease
sub property of: disease
type: ObjectProperty
comment: Relation between Military Person and Disease
comment: Relazione tra Military Person e Disease @it
range: disease
domain: military person

links to Amphibian
domain: military person
comment: Relation between Military Person and Amphibian
sub property of: species
type: ObjectProperty
comment: Relazione tra Military Person e Amphibian @it
range: amphibian

historic building
label: bâtiment historique @fr
type: Class

baseball player
type: Class
label: joueur de baseball @fr

grape
label: raisin @fr
type: Class

website
type: ObjectProperty
type: Class
label: site web @fr
label: Ιστότοπος @el

links to Historic Place
comment: Relazione tra Military Person e Historic Place @it
related match: placeofburial
related match: commands
type: ObjectProperty
sub property of: place
related match: unit
range: historic place
type: NamedIndividual
related match: data
comment: Relation between Military Person and Historic Place
domain: military person
related match: laterwork

Axiom
dbpedia infobox matching weight: 100.0
annotated property: relatedMatch
annotated source: links to Museum
annotated target: laterwork

links to Soccer Club
comment: Relazione tra Military Person e Soccer Club @it
type: ObjectProperty
sub property of: organização
range: soccer club
comment: Relation between Military Person and Soccer Club
domain: military person

links to River
comment: Relazione tra Military Person e River @it
sub property of: place
type: ObjectProperty
comment: Relation between Military Person and River
range: river
domain: military person

basketball player
label: joueur de basketball @fr
type: Class

adult actor
label: erwachsener Schauspieler @de
type: Class
label: acteur adulte @fr

Axiom
dbpedia infobox matching weight: 5.56
annotated target: unit
annotated source: links to Airport
annotated property: relatedMatch

Axiom
dbpedia infobox matching weight: 50.0
annotated source: links to Basketball Player
annotated property: relatedMatch
annotated target: after

links to Skyscraper
comment: Relazione tra Military Person e Skyscraper @it
sub property of: place
range: skyscraper
type: ObjectProperty
domain: military person
comment: Relation between Military Person and Skyscraper

links to Video Game
comment: Relazione tra Military Person e Video Game @it
comment: Relation between Military Person and Video Game
sub property of: work
range: video game
type: ObjectProperty
domain: military person

ice hockey player
type: Class
label: joueur de hockey sur glace @fr

Axiom
dbpedia infobox matching weight: 100.0
annotated property: relatedMatch
annotated target: before
annotated source: links to Ambassador

links to Single
comment: Relation between Military Person and Single
domain: military person
range: single
sub property of: work
type: ObjectProperty
comment: Relazione tra Military Person e Single @it

links to Automobile
sub property of: mean of transportation
comment: Relazione tra Military Person e Automobile @it
comment: Relation between Military Person and Automobile
type: ObjectProperty
domain: military person
range: automobile

links to Basketball League
sub property of: organização
comment: Relazione tra Military Person e Basketball League @it
domain: military person
range: basketball league
type: ObjectProperty
comment: Relation between Military Person and Basketball League

links to Saint
type: ObjectProperty
comment: Relation between Military Person and Saint
comment: Relazione tra Military Person e Saint @it
domain: military person
sub property of: person
range: saint

Christian Bishop
label: évêque chrétien @fr
type: Class

mountain range
type: Class
label: chaîne de montagne @fr

links to Lunar Crater
comment: Relazione tra Military Person e Lunar Crater @it
comment: Relation between Military Person and Lunar Crater
sub property of: place
domain: military person
range: lunar crater
type: ObjectProperty

links to Lake
comment: Relazione tra Military Person e Lake @it
type: ObjectProperty
comment: Relation between Military Person and Lake
range: lake
sub property of: place
domain: military person

beverage
type: ObjectProperty
type: Class
label: boisson @fr

links to Lighthouse
range: lighthouse
comment: Relazione tra Military Person e Lighthouse @it
comment: Relation between Military Person and Lighthouse
type: ObjectProperty
domain: military person
sub property of: place

links to Website
comment: Relation between Military Person and Website
range: website
sub property of: website
comment: Relazione tra Military Person e Website @it
type: ObjectProperty
domain: military person

links to Hotel
domain: military person
sub property of: place
range: hotel
comment: Relation between Military Person and Hotel
type: ObjectProperty
comment: Relazione tra Military Person e Hotel @it

planet
type: ObjectProperty
label: planète @fr
type: Class

links to Film
related match: laterwork
type: NamedIndividual
range: film
domain: military person
comment: Relazione tra Military Person e Film @it
comment: Relation between Military Person and Film
type: ObjectProperty
sub property of: work

links to Canadian Football League
type: ObjectProperty
range: canadian football league
domain: military person
comment: Relazione tra Military Person e Canadian Football League @it
comment: Relation between Military Person and Canadian Football League
sub property of: organização

scientist
label: Wissenschaftler @de
type: Class
label: scientifique @fr

links to Film Festival
range: film festival
type: ObjectProperty
comment: Relation between Military Person and Film Festival
comment: Relazione tra Military Person e Film Festival @it
sub property of: event
domain: military person

Axiom
dbpedia infobox matching weight: 28.0
annotated source: links to Governor
annotated target: before
annotated property: relatedMatch

links to Olympics
domain: military person
sub property of: event
comment: Relation between Military Person and Olympics
comment: Relazione tra Military Person e Olympics @it
range: olympics
type: ObjectProperty

Axiom
dbpedia infobox matching weight: 100.0
annotated property: relatedMatch
annotated target: awards
annotated source: links to College

olympics
type: Class
label: Jeux Olympiques @fr

links to Governor
type: NamedIndividual
related match: before
related match: alongside
comment: Relation between Military Person and Governor
comment: Relazione tra Military Person e Governor @it
domain: military person
related match: after
range: governor
type: ObjectProperty
sub property of: person

links to Valley
domain: military person
comment: Relation between Military Person and Valley
type: ObjectProperty
range: valley
comment: Relazione tra Military Person e Valley @it
sub property of: place

organização
type: ObjectProperty
label: organisation
label: Organisation @de

baseball league
label: ligue de baseball @fr
type: Class

Axiom
dbpedia infobox matching weight: 100.0
annotated source: links to Rugby Player
annotated property: relatedMatch
annotated target: after

bridge
type: Class
label: pont @fr

links to Criminal
range: criminal
domain: military person
comment: Relazione tra Military Person e Criminal @it
sub property of: person
comment: Relation between Military Person and Criminal
type: ObjectProperty

links to School
type: NamedIndividual
sub property of: organização
domain: military person
comment: Relation between Military Person and School
type: ObjectProperty
comment: Relazione tra Military Person e School @it
related match: coachingteams
related match: laterwork
range: school

links to Pope
sub property of: person
comment: Relazione tra Military Person e Pope @it
domain: military person
type: ObjectProperty
comment: Relation between Military Person and Pope
range: pope

links to Canadian Football Team
type: ObjectProperty
sub property of: organização
range: canadian football team
comment: Relation between Military Person and Canadian Football Team
domain: military person
comment: Relazione tra Military Person e Canadian Football Team @it

broadcast
type: Class
label: Émission de télévision @fr

mammal
label: mammifère @fr
type: Class

links to Mollusca
domain: military person
comment: Relazione tra Military Person e Mollusca @it
sub property of: species
comment: Relation between Military Person and Mollusca
range: mollusca
type: ObjectProperty

links to Television Show
sub property of: work
type: ObjectProperty
comment: Relation between Military Person and Television Show
comment: Relazione tra Military Person e Television Show @it
domain: military person
range: television show

island
label: île @fr
label: νησί @el
type: Class

comics character
type: Class
label: personnage de bandes dessinées @fr

links to Ambassador
domain: military person
range: ambassador
comment: Relazione tra Military Person e Ambassador @it
type: ObjectProperty
comment: Relation between Military Person and Ambassador
sub property of: person
related match: before
type: NamedIndividual

event
type: ObjectProperty
label: évènement @fr

Formula One racer
label: pilote de formule 1 @fr
type: Class

skyscraper
type: Class
label: gratte-ciel @fr

Axiom
dbpedia infobox matching weight: 68.0
annotated target: after
annotated source: links to Governor
annotated property: relatedMatch

radio station
type: Class
label: station de radio @fr

links to Baseball Player
comment: Relazione tra Military Person e Baseball Player @it
domain: military person
sub property of: person
comment: Relation between Military Person and Baseball Player
type: ObjectProperty
range: baseball player

member of parliament
type: Class
label: membre du Parlement @fr

bone
type: Class
label: Knochen @de
label: os @fr

links to Road
type: ObjectProperty
sub property of: infrastructure
range: road
domain: military person
comment: Relation between Military Person and Road
comment: Relazione tra Military Person e Road @it

Axiom
dbpedia infobox matching weight: 50.0
annotated property: relatedMatch
annotated source: links to School
annotated target: coachingteams

links to Mammal
comment: Relation between Military Person and Mammal
comment: Relazione tra Military Person e Mammal @it
type: ObjectProperty
domain: military person
range: mammal
sub property of: species

links to Supreme Court Of The United States Case
range: Supreme Court of the United States case
type: ObjectProperty
sub property of: Legal Case
comment: Relazione tra Military Person e Supreme Court Of The United States Case @it
comment: Relation between Military Person and Supreme Court Of The United States Case
domain: military person

conifer
label: conifères @fr
type: Class

Axiom
dbpedia infobox matching weight: 25.0
annotated target: commands
annotated property: relatedMatch
annotated source: links to Island

airport
type: Class
label: Flughafen @de
label: aéroport @fr