links to Mammal
range: mammal
sub property of: species
comment: Relation between Military Unit and Mammal
comment: Relazione tra Military Unit e Mammal @it
domain: military unit
type: ObjectProperty

links to Fungus
range: fungus
domain: military unit
type: ObjectProperty
sub property of: species
comment: Relazione tra Military Unit e Fungus @it
comment: Relation between Military Unit and Fungus

links to World Heritage Site
domain: military unit
comment: Relazione tra Military Unit e World Heritage Site @it
sub property of: place
comment: Relation between Military Unit and World Heritage Site
range: World Heritage Site
type: ObjectProperty
type: NamedIndividual
related match: battleHonours

links to College Coach
type: ObjectProperty
comment: Relation between Military Unit and College Coach
domain: military unit
range: college coach
comment: Relazione tra Military Unit e College Coach @it
sub property of: person

television show
label: émission de télévision @fr
type: Class

rocket
type: Class
label: fusée @fr

disease
label: maladie @fr
type: Class
type: ObjectProperty

Axiom
dbpedia infobox matching weight: 64.29
annotated target: commander
annotated property: relatedMatch
annotated source: links to Governor

Axiom
dbpedia infobox matching weight: 6.67
annotated source: links to British Royalty
annotated property: relatedMatch
annotated target: commander

automobile
type: Class

colour
type: Class
label: couleur @fr
label: χρώμα @el
type: ObjectProperty

Election
label: élection @fr
type: Class

Axiom
dbpedia infobox matching weight: 7.14
annotated property: relatedMatch
annotated target: colonelOfTheRegiment
annotated source: links to Governor

links to Basketball Team
range: basketball team
sub property of: organização
type: ObjectProperty
domain: military unit
comment: Relation between Military Unit and Basketball Team
comment: Relazione tra Military Unit e Basketball Team @it

mean of transportation
type: ObjectProperty
label: moyen de transport @fr

american football player
label: joueur de football américain @fr
type: Class

Legal Case
type: ObjectProperty
label: cas juridique @fr

links to Baseball Player
domain: military unit
comment: Relation between Military Unit and Baseball Player
range: baseball player
comment: Relazione tra Military Unit e Baseball Player @it
sub property of: person
type: ObjectProperty

stadium
type: Class
label: stade @fr

MilitaryUnit.owl
imports: dbpediainfoboxmatchingweight.owl
has author: Andrea Giovanni Nuzzolese
has intent: To represent the encyclopedic knowledge expressed by an object typed as MilitaryUnit
extracted from: dbpedia.org
has author: Valentina Presutti
imports: cpannotationschema.owl
type: Ontology
extracted from: en.wikipedia.org
has author: Aldo Gangemi
comment: MilitaryUnit Encyclopedic Knowledge Pattern

soccer league
type: Class
label: ligue de football @fr

astronaut
label: astronaute @fr
label: Astronaut @de
type: Class

links to Disease
domain: military unit
sub property of: disease
comment: Relazione tra Military Unit e Disease @it
range: disease
type: ObjectProperty
comment: Relation between Military Unit and Disease

links to School
domain: military unit
sub property of: organização
range: school
type: ObjectProperty
comment: Relation between Military Unit and School
comment: Relazione tra Military Unit e School @it

links to Single
range: single
comment: Relation between Military Unit and Single
domain: military unit
sub property of: work
comment: Relazione tra Military Unit e Single @it
type: ObjectProperty

Axiom
dbpedia infobox matching weight: 100.0
annotated target: notableCommanders
annotated property: relatedMatch
annotated source: links to Senator

Axiom
dbpedia infobox matching weight: 28.57
annotated property: relatedMatch
annotated source: links to Governor
annotated target: notableCommanders

wrestler
type: Class
label: lutteur @fr

links to Office Holder
type: NamedIndividual
range: office holder
related match: commander
sub property of: person
comment: Relazione tra Military Unit e Office Holder @it
related match: notableCommanders
type: ObjectProperty
comment: Relation between Military Unit and Office Holder
domain: military unit

mayor
label: maire @fr
type: Class

amphibian
type: Class
label: amphibien @fr

links to Drug
sub property of: drug
domain: military unit
range: drug
type: ObjectProperty
comment: Relation between Military Unit and Drug
comment: Relazione tra Military Unit e Drug @it

pope
label: pape @fr
type: Class

species
label: espèce @fr
type: ObjectProperty

Axiom
dbpedia infobox matching weight: 100.0
annotated source: links to Stadium
annotated property: relatedMatch
annotated target: battles

newspaper
type: Class
label: journal @fr

links to Cricketer
comment: Relazione tra Military Unit e Cricketer @it
range: cricketer
comment: Relation between Military Unit and Cricketer
domain: military unit
type: ObjectProperty
sub property of: person

links to Historic Building
comment: Relazione tra Military Unit e Historic Building @it
domain: military unit
range: historic building
type: ObjectProperty
sub property of: place
comment: Relation between Military Unit and Historic Building

protected area
type: Class
label: προστατευμένη περιοχή @el
label: aire protégée @fr

game
label: jeu @fr
type: Class

road
type: Class
label: route @fr

links to Television Episode
type: ObjectProperty
comment: Relazione tra Military Unit e Television Episode @it
sub property of: work
comment: Relation between Military Unit and Television Episode
domain: military unit
range: television episode

boxer
label: boxeur @fr
type: Class

judge
label: juge @fr
type: Class

Axiom
dbpedia infobox matching weight: 61.02
annotated property: relatedMatch
annotated source: links to Office Holder
annotated target: commander

World Heritage Site
type: Class
label: site du patrimoine mondial @fr

language
type: ObjectProperty
label: langage @fr
type: Class

station
type: Class

Axiom
dbpedia infobox matching weight: 100.0
annotated property: relatedMatch
annotated target: garrison
annotated source: links to Village

lake
type: Class
label: lac @fr

links to Album
comment: Relation between Military Unit and Album
sub property of: work
domain: military unit
range: album
type: ObjectProperty
comment: Relazione tra Military Unit e Album @it

links to Conifer
comment: Relation between Military Unit and Conifer
range: conifer
domain: military unit
type: ObjectProperty
comment: Relazione tra Military Unit e Conifer @it
sub property of: species

links to Christian Bishop
range: Christian Bishop
domain: military unit
type: ObjectProperty
comment: Relation between Military Unit and Christian Bishop
sub property of: person
comment: Relazione tra Military Unit e Christian Bishop @it

arachnid
type: Class
label: arachnides @fr

links to Rugby Player
comment: Relazione tra Military Unit e Rugby Player @it
range: rugby player
sub property of: person
comment: Relation between Military Unit and Rugby Player
type: ObjectProperty
domain: military unit

links to Grape
range: grape
domain: military unit
type: ObjectProperty
comment: Relazione tra Military Unit e Grape @it
sub property of: species
comment: Relation between Military Unit and Grape

links to Music Festival
type: ObjectProperty
range: music festival
sub property of: event
comment: Relazione tra Military Unit e Music Festival @it
comment: Relation between Military Unit and Music Festival
domain: military unit

governor
label: gouverneur @fr
type: Class

links to Continent
type: ObjectProperty
sub property of: place
range: continent
comment: Relazione tra Military Unit e Continent @it
comment: Relation between Military Unit and Continent
domain: military unit

work
type: ObjectProperty
label: travail @fr
label: obra @pt

links to Book
domain: military unit
sub property of: work
type: ObjectProperty
range: book
comment: Relazione tra Military Unit e Book @it
comment: Relation between Military Unit and Book

river
label: rivière @fr
type: Class

Axiom
dbpedia infobox matching weight: 33.33
annotated source: links to Protected Area
annotated target: battleHonours
annotated property: relatedMatch

links to Soccer League
comment: Relazione tra Military Unit e Soccer League @it
range: soccer league
comment: Relation between Military Unit and Soccer League
type: ObjectProperty
sub property of: organização
domain: military unit

school
type: Class
label: école @fr

museum
type: Class
label: musée @fr

ship
label: navire @fr
type: Class

fish
label: poisson @fr
type: Class

tennis player
label: joueur de tennis @fr
type: Class

video game
label: jeux vidéo @fr
type: Class

trade union
label: syndicat professionnel @fr
type: Class

links to Grand Prix
comment: Relazione tra Military Unit e Grand Prix @it
range: Grand Prix
comment: Relation between Military Unit and Grand Prix
domain: military unit
sub property of: event
type: ObjectProperty

Axiom
dbpedia infobox matching weight: 100.0
annotated source: links to Colour
annotated target: colors
annotated property: relatedMatch

links to Trade Union
type: ObjectProperty
comment: Relation between Military Unit and Trade Union
sub property of: organização
comment: Relazione tra Military Unit e Trade Union @it
range: trade union
domain: military unit

Axiom
dbpedia infobox matching weight: 80.0
annotated target: battles
annotated property: relatedMatch
annotated source: links to River

currency
type: ObjectProperty
type: Class
label: devise @fr

links to Musical Artist
range: musical artist
sub property of: person
domain: military unit
comment: Relation between Military Unit and Musical Artist
comment: Relazione tra Military Unit e Musical Artist @it
type: ObjectProperty

British royalty
type: Class
label: royauté Britannique @fr

prime minister
label: premier ministre @fr
type: Class

historic place
type: Class
label: site historique @fr

links to Film
sub property of: work
range: film
type: ObjectProperty
comment: Relazione tra Military Unit e Film @it
domain: military unit
comment: Relation between Military Unit and Film

race
type: Class
label: course @fr

hospital
label: hôpital @fr
type: Class

links to Hospital
domain: military unit
type: ObjectProperty
comment: Relazione tra Military Unit e Hospital @it
comment: Relation between Military Unit and Hospital
range: hospital
sub property of: place

links to Philosopher
comment: Relazione tra Military Unit e Philosopher @it
sub property of: person
domain: military unit
range: philosopher
comment: Relation between Military Unit and Philosopher
type: ObjectProperty

links to Ice Hockey Player
domain: military unit
comment: Relation between Military Unit and Ice Hockey Player
comment: Relazione tra Military Unit e Ice Hockey Player @it
sub property of: person
type: ObjectProperty
range: ice hockey player

links to Golf Player
sub property of: person
comment: Relazione tra Military Unit e Golf Player @it
comment: Relation between Military Unit and Golf Player
range: golf player
type: ObjectProperty
domain: military unit

links to Planet
range: planet
domain: military unit
sub property of: planet
comment: Relation between Military Unit and Planet
comment: Relazione tra Military Unit e Planet @it
type: ObjectProperty

continent
label: ήπειρος @el
type: Class

links to Space Station
comment: Relazione tra Military Unit e Space Station @it
sub property of: mean of transportation
range: space station
type: ObjectProperty
domain: military unit
comment: Relation between Military Unit and Space Station

links to Valley
comment: Relation between Military Unit and Valley
comment: Relazione tra Military Unit e Valley @it
type: ObjectProperty
domain: military unit
sub property of: place
range: valley

Axiom
dbpedia infobox matching weight: 100.0
annotated source: links to World Heritage Site
annotated property: relatedMatch
annotated target: battleHonours

album
type: Class
label: Album @de

president
label: président @fr
type: Class

links to University
type: ObjectProperty
sub property of: organização
range: university
comment: Relazione tra Military Unit e University @it
domain: military unit
comment: Relation between Military Unit and University

person
label: personne @fr
label: pessoa @pt
type: ObjectProperty
label: Person @de

military unit
label: unité militaire @fr
type: Class

soccer manager
label: entraîneur de football @fr
type: Class

basketball team
type: Class

links to Station
type: ObjectProperty
comment: Relation between Military Unit and Station
comment: Relazione tra Military Unit e Station @it
sub property of: place
range: station
domain: military unit

links to Video Game
domain: military unit
range: video game
type: ObjectProperty
comment: Relazione tra Military Unit e Video Game @it
comment: Relation between Military Unit and Video Game
sub property of: work

Axiom
dbpedia infobox matching weight: 100.0
annotated property: relatedMatch
annotated target: notableCommanders
annotated source: links to Prime Minister

music genre
label: genre musical @fr
type: ObjectProperty
label: género musical @pt
type: Class

Axiom
dbpedia infobox matching weight: 66.67
annotated target: battles
annotated property: relatedMatch
annotated source: links to Protected Area

links to Non- Profit Organisation
comment: Relazione tra Military Unit e Non- Profit Organisation @it
comment: Relation between Military Unit and Non- Profit Organisation
range: non-profit organisation
sub property of: organização
domain: military unit
type: ObjectProperty

writer
type: Class
label: écrivain @fr

architect
type: Class
label: architecte @fr

ambassador
label: ambassadeur @fr
type: Class

film festival
label: festival du film @fr
type: Class

Axiom
dbpedia infobox matching weight: 60.0
annotated target: ceremonialChief
annotated property: relatedMatch
annotated source: links to British Royalty

Grand Prix
type: Class
label: grand prix @fr

Axiom
dbpedia infobox matching weight: 6.67
annotated property: relatedMatch
annotated source: links to British Royalty
annotated target: colonelOfTheRegiment

lighthouse
type: Class
label: phare @fr

links to Village
type: NamedIndividual
related match: garrison
comment: Relation between Military Unit and Village
type: ObjectProperty
sub property of: place
comment: Relazione tra Military Unit e Village @it
domain: military unit
range: village

chancellor
label: chancelier @fr
type: Class

comics creator
type: Class
label: créateur de bandes dessinées @fr

Axiom
dbpedia infobox matching weight: 5.26
annotated property: relatedMatch
annotated target: notableMembers
annotated source: links to President

links to Mollusca
comment: Relazione tra Military Unit e Mollusca @it
type: ObjectProperty
sub property of: species
domain: military unit
comment: Relation between Military Unit and Mollusca
range: mollusca

links to Chancellor
sub property of: person
domain: military unit
comment: Relation between Military Unit and Chancellor
range: chancellor
comment: Relazione tra Military Unit e Chancellor @it
type: ObjectProperty

hockey team
label: équipe de hockey @fr
type: Class

links to Wrestler
comment: Relation between Military Unit and Wrestler
type: ObjectProperty
sub property of: person
domain: military unit
range: wrestler
comment: Relazione tra Military Unit e Wrestler @it

soccer player
type: Class
label: joueur de football @fr

links to Pope
range: pope
sub property of: person
comment: Relation between Military Unit and Pope
domain: military unit
comment: Relazione tra Military Unit e Pope @it
type: ObjectProperty

reptile
type: Class

legislature
label: pouvoir législatif @fr
type: Class

airline
label: compagnie aérienne @fr
type: Class

links to Lighthouse
range: lighthouse
type: ObjectProperty
comment: Relazione tra Military Unit e Lighthouse @it
sub property of: place
domain: military unit
comment: Relation between Military Unit and Lighthouse

monarch
type: Class
label: monarque @fr

congressman
label: membre du Congrès @fr
type: Class

links to Currency
comment: Relation between Military Unit and Currency
sub property of: currency
range: currency
comment: Relazione tra Military Unit e Currency @it
type: ObjectProperty
domain: military unit

Axiom
dbpedia infobox matching weight: 26.67
annotated property: relatedMatch
annotated source: links to British Royalty
annotated target: notableCommanders

links to Language
comment: Relazione tra Military Unit e Language @it
range: language
sub property of: language
type: ObjectProperty
domain: military unit
comment: Relation between Military Unit and Language

golf player
label: golfeur @fr
type: Class

links to American Football Player
comment: Relation between Military Unit and American Football Player
domain: military unit
comment: Relazione tra Military Unit e American Football Player @it
type: ObjectProperty
sub property of: person
range: american football player

links to Automobile
range: automobile
comment: Relation between Military Unit and Automobile
comment: Relazione tra Military Unit e Automobile @it
domain: military unit
type: ObjectProperty
sub property of: mean of transportation

activity
label: activité @fr
label: Aktivität @de
type: ObjectProperty

nascar driver
label: pilote de la nascar @fr
type: Class

links to Reptile
comment: Relazione tra Military Unit e Reptile @it
domain: military unit
sub property of: species
comment: Relation between Military Unit and Reptile
type: ObjectProperty
range: reptile

journalist
type: Class
label: journaliste @fr

space mission
type: Class
label: διαστημική αποστολή @el
label: mission spatiale @fr

links to Museum
sub property of: place
range: museum
comment: Relazione tra Military Unit e Museum @it
type: ObjectProperty
domain: military unit
comment: Relation between Military Unit and Museum

links to Ski Area
domain: military unit
comment: Relation between Military Unit and Ski Area
comment: Relazione tra Military Unit e Ski Area @it
type: ObjectProperty
range: ski area
sub property of: place

links to Space Shuttle
range: space shuttle
sub property of: mean of transportation
comment: Relazione tra Military Unit e Space Shuttle @it
type: ObjectProperty
comment: Relation between Military Unit and Space Shuttle
domain: military unit

insect
type: Class
label: insecte @fr

film
type: Class
label: ταινία @el

Axiom
dbpedia infobox matching weight: 89.47
annotated target: notableCommanders
annotated property: relatedMatch
annotated source: links to President

links to Game
domain: military unit
range: game
comment: Relazione tra Military Unit e Game @it
type: ObjectProperty
sub property of: activity
comment: Relation between Military Unit and Game

american football team
label: équipe américaine de football américain @fr
type: Class

links to Scientist
comment: Relazione tra Military Unit e Scientist @it
sub property of: person
domain: military unit
comment: Relation between Military Unit and Scientist
type: ObjectProperty
range: scientist

links to Member Of Parliament
sub property of: person
domain: military unit
comment: Relazione tra Military Unit e Member Of Parliament @it
type: ObjectProperty
range: member of parliament
comment: Relation between Military Unit and Member Of Parliament

Supreme Court of the United States case
label: cas juridique de la Cour suprême des États-Unis @fr
type: Class

chemical compound
type: Class
type: ObjectProperty
label: produit chimique @fr

bird
type: Class
label: oiseau @fr

links to Amphibian
range: amphibian
comment: Relazione tra Military Unit e Amphibian @it
sub property of: species
domain: military unit
type: ObjectProperty
comment: Relation between Military Unit and Amphibian

Gaelic games player
type: Class
label: joueur de sports gaéliques @fr

links to Award
comment: Relazione tra Military Unit e Award @it
sub property of: award
range: award
type: ObjectProperty
comment: Relation between Military Unit and Award
domain: military unit

Axiom
dbpedia infobox matching weight: 20.0
annotated source: links to River
annotated property: relatedMatch
annotated target: battleHonours

fungus
type: Class
label: fungi @fr

musical artist
label: musicien @fr
type: Class
label: artista musical @pt

fern
label: fougères @fr
type: Class

links to Hockey Team
sub property of: organização
type: ObjectProperty
comment: Relazione tra Military Unit e Hockey Team @it
range: hockey team
comment: Relation between Military Unit and Hockey Team
domain: military unit

links to Airline
range: airline
comment: Relation between Military Unit and Airline
sub property of: organização
type: ObjectProperty
domain: military unit
comment: Relazione tra Military Unit e Airline @it

links to Newspaper
comment: Relation between Military Unit and Newspaper
domain: military unit
type: ObjectProperty
sub property of: work
comment: Relazione tra Military Unit e Newspaper @it
range: newspaper

links to Tennis Player
comment: Relazione tra Military Unit e Tennis Player @it
comment: Relation between Military Unit and Tennis Player
type: ObjectProperty
range: tennis player
sub property of: person
domain: military unit

park
type: Class
label: parc @fr

links to Broadcast
comment: Relation between Military Unit and Broadcast
domain: military unit
comment: Relazione tra Military Unit e Broadcast @it
type: ObjectProperty
sub property of: organização
range: broadcast

links to Saint
comment: Relazione tra Military Unit e Saint @it
domain: military unit
type: ObjectProperty
sub property of: person
range: saint
comment: Relation between Military Unit and Saint

cardinal
type: Class

links to Congressman
comment: Relation between Military Unit and Congressman
domain: military unit
range: congressman
sub property of: person
comment: Relazione tra Military Unit e Congressman @it
type: ObjectProperty

links to Architect
range: architect
type: ObjectProperty
comment: Relation between Military Unit and Architect
comment: Relazione tra Military Unit e Architect @it
domain: military unit
sub property of: person

rugby player
label: joueur de rugby @fr
type: Class

links to Musical
range: musical
comment: Relazione tra Military Unit e Musical @it
sub property of: work
type: ObjectProperty
domain: military unit
comment: Relation between Military Unit and Musical

american football league
type: Class

links to Hotel
comment: Relazione tra Military Unit e Hotel @it
domain: military unit
comment: Relation between Military Unit and Hotel
type: ObjectProperty
sub property of: place
range: hotel
related match: garrison
type: NamedIndividual

links to Space Mission
sub property of: event
range: space mission
type: ObjectProperty
comment: Relation between Military Unit and Space Mission
domain: military unit
comment: Relazione tra Military Unit e Space Mission @it

links to Television Show
comment: Relazione tra Military Unit e Television Show @it
domain: military unit
type: ObjectProperty
sub property of: work
comment: Relation between Military Unit and Television Show
range: television show

musical
type: Class
label: musique @fr

links to Colour
comment: Relation between Military Unit and Colour
range: colour
domain: military unit
type: ObjectProperty
sub property of: colour
comment: Relazione tra Military Unit e Colour @it
related match: colors
type: NamedIndividual

links to Basketball Player
domain: military unit
sub property of: person
comment: Relazione tra Military Unit e Basketball Player @it
comment: Relation between Military Unit and Basketball Player
type: ObjectProperty
range: basketball player

links to Mountain Range
comment: Relazione tra Military Unit e Mountain Range @it
sub property of: place
comment: Relation between Military Unit and Mountain Range
type: ObjectProperty
domain: military unit
range: mountain range

links to Chemical Compound
range: chemical compound
comment: Relazione tra Military Unit e Chemical Compound @it
sub property of: chemical compound
comment: Relation between Military Unit and Chemical Compound
domain: military unit
type: ObjectProperty

links to Senator
type: NamedIndividual
related match: notableCommanders
range: senator
type: ObjectProperty
comment: Relazione tra Military Unit e Senator @it
comment: Relation between Military Unit and Senator
domain: military unit
sub property of: person

place
label: lugar @pt
label: lieu @fr
label: περιοχή @el
type: ObjectProperty

Axiom
dbpedia infobox matching weight: 5.26
annotated property: relatedMatch
annotated target: allegiance
annotated source: links to President

links to Cardinal
domain: military unit
comment: Relazione tra Military Unit e Cardinal @it
comment: Relation between Military Unit and Cardinal
type: ObjectProperty
range: cardinal
sub property of: person

infrastructure
type: ObjectProperty

links to American Football Team
sub property of: organização
comment: Relation between Military Unit and American Football Team
range: american football team
comment: Relazione tra Military Unit e American Football Team @it
domain: military unit
type: ObjectProperty

links to British Royalty
related match: notableCommanders
domain: military unit
related match: colonelOfTheRegiment
related match: ceremonialChief
sub property of: person
type: ObjectProperty
related match: commander
comment: Relation between Military Unit and British Royalty
range: British royalty
comment: Relazione tra Military Unit e British Royalty @it
type: NamedIndividual

links to Bird
comment: Relazione tra Military Unit e Bird @it
sub property of: species
range: bird
type: ObjectProperty
domain: military unit
comment: Relation between Military Unit and Bird

mountain
type: Class
label: montagne @fr
label: Βουνό @el

links to Comics Creator
type: ObjectProperty
domain: military unit
sub property of: person
range: comics creator
comment: Relation between Military Unit and Comics Creator
comment: Relazione tra Military Unit e Comics Creator @it

links to Skyscraper
comment: Relation between Military Unit and Skyscraper
type: ObjectProperty
range: skyscraper
sub property of: place
domain: military unit
comment: Relazione tra Military Unit e Skyscraper @it

criminal
label: criminel @fr
type: Class

space shuttle
label: navette spatiale @fr
type: Class

links to Locomotive
sub property of: mean of transportation
comment: Relazione tra Military Unit e Locomotive @it
range: locomotive
domain: military unit
type: ObjectProperty
comment: Relation between Military Unit and Locomotive

links to Mayor
type: ObjectProperty
sub property of: person
comment: Relazione tra Military Unit e Mayor @it
range: mayor
domain: military unit
comment: Relation between Military Unit and Mayor

links to Rocket
type: ObjectProperty
comment: Relation between Military Unit and Rocket
sub property of: mean of transportation
comment: Relazione tra Military Unit e Rocket @it
range: rocket
domain: military unit

senator
type: Class
label: sénateur @fr

saint
type: Class

links to Baseball League
comment: Relation between Military Unit and Baseball League
sub property of: organização
type: ObjectProperty
range: baseball league
domain: military unit
comment: Relazione tra Military Unit e Baseball League @it

links to Boxer
comment: Relation between Military Unit and Boxer
sub property of: person
comment: Relazione tra Military Unit e Boxer @it
type: ObjectProperty
range: boxer
domain: military unit

valley
type: Class
label: vallée @fr

comedian
type: Class
label: comédien @fr

song
label: chanson @fr
type: Class

green alga
type: Class
label: algue verte @fr

links to Song
comment: Relation between Military Unit and Song
sub property of: work
domain: military unit
type: ObjectProperty
range: song
comment: Relazione tra Military Unit e Song @it

links to Ethnic Group
type: ObjectProperty
domain: military unit
sub property of: ethnic group
comment: Relation between Military Unit and Ethnic Group
comment: Relazione tra Military Unit e Ethnic Group @it
range: ethnic group

links to Judge
domain: military unit
comment: Relation between Military Unit and Judge
range: judge
type: ObjectProperty
comment: Relazione tra Military Unit e Judge @it
sub property of: person

links to Criminal
type: ObjectProperty
sub property of: person
range: criminal
comment: Relazione tra Military Unit e Criminal @it
domain: military unit
comment: Relation between Military Unit and Criminal

book
label: książka @pl
label: llibre @ca
label: βιβλίο @el
label: livre @fr
type: Class

links to Film Festival
comment: Relation between Military Unit and Film Festival
sub property of: event
domain: military unit
type: ObjectProperty
comment: Relazione tra Military Unit e Film Festival @it
range: film festival

links to Ship
type: NamedIndividual
related match: equipment
comment: Relazione tra Military Unit e Ship @it
domain: military unit
sub property of: mean of transportation
type: ObjectProperty
comment: Relation between Military Unit and Ship
range: ship

Axiom
dbpedia infobox matching weight: 100.0
annotated target: equipment
annotated property: relatedMatch
annotated source: links to Ship

links to Bridge
sub property of: place
comment: Relation between Military Unit and Bridge
type: ObjectProperty
domain: military unit
comment: Relazione tra Military Unit e Bridge @it
range: bridge

links to Writer
sub property of: person
domain: military unit
type: ObjectProperty
comment: Relation between Military Unit and Writer
comment: Relazione tra Military Unit e Writer @it
range: writer

links to American Football League
sub property of: organização
comment: Relation between Military Unit and American Football League
range: american football league
domain: military unit
type: ObjectProperty
comment: Relazione tra Military Unit e American Football League @it

ski area
type: Class
label: domaine skiable @fr

links to Protected Area
range: protected area
related match: battleHonours
related match: battles
comment: Relazione tra Military Unit e Protected Area @it
type: NamedIndividual
comment: Relation between Military Unit and Protected Area
type: ObjectProperty
sub property of: place
domain: military unit

space station
label: station spatiale @fr
type: Class

non-profit organisation
label: organisation à but non lucratif @fr
type: Class

links to Journalist
comment: Relation between Military Unit and Journalist
domain: military unit
comment: Relazione tra Military Unit e Journalist @it
sub property of: person
type: ObjectProperty
range: journalist

links to Road
range: road
domain: military unit
comment: Relazione tra Military Unit e Road @it
comment: Relation between Military Unit and Road
type: ObjectProperty
sub property of: infrastructure

links to Governor
comment: Relation between Military Unit and Governor
type: NamedIndividual
range: governor
comment: Relazione tra Military Unit e Governor @it
related match: commander
domain: military unit
related match: notableCommanders
sub property of: person
related match: colonelOfTheRegiment
type: ObjectProperty

mollusca
label: mollusque @fr
type: Class

links to Radio Station
comment: Relazione tra Military Unit e Radio Station @it
sub property of: organização
type: ObjectProperty
comment: Relation between Military Unit and Radio Station
domain: military unit
range: radio station

links to Soccer Manager
range: soccer manager
sub property of: person
domain: military unit
comment: Relazione tra Military Unit e Soccer Manager @it
comment: Relation between Military Unit and Soccer Manager
type: ObjectProperty

drug
type: ObjectProperty
label: médicament @fr
type: Class

links to Adult Actor
type: ObjectProperty
sub property of: person
range: adult actor
comment: Relation between Military Unit and Adult Actor
domain: military unit
comment: Relazione tra Military Unit e Adult Actor @it

magazine
label: περιοδικό @el
type: Class

links to Anatomical Structure
domain: military unit
type: ObjectProperty
comment: Relazione tra Military Unit e Anatomical Structure @it
range: anatomical structure
comment: Relation between Military Unit and Anatomical Structure
sub property of: anatomical structure

links to Fern
comment: Relation between Military Unit and Fern
range: fern
domain: military unit
type: ObjectProperty
sub property of: species
comment: Relazione tra Military Unit e Fern @it

Axiom
dbpedia infobox matching weight: 66.67
annotated property: relatedMatch
annotated source: links to Historic Place
annotated target: battles

links to Stadium
related match: battles
type: NamedIndividual
range: stadium
type: ObjectProperty
comment: Relation between Military Unit and Stadium
domain: military unit
sub property of: place
comment: Relazione tra Military Unit e Stadium @it

canal
type: Class

philosopher
type: Class
label: philosophe @fr

award
type: ObjectProperty
label: récompense @fr
type: Class

links to Magazine
comment: Relation between Military Unit and Magazine
domain: military unit
sub property of: work
comment: Relazione tra Military Unit e Magazine @it
type: ObjectProperty
range: magazine

locomotive
type: Class

links to Astronaut
comment: Relation between Military Unit and Astronaut
comment: Relazione tra Military Unit e Astronaut @it
domain: military unit
sub property of: person
type: ObjectProperty
range: astronaut

links to Olympics
sub property of: event
domain: military unit
type: ObjectProperty
comment: Relation between Military Unit and Olympics
comment: Relazione tra Military Unit e Olympics @it
range: olympics

anatomical structure
label: structure anatomique @fr
type: ObjectProperty
type: Class

sport
type: Class

links to Soccer Club
type: ObjectProperty
comment: Relation between Military Unit and Soccer Club
domain: military unit
comment: Relazione tra Military Unit e Soccer Club @it
sub property of: organização
range: soccer club

cricketer
type: Class
label: joueur de cricket @fr

links to Fish
sub property of: species
type: ObjectProperty
comment: Relazione tra Military Unit e Fish @it
range: fish
comment: Relation between Military Unit and Fish
domain: military unit

single
type: Class

Band
label: groupe de musique @fr
type: Class
label: Musikgruppe @de
label: banda @pt

links to Historic Place
sub property of: place
type: ObjectProperty
domain: military unit
related match: battles
type: NamedIndividual
comment: Relation between Military Unit and Historic Place
range: historic place
comment: Relazione tra Military Unit e Historic Place @it
related match: garrison

university
type: Class
label: université @fr
label: πανεπιστήμιο @el

ethnic group
label: groupe ethnique @fr
type: ObjectProperty
type: Class

links to Mountain
type: NamedIndividual
related match: battles
type: ObjectProperty
comment: Relazione tra Military Unit e Mountain @it
sub property of: place
domain: military unit
comment: Relation between Military Unit and Mountain
range: mountain

links to Prime Minister
comment: Relazione tra Military Unit e Prime Minister @it
domain: military unit
comment: Relation between Military Unit and Prime Minister
type: ObjectProperty
range: prime minister
sub property of: person
related match: notableCommanders
type: NamedIndividual

links to Ambassador
comment: Relazione tra Military Unit e Ambassador @it
type: ObjectProperty
domain: military unit
range: ambassador
comment: Relation between Military Unit and Ambassador
sub property of: person

links to Park
domain: military unit
comment: Relazione tra Military Unit e Park @it
type: ObjectProperty
range: park
sub property of: place
comment: Relation between Military Unit and Park

links to Comedian
sub property of: person
domain: military unit
comment: Relazione tra Military Unit e Comedian @it
comment: Relation between Military Unit and Comedian
type: ObjectProperty
range: comedian

Axiom
dbpedia infobox matching weight: 100.0
annotated source: links to Monarch
annotated target: notableCommanders
annotated property: relatedMatch

links to Race
domain: military unit
comment: Relazione tra Military Unit e Race @it
type: ObjectProperty
range: race
comment: Relation between Military Unit and Race
sub property of: event

hotel
label: hôtel @fr
type: Class

music festival
label: festival de musique @fr
type: Class

college coach
type: Class
label: entraîneur universitaire @fr

television episode
label: épisode télévisé @fr
type: Class

village
type: Class
label: χωριό @el

ice hockey league
type: Class
label: ligue d'hockey sur glace @fr

soccer club
label: club de football @fr
type: Class

historic building
type: Class
label: bâtiment historique @fr

links to Band
domain: military unit
range: Band
comment: Relation between Military Unit and Band
sub property of: organização
type: ObjectProperty
comment: Relazione tra Military Unit e Band @it

links to Legislature
range: legislature
sub property of: organização
comment: Relazione tra Military Unit e Legislature @it
domain: military unit
comment: Relation between Military Unit and Legislature
type: ObjectProperty

office holder
type: Class
label: Amtsinhaber @de
label: titulaire @fr

baseball player
label: joueur de baseball @fr
type: Class

grape
label: raisin @fr
type: Class

website
label: Ιστότοπος @el
label: site web @fr
type: Class
type: ObjectProperty

links to President
domain: military unit
range: president
related match: allegiance
comment: Relazione tra Military Unit e President @it
related match: notableCommanders
comment: Relation between Military Unit and President
sub property of: person
type: NamedIndividual
type: ObjectProperty
related match: notableMembers

links to Music Genre
type: ObjectProperty
range: music genre
comment: Relazione tra Military Unit e Music Genre @it
sub property of: music genre
comment: Relation between Military Unit and Music Genre
domain: military unit

Axiom
dbpedia infobox matching weight: 100.0
annotated property: relatedMatch
annotated target: garrison
annotated source: links to Hotel

basketball player
type: Class
label: joueur de basketball @fr

adult actor
label: acteur adulte @fr
type: Class
label: erwachsener Schauspieler @de

links to River
related match: battleHonours
sub property of: place
comment: Relation between Military Unit and River
type: ObjectProperty
related match: battles
comment: Relazione tra Military Unit e River @it
domain: military unit
range: river
type: NamedIndividual

links to Election
sub property of: event
comment: Relation between Military Unit and Election
range: Election
comment: Relazione tra Military Unit e Election @it
domain: military unit
type: ObjectProperty

links to Soccer Player
type: ObjectProperty
range: soccer player
sub property of: person
comment: Relazione tra Military Unit e Soccer Player @it
domain: military unit
comment: Relation between Military Unit and Soccer Player

ice hockey player
type: Class
label: joueur de hockey sur glace @fr

Axiom
dbpedia infobox matching weight: 38.98
annotated property: relatedMatch
annotated source: links to Office Holder
annotated target: notableCommanders

links to Ice Hockey League
sub property of: organização
comment: Relation between Military Unit and Ice Hockey League
range: ice hockey league
domain: military unit
type: ObjectProperty
comment: Relazione tra Military Unit e Ice Hockey League @it

Christian Bishop
type: Class
label: évêque chrétien @fr

mountain range
type: Class
label: chaîne de montagne @fr

links to Monarch
comment: Relation between Military Unit and Monarch
type: ObjectProperty
range: monarch
comment: Relazione tra Military Unit e Monarch @it
sub property of: person
domain: military unit
related match: notableCommanders
type: NamedIndividual

beverage
label: boisson @fr
type: Class
type: ObjectProperty

links to Sport
comment: Relation between Military Unit and Sport
sub property of: activity
type: ObjectProperty
comment: Relazione tra Military Unit e Sport @it
range: sport
domain: military unit

planet
type: Class
label: planète @fr
type: ObjectProperty

links to Gaelic Games Player
domain: military unit
comment: Relazione tra Military Unit e Gaelic Games Player @it
range: Gaelic games player
comment: Relation between Military Unit and Gaelic Games Player
type: ObjectProperty
sub property of: person

Axiom
dbpedia infobox matching weight: 100.0
annotated property: relatedMatch
annotated target: battles
annotated source: links to Mountain

scientist
label: scientifique @fr
type: Class
label: Wissenschaftler @de

links to Website
type: ObjectProperty
domain: military unit
range: website
comment: Relazione tra Military Unit e Website @it
sub property of: website
comment: Relation between Military Unit and Website

links to Arachnid
comment: Relation between Military Unit and Arachnid
domain: military unit
type: ObjectProperty
sub property of: species
range: arachnid
comment: Relazione tra Military Unit e Arachnid @it

links to Lake
comment: Relazione tra Military Unit e Lake @it
comment: Relation between Military Unit and Lake
range: lake
domain: military unit
sub property of: place
type: ObjectProperty

links to Nascar Driver
comment: Relation between Military Unit and Nascar Driver
range: nascar driver
type: ObjectProperty
domain: military unit
sub property of: person
comment: Relazione tra Military Unit e Nascar Driver @it

links to Canal
comment: Relazione tra Military Unit e Canal @it
type: ObjectProperty
domain: military unit
comment: Relation between Military Unit and Canal
sub property of: place
range: canal

links to Supreme Court Of The United States Case
comment: Relazione tra Military Unit e Supreme Court Of The United States Case @it
range: Supreme Court of the United States case
sub property of: Legal Case
comment: Relation between Military Unit and Supreme Court Of The United States Case
type: ObjectProperty
domain: military unit

olympics
label: Jeux Olympiques @fr
type: Class

organização
type: ObjectProperty
label: organisation
label: Organisation @de

baseball league
label: ligue de baseball @fr
type: Class

bridge
type: Class
label: pont @fr

broadcast
label: Émission de télévision @fr
type: Class

links to Insect
comment: Relazione tra Military Unit e Insect @it
range: insect
sub property of: species
comment: Relation between Military Unit and Insect
domain: military unit
type: ObjectProperty

mammal
label: mammifère @fr
type: Class

links to Green Alga
range: green alga
domain: military unit
type: ObjectProperty
comment: Relation between Military Unit and Green Alga
comment: Relazione tra Military Unit e Green Alga @it
sub property of: species

Axiom
dbpedia infobox matching weight: 33.33
annotated source: links to Historic Place
annotated property: relatedMatch
annotated target: garrison

comics character
label: personnage de bandes dessinées @fr
type: Class

links to Beverage
comment: Relazione tra Military Unit e Beverage @it
range: beverage
comment: Relation between Military Unit and Beverage
domain: military unit
type: ObjectProperty
sub property of: beverage

event
type: ObjectProperty
label: évènement @fr

skyscraper
label: gratte-ciel @fr
type: Class

radio station
label: station de radio @fr
type: Class

member of parliament
label: membre du Parlement @fr
type: Class

links to Comics Character
comment: Relation between Military Unit and Comics Character
domain: military unit
range: comics character
comment: Relazione tra Military Unit e Comics Character @it
type: ObjectProperty
sub property of: person

conifer
type: Class
label: conifères @fr