links to Amphibian
type: ObjectProperty
domain: mountain range
comment: Relazione tra Mountain Range e Amphibian @it
sub property of: species
range: amphibian
comment: Relation between Mountain Range and Amphibian

television show
label: émission de télévision @fr
type: Class

disease
type: ObjectProperty
type: Class
label: maladie @fr

colour
type: Class
label: couleur @fr
label: χρώμα @el
type: ObjectProperty

mean of transportation
label: moyen de transport @fr
type: ObjectProperty

american football player
type: Class
label: joueur de football américain @fr

links to Airport
comment: Relazione tra Mountain Range e Airport @it
comment: Relation between Mountain Range and Airport
sub property of: place
range: airport
domain: mountain range
type: ObjectProperty

links to Film
domain: mountain range
comment: Relation between Mountain Range and Film
range: film
comment: Relazione tra Mountain Range e Film @it
type: ObjectProperty
sub property of: work

links to Ship
domain: mountain range
range: ship
type: ObjectProperty
sub property of: mean of transportation
comment: Relation between Mountain Range and Ship
comment: Relazione tra Mountain Range e Ship @it

links to Valley
sub property of: place
domain: mountain range
type: ObjectProperty
range: valley
comment: Relazione tra Mountain Range e Valley @it
comment: Relation between Mountain Range and Valley

links to Comics Character
comment: Relazione tra Mountain Range e Comics Character @it
range: comics character
sub property of: person
domain: mountain range
type: ObjectProperty
comment: Relation between Mountain Range and Comics Character

links to Moss
range: moss
domain: mountain range
type: ObjectProperty
comment: Relation between Mountain Range and Moss
comment: Relazione tra Mountain Range e Moss @it
sub property of: species

amphibian
type: Class
label: amphibien @fr

species
label: espèce @fr
type: ObjectProperty

links to Island
type: ObjectProperty
domain: mountain range
sub property of: place
comment: Relazione tra Mountain Range e Island @it
related match: region
related match: highestLocation
comment: Relation between Mountain Range and Island
type: NamedIndividual
range: island

newspaper
type: Class
label: journal @fr

ginkgo
type: Class

judge
type: Class
label: juge @fr

links to Newspaper
type: ObjectProperty
sub property of: work
comment: Relazione tra Mountain Range e Newspaper @it
domain: mountain range
range: newspaper
comment: Relation between Mountain Range and Newspaper

links to Mammal
comment: Relation between Mountain Range and Mammal
type: ObjectProperty
domain: mountain range
comment: Relazione tra Mountain Range e Mammal @it
range: mammal
sub property of: species

World Heritage Site
label: site du patrimoine mondial @fr
type: Class

links to Prime Minister
range: prime minister
comment: Relazione tra Mountain Range e Prime Minister @it
domain: mountain range
type: ObjectProperty
sub property of: person
comment: Relation between Mountain Range and Prime Minister

language
type: Class
label: langage @fr
type: ObjectProperty

links to Actor
domain: mountain range
type: ObjectProperty
range: actor
sub property of: person
comment: Relation between Mountain Range and Actor
comment: Relazione tra Mountain Range e Actor @it

links to Television Show
range: television show
comment: Relation between Mountain Range and Television Show
sub property of: work
comment: Relazione tra Mountain Range e Television Show @it
type: ObjectProperty
domain: mountain range

links to Bridge
sub property of: place
type: ObjectProperty
range: bridge
comment: Relazione tra Mountain Range e Bridge @it
domain: mountain range
comment: Relation between Mountain Range and Bridge

links to Single
comment: Relazione tra Mountain Range e Single @it
comment: Relation between Mountain Range and Single
domain: mountain range
sub property of: work
range: single
type: ObjectProperty

arachnid
label: arachnides @fr
type: Class

links to Monarch
range: monarch
sub property of: person
domain: mountain range
type: ObjectProperty
comment: Relation between Mountain Range and Monarch
comment: Relazione tra Mountain Range e Monarch @it

links to Ski Area
comment: Relazione tra Mountain Range e Ski Area @it
sub property of: place
comment: Relation between Mountain Range and Ski Area
range: ski area
domain: mountain range
type: ObjectProperty

governor
label: gouverneur @fr
type: Class

MountainRange.owl
has intent: To represent the encyclopedic knowledge expressed by an object typed as MountainRange
comment: MountainRange Encyclopedic Knowledge Pattern
extracted from: en.wikipedia.org
imports: dbpediainfoboxmatchingweight.owl
has author: Aldo Gangemi
has author: Valentina Presutti
imports: cpannotationschema.owl
has author: Andrea Giovanni Nuzzolese
extracted from: dbpedia.org
type: Ontology

work
type: ObjectProperty
label: travail @fr
label: obra @pt

links to Music Genre
range: music genre
type: ObjectProperty
sub property of: music genre
comment: Relation between Mountain Range and Music Genre
domain: mountain range
comment: Relazione tra Mountain Range e Music Genre @it

school
type: Class
label: école @fr

fish
type: Class
label: poisson @fr

links to University
sub property of: organização
type: ObjectProperty
comment: Relazione tra Mountain Range e University @it
comment: Relation between Mountain Range and University
domain: mountain range
range: university

museum
type: Class
label: musée @fr

ship
label: navire @fr
type: Class

links to American Football Player
comment: Relazione tra Mountain Range e American Football Player @it
sub property of: person
domain: mountain range
range: american football player
type: ObjectProperty
comment: Relation between Mountain Range and American Football Player

video game
label: jeux vidéo @fr
type: Class

links to Park
type: ObjectProperty
sub property of: place
comment: Relation between Mountain Range and Park
range: park
comment: Relazione tra Mountain Range e Park @it
domain: mountain range

currency
label: devise @fr
type: Class
type: ObjectProperty

British royalty
label: royauté Britannique @fr
type: Class

prime minister
type: Class
label: premier ministre @fr

historic place
type: Class
label: site historique @fr

race
type: Class
label: course @fr

links to Flowering Plant
comment: Relazione tra Mountain Range e Flowering Plant @it
sub property of: species
type: ObjectProperty
comment: Relation between Mountain Range and Flowering Plant
domain: mountain range
range: flowering plant

links to Currency
range: currency
comment: Relazione tra Mountain Range e Currency @it
domain: mountain range
comment: Relation between Mountain Range and Currency
sub property of: currency
type: ObjectProperty

links to Legislature
type: ObjectProperty
sub property of: organização
range: legislature
domain: mountain range
comment: Relazione tra Mountain Range e Legislature @it
comment: Relation between Mountain Range and Legislature

links to Governor
sub property of: person
type: ObjectProperty
comment: Relation between Mountain Range and Governor
range: governor
domain: mountain range
comment: Relazione tra Mountain Range e Governor @it

links to Book
comment: Relazione tra Mountain Range e Book @it
range: book
comment: Relation between Mountain Range and Book
sub property of: work
type: ObjectProperty
domain: mountain range

continent
label: ήπειρος @el
type: Class

president
label: président @fr
type: Class

album
type: Class
label: Album @de

links to Planet
comment: Relazione tra Mountain Range e Planet @it
type: ObjectProperty
comment: Relation between Mountain Range and Planet
domain: mountain range
sub property of: planet
range: planet

moss
label: mousses @fr
type: Class

person
label: Person @de
type: ObjectProperty
label: pessoa @pt
label: personne @fr

military unit
type: Class
label: unité militaire @fr

links to Music Festival
sub property of: event
domain: mountain range
comment: Relation between Mountain Range and Music Festival
type: ObjectProperty
comment: Relazione tra Mountain Range e Music Festival @it
range: music festival

music genre
type: Class
label: género musical @pt
type: ObjectProperty
label: genre musical @fr

links to Fern
type: ObjectProperty
range: fern
sub property of: species
comment: Relation between Mountain Range and Fern
domain: mountain range
comment: Relazione tra Mountain Range e Fern @it

cycad
type: Class
label: cycadophytes @fr

links to Colour
sub property of: colour
comment: Relation between Mountain Range and Colour
comment: Relazione tra Mountain Range e Colour @it
range: colour
domain: mountain range
type: ObjectProperty

writer
label: écrivain @fr
type: Class

links to Award
comment: Relation between Mountain Range and Award
domain: mountain range
sub property of: award
type: ObjectProperty
comment: Relazione tra Mountain Range e Award @it
range: award

links to Disease
comment: Relation between Mountain Range and Disease
comment: Relazione tra Mountain Range e Disease @it
domain: mountain range
sub property of: disease
type: ObjectProperty
range: disease

crustacean
label: crustacés @fr
type: Class

links to Space Mission
type: ObjectProperty
range: space mission
comment: Relazione tra Mountain Range e Space Mission @it
comment: Relation between Mountain Range and Space Mission
domain: mountain range
sub property of: event

links to Ethnic Group
sub property of: ethnic group
comment: Relation between Mountain Range and Ethnic Group
domain: mountain range
type: ObjectProperty
comment: Relazione tra Mountain Range e Ethnic Group @it
range: ethnic group

links to Anatomical Structure
domain: mountain range
comment: Relation between Mountain Range and Anatomical Structure
comment: Relazione tra Mountain Range e Anatomical Structure @it
type: ObjectProperty
range: anatomical structure
sub property of: anatomical structure

links to Musical
comment: Relazione tra Mountain Range e Musical @it
comment: Relation between Mountain Range and Musical
type: ObjectProperty
sub property of: work
domain: mountain range
range: musical

links to President
type: ObjectProperty
domain: mountain range
comment: Relation between Mountain Range and President
comment: Relazione tra Mountain Range e President @it
sub property of: person
range: president

lighthouse
label: phare @fr
type: Class

comics creator
type: Class
label: créateur de bandes dessinées @fr

reptile
type: Class

legislature
type: Class
label: pouvoir législatif @fr

cave
type: Class
label: grotte @fr

links to Arachnid
range: arachnid
comment: Relazione tra Mountain Range e Arachnid @it
sub property of: species
type: ObjectProperty
domain: mountain range
comment: Relation between Mountain Range and Arachnid

airline
label: compagnie aérienne @fr
type: Class

links to Race
type: ObjectProperty
domain: mountain range
sub property of: event
comment: Relation between Mountain Range and Race
range: race
comment: Relazione tra Mountain Range e Race @it

links to Broadcast
sub property of: organização
domain: mountain range
type: ObjectProperty
comment: Relation between Mountain Range and Broadcast
range: broadcast
comment: Relazione tra Mountain Range e Broadcast @it

monarch
type: Class
label: monarque @fr

links to World Heritage Site
range: World Heritage Site
comment: Relation between Mountain Range and World Heritage Site
sub property of: place
type: ObjectProperty
domain: mountain range
comment: Relazione tra Mountain Range e World Heritage Site @it

congressman
type: Class
label: membre du Congrès @fr

Gnetophytes
label: gnétophytes @fr
type: Class

activity
type: ObjectProperty
label: Aktivität @de
label: activité @fr

Axiom
dbpedia infobox matching weight: 50.0
annotated target: highestLocation
annotated source: links to Island
annotated property: relatedMatch

links to Album
comment: Relation between Mountain Range and Album
type: ObjectProperty
sub property of: work
range: album
domain: mountain range
comment: Relazione tra Mountain Range e Album @it

links to Museum
type: ObjectProperty
sub property of: place
range: museum
comment: Relation between Mountain Range and Museum
comment: Relazione tra Mountain Range e Museum @it
domain: mountain range

space mission
type: Class
label: διαστημική αποστολή @el
label: mission spatiale @fr

insect
label: insecte @fr
type: Class

film
label: ταινία @el
type: Class

links to Chemical Compound
sub property of: chemical compound
comment: Relazione tra Mountain Range e Chemical Compound @it
range: chemical compound
comment: Relation between Mountain Range and Chemical Compound
type: ObjectProperty
domain: mountain range

links to Language
sub property of: language
range: language
domain: mountain range
comment: Relazione tra Mountain Range e Language @it
comment: Relation between Mountain Range and Language
type: ObjectProperty

chemical compound
label: produit chimique @fr
type: ObjectProperty
type: Class

bird
label: oiseau @fr
type: Class

links to Comics Creator
domain: mountain range
comment: Relation between Mountain Range and Comics Creator
type: ObjectProperty
sub property of: person
range: comics creator
comment: Relazione tra Mountain Range e Comics Creator @it

musical artist
label: artista musical @pt
type: Class
label: musicien @fr

fungus
label: fungi @fr
type: Class

fern
type: Class
label: fougères @fr

Axiom
dbpedia infobox matching weight: 100.0
annotated property: relatedMatch
annotated target: etymology
annotated source: links to Continent

park
label: parc @fr
type: Class

Axiom
dbpedia infobox matching weight: 50.0
annotated target: region
annotated source: links to Island
annotated property: relatedMatch

links to Office Holder
comment: Relazione tra Mountain Range e Office Holder @it
sub property of: person
range: office holder
comment: Relation between Mountain Range and Office Holder
type: ObjectProperty
domain: mountain range

links to Canal
type: ObjectProperty
domain: mountain range
comment: Relation between Mountain Range and Canal
comment: Relazione tra Mountain Range e Canal @it
sub property of: place
range: canal

links to Sport
comment: Relation between Mountain Range and Sport
range: sport
comment: Relazione tra Mountain Range e Sport @it
domain: mountain range
type: ObjectProperty
sub property of: activity

links to Shopping Mall
type: ObjectProperty
sub property of: place
comment: Relazione tra Mountain Range e Shopping Mall @it
range: shopping mall
comment: Relation between Mountain Range and Shopping Mall
domain: mountain range

links to Congressman
type: ObjectProperty
range: congressman
comment: Relazione tra Mountain Range e Congressman @it
comment: Relation between Mountain Range and Congressman
sub property of: person
domain: mountain range

musical
type: Class
label: musique @fr

actor
label: Schauspieler @de
type: Class
label: acteur @fr

place
type: ObjectProperty
label: περιοχή @el
label: lieu @fr
label: lugar @pt

links to Historic Place
domain: mountain range
type: ObjectProperty
sub property of: place
comment: Relazione tra Mountain Range e Historic Place @it
comment: Relation between Mountain Range and Historic Place
range: historic place

criminal
label: criminel @fr
type: Class

links to Space Station
comment: Relation between Mountain Range and Space Station
range: space station
sub property of: mean of transportation
domain: mountain range
type: ObjectProperty
comment: Relazione tra Mountain Range e Space Station @it

flowering plant
label: angiospermes @fr
type: Class

links to Fish
domain: mountain range
comment: Relation between Mountain Range and Fish
range: fish
sub property of: species
type: ObjectProperty
comment: Relazione tra Mountain Range e Fish @it

saint
type: Class

senator
label: sénateur @fr
type: Class

valley
label: vallée @fr
type: Class

links to Band
type: ObjectProperty
sub property of: organização
comment: Relazione tra Mountain Range e Band @it
domain: mountain range
range: Band
comment: Relation between Mountain Range and Band

links to Military Conflict
range: military conflict
domain: mountain range
comment: Relation between Mountain Range and Military Conflict
sub property of: event
comment: Relazione tra Mountain Range e Military Conflict @it
type: ObjectProperty

links to Conifer
type: ObjectProperty
sub property of: species
comment: Relazione tra Mountain Range e Conifer @it
comment: Relation between Mountain Range and Conifer
range: conifer
domain: mountain range

book
type: Class
label: livre @fr
label: βιβλίο @el
label: llibre @ca
label: książka @pl

links to Ginkgo
type: ObjectProperty
range: ginkgo
comment: Relation between Mountain Range and Ginkgo
domain: mountain range
comment: Relazione tra Mountain Range e Ginkgo @it
sub property of: species

shopping mall
type: Class
label: centre commercial @fr

ski area
label: domaine skiable @fr
type: Class

links to Scientist
range: scientist
sub property of: person
domain: mountain range
comment: Relazione tra Mountain Range e Scientist @it
comment: Relation between Mountain Range and Scientist
type: ObjectProperty

non-profit organisation
type: Class
label: organisation à but non lucratif @fr

space station
label: station spatiale @fr
type: Class

links to Judge
range: judge
comment: Relation between Mountain Range and Judge
type: ObjectProperty
comment: Relazione tra Mountain Range e Judge @it
domain: mountain range
sub property of: person

mollusca
label: mollusque @fr
type: Class

wine region
type: Class
label: région viticole @fr

drug
type: ObjectProperty
label: médicament @fr
type: Class

links to Cycad
type: ObjectProperty
range: cycad
sub property of: species
comment: Relation between Mountain Range and Cycad
comment: Relazione tra Mountain Range e Cycad @it
domain: mountain range

links to Wine Region
type: ObjectProperty
range: wine region
domain: mountain range
comment: Relation between Mountain Range and Wine Region
sub property of: place
comment: Relazione tra Mountain Range e Wine Region @it

canal
type: Class

links to School
sub property of: organização
type: ObjectProperty
range: school
comment: Relazione tra Mountain Range e School @it
comment: Relation between Mountain Range and School
domain: mountain range

military person
label: militaire @fr
type: Class

links to Senator
type: ObjectProperty
comment: Relation between Mountain Range and Senator
sub property of: person
range: senator
comment: Relazione tra Mountain Range e Senator @it
domain: mountain range

philosopher
label: philosophe @fr
type: Class

award
type: ObjectProperty
label: récompense @fr
type: Class

links to British Royalty
range: British royalty
sub property of: person
domain: mountain range
comment: Relation between Mountain Range and British Royalty
comment: Relazione tra Mountain Range e British Royalty @it
type: ObjectProperty

sport
type: Class

anatomical structure
label: structure anatomique @fr
type: ObjectProperty
type: Class

links to Website
domain: mountain range
comment: Relazione tra Mountain Range e Website @it
range: website
type: ObjectProperty
comment: Relation between Mountain Range and Website
sub property of: website

single
type: Class

Band
label: banda @pt
label: Musikgruppe @de
type: Class
label: groupe de musique @fr

links to Mollusca
comment: Relation between Mountain Range and Mollusca
comment: Relazione tra Mountain Range e Mollusca @it
domain: mountain range
range: mollusca
sub property of: species
type: ObjectProperty

links to Philosopher
sub property of: person
domain: mountain range
comment: Relation between Mountain Range and Philosopher
comment: Relazione tra Mountain Range e Philosopher @it
range: philosopher
type: ObjectProperty

university
label: πανεπιστήμιο @el
label: université @fr
type: Class

links to Olympics
range: olympics
domain: mountain range
sub property of: event
comment: Relazione tra Mountain Range e Olympics @it
comment: Relation between Mountain Range and Olympics
type: ObjectProperty

ethnic group
type: Class
type: ObjectProperty
label: groupe ethnique @fr

links to Reptile
comment: Relation between Mountain Range and Reptile
domain: mountain range
type: ObjectProperty
sub property of: species
range: reptile
comment: Relazione tra Mountain Range e Reptile @it

links to Writer
comment: Relazione tra Mountain Range e Writer @it
domain: mountain range
type: ObjectProperty
comment: Relation between Mountain Range and Writer
sub property of: person
range: writer

music festival
type: Class
label: festival de musique @fr

links to Baseball League
domain: mountain range
comment: Relazione tra Mountain Range e Baseball League @it
type: ObjectProperty
comment: Relation between Mountain Range and Baseball League
sub property of: organização
range: baseball league

links to Lighthouse
domain: mountain range
comment: Relazione tra Mountain Range e Lighthouse @it
comment: Relation between Mountain Range and Lighthouse
sub property of: place
type: ObjectProperty
range: lighthouse

village
type: Class
label: χωριό @el

links to Saint
comment: Relation between Mountain Range and Saint
type: ObjectProperty
domain: mountain range
comment: Relazione tra Mountain Range e Saint @it
sub property of: person
range: saint

links to Drug
domain: mountain range
sub property of: drug
type: ObjectProperty
comment: Relation between Mountain Range and Drug
comment: Relazione tra Mountain Range e Drug @it
range: drug

links to Criminal
range: criminal
sub property of: person
domain: mountain range
comment: Relation between Mountain Range and Criminal
comment: Relazione tra Mountain Range e Criminal @it
type: ObjectProperty

soccer club
label: club de football @fr
type: Class

links to Military Unit
domain: mountain range
sub property of: organização
comment: Relazione tra Mountain Range e Military Unit @it
type: ObjectProperty
comment: Relation between Mountain Range and Military Unit
range: military unit

links to Insect
range: insect
domain: mountain range
type: ObjectProperty
comment: Relation between Mountain Range and Insect
comment: Relazione tra Mountain Range e Insect @it
sub property of: species

office holder
type: Class
label: Amtsinhaber @de
label: titulaire @fr

military conflict
type: Class
label: conflit militaire @fr

website
type: ObjectProperty
type: Class
label: Ιστότοπος @el
label: site web @fr

links to Video Game
domain: mountain range
comment: Relazione tra Mountain Range e Video Game @it
comment: Relation between Mountain Range and Video Game
range: video game
type: ObjectProperty
sub property of: work

links to Cave
type: ObjectProperty
sub property of: place
comment: Relazione tra Mountain Range e Cave @it
domain: mountain range
comment: Relation between Mountain Range and Cave
range: cave

links to Crustacean
type: ObjectProperty
domain: mountain range
comment: Relation between Mountain Range and Crustacean
sub property of: species
range: crustacean
comment: Relazione tra Mountain Range e Crustacean @it

mountain range
label: chaîne de montagne @fr
type: Class

links to Airline
domain: mountain range
comment: Relation between Mountain Range and Airline
range: airline
comment: Relazione tra Mountain Range e Airline @it
type: ObjectProperty
sub property of: organização

links to Continent
comment: Relazione tra Mountain Range e Continent @it
type: ObjectProperty
sub property of: place
comment: Relation between Mountain Range and Continent
range: continent
domain: mountain range
related match: etymology
type: NamedIndividual

beverage
type: ObjectProperty
type: Class
label: boisson @fr

planet
type: Class
label: planète @fr
type: ObjectProperty

links to Beverage
type: ObjectProperty
sub property of: beverage
comment: Relation between Mountain Range and Beverage
range: beverage
comment: Relazione tra Mountain Range e Beverage @it
domain: mountain range

links to Bird
range: bird
domain: mountain range
type: ObjectProperty
sub property of: species
comment: Relazione tra Mountain Range e Bird @it
comment: Relation between Mountain Range and Bird

links to Village
comment: Relation between Mountain Range and Village
range: village
domain: mountain range
comment: Relazione tra Mountain Range e Village @it
type: ObjectProperty
sub property of: place

scientist
label: Wissenschaftler @de
type: Class
label: scientifique @fr

links to Military Person
sub property of: person
type: ObjectProperty
comment: Relazione tra Mountain Range e Military Person @it
comment: Relation between Mountain Range and Military Person
range: military person
domain: mountain range

olympics
type: Class
label: Jeux Olympiques @fr

organização
type: ObjectProperty
label: organisation
label: Organisation @de

baseball league
label: ligue de baseball @fr
type: Class

links to Fungus
comment: Relation between Mountain Range and Fungus
sub property of: species
type: ObjectProperty
domain: mountain range
comment: Relazione tra Mountain Range e Fungus @it
range: fungus

bridge
type: Class
label: pont @fr

broadcast
type: Class
label: Émission de télévision @fr

mammal
type: Class
label: mammifère @fr

links to Non- Profit Organisation
comment: Relation between Mountain Range and Non- Profit Organisation
range: non-profit organisation
domain: mountain range
sub property of: organização
type: ObjectProperty
comment: Relazione tra Mountain Range e Non- Profit Organisation @it

island
type: Class
label: νησί @el
label: île @fr

comics character
label: personnage de bandes dessinées @fr
type: Class

event
label: évènement @fr
type: ObjectProperty

links to Soccer Club
domain: mountain range
comment: Relazione tra Mountain Range e Soccer Club @it
sub property of: organização
type: ObjectProperty
range: soccer club
comment: Relation between Mountain Range and Soccer Club

links to Musical Artist
range: musical artist
comment: Relation between Mountain Range and Musical Artist
comment: Relazione tra Mountain Range e Musical Artist @it
sub property of: person
type: ObjectProperty
domain: mountain range

conifer
type: Class
label: conifères @fr

airport
label: aéroport @fr
label: Flughafen @de
type: Class

links to Gnetophytes
comment: Relazione tra Mountain Range e Gnetophytes @it
sub property of: species
range: Gnetophytes
comment: Relation between Mountain Range and Gnetophytes
type: ObjectProperty
domain: mountain range