links to Sport
comment: Relation between Music Festival and Sport
domain: music festival
range: sport
sub property of: activity
comment: Relazione tra Music Festival e Sport @it
type: ObjectProperty

television show
label: émission de télévision @fr
type: Class

disease
type: ObjectProperty
type: Class
label: maladie @fr

links to Magazine
comment: Relazione tra Music Festival e Magazine @it
comment: Relation between Music Festival and Magazine
range: magazine
sub property of: work
type: ObjectProperty
domain: music festival

links to Mountain
type: ObjectProperty
comment: Relazione tra Music Festival e Mountain @it
comment: Relation between Music Festival and Mountain
range: mountain
sub property of: place
domain: music festival

colour
type: Class
label: couleur @fr
label: χρώμα @el
type: ObjectProperty

automobile
type: Class

links to American Football Team
comment: Relation between Music Festival and American Football Team
sub property of: organização
domain: music festival
type: ObjectProperty
range: american football team
comment: Relazione tra Music Festival e American Football Team @it

MusicFestival.owl
type: Ontology
has author: Valentina Presutti
comment: MusicFestival Encyclopedic Knowledge Pattern
extracted from: en.wikipedia.org
has intent: To represent the encyclopedic knowledge expressed by an object typed as MusicFestival
has author: Aldo Gangemi
imports: dbpediainfoboxmatchingweight.owl
extracted from: dbpedia.org
has author: Andrea Giovanni Nuzzolese
imports: cpannotationschema.owl

Election
label: élection @fr
type: Class

mean of transportation
label: moyen de transport @fr
type: ObjectProperty

american football player
label: joueur de football américain @fr
type: Class

stadium
label: stade @fr
type: Class

links to Soccer Manager
range: soccer manager
domain: music festival
sub property of: person
comment: Relation between Music Festival and Soccer Manager
comment: Relazione tra Music Festival e Soccer Manager @it
type: ObjectProperty

links to Language
comment: Relation between Music Festival and Language
type: ObjectProperty
sub property of: language
range: language
comment: Relazione tra Music Festival e Language @it
domain: music festival

links to Television Episode
sub property of: work
comment: Relazione tra Music Festival e Television Episode @it
comment: Relation between Music Festival and Television Episode
domain: music festival
range: television episode
type: ObjectProperty

wrestler
type: Class
label: lutteur @fr

mayor
label: maire @fr
type: Class

links to American Football Player
sub property of: person
comment: Relazione tra Music Festival e American Football Player @it
comment: Relation between Music Festival and American Football Player
domain: music festival
type: ObjectProperty
range: american football player

species
type: ObjectProperty
label: espèce @fr

links to Rugby Player
comment: Relazione tra Music Festival e Rugby Player @it
type: ObjectProperty
range: rugby player
sub property of: person
comment: Relation between Music Festival and Rugby Player
domain: music festival

links to Cricketer
range: cricketer
sub property of: person
comment: Relazione tra Music Festival e Cricketer @it
comment: Relation between Music Festival and Cricketer
type: ObjectProperty
domain: music festival

links to Hospital
domain: music festival
comment: Relazione tra Music Festival e Hospital @it
sub property of: place
type: ObjectProperty
range: hospital
comment: Relation between Music Festival and Hospital

Axiom
dbpedia infobox matching weight: 100.0
annotated property: relatedMatch
annotated target: founders
annotated source: links to President

newspaper
label: journal @fr
type: Class

links to Disease
type: ObjectProperty
range: disease
domain: music festival
comment: Relazione tra Music Festival e Disease @it
comment: Relation between Music Festival and Disease
sub property of: disease

game
label: jeu @fr
type: Class

protected area
label: aire protégée @fr
label: προστατευμένη περιοχή @el
type: Class

road
label: route @fr
type: Class

links to University
type: ObjectProperty
range: university
comment: Relation between Music Festival and University
domain: music festival
comment: Relazione tra Music Festival e University @it
sub property of: organização

boxer
type: Class
label: boxeur @fr

links to Monarch
range: monarch
domain: music festival
comment: Relation between Music Festival and Monarch
comment: Relazione tra Music Festival e Monarch @it
type: ObjectProperty
sub property of: person

World Heritage Site
type: Class
label: site du patrimoine mondial @fr

links to Prime Minister
range: prime minister
comment: Relazione tra Music Festival e Prime Minister @it
sub property of: person
type: ObjectProperty
comment: Relation between Music Festival and Prime Minister
domain: music festival

links to Currency
type: ObjectProperty
range: currency
domain: music festival
comment: Relazione tra Music Festival e Currency @it
sub property of: currency
comment: Relation between Music Festival and Currency

language
type: ObjectProperty
label: langage @fr
type: Class

links to Figure Skater
comment: Relation between Music Festival and Figure Skater
domain: music festival
range: figure skater
sub property of: person
comment: Relazione tra Music Festival e Figure Skater @it
type: ObjectProperty

links to Journalist
sub property of: person
type: ObjectProperty
range: journalist
comment: Relazione tra Music Festival e Journalist @it
domain: music festival
comment: Relation between Music Festival and Journalist

links to Website
comment: Relation between Music Festival and Website
domain: music festival
type: ObjectProperty
comment: Relazione tra Music Festival e Website @it
range: website
sub property of: website

lake
label: lac @fr
type: Class

Axiom
dbpedia infobox matching weight: 100.0
annotated source: links to Stadium
annotated property: relatedMatch
annotated target: location

governor
label: gouverneur @fr
type: Class

links to Restaurant
range: restaurant
domain: music festival
type: ObjectProperty
sub property of: place
comment: Relazione tra Music Festival e Restaurant @it
comment: Relation between Music Festival and Restaurant

links to Tennis Player
domain: music festival
sub property of: person
type: ObjectProperty
range: tennis player
comment: Relation between Music Festival and Tennis Player
comment: Relazione tra Music Festival e Tennis Player @it

work
type: ObjectProperty
label: travail @fr
label: obra @pt

links to Criminal
type: ObjectProperty
comment: Relazione tra Music Festival e Criminal @it
sub property of: person
range: criminal
comment: Relation between Music Festival and Criminal
domain: music festival

river
type: Class
label: rivière @fr

school
label: école @fr
type: Class

fish
label: poisson @fr
type: Class

museum
type: Class
label: musée @fr

ship
type: Class
label: navire @fr

tennis player
type: Class
label: joueur de tennis @fr

links to Village
comment: Relazione tra Music Festival e Village @it
domain: music festival
type: ObjectProperty
range: village
comment: Relation between Music Festival and Village
sub property of: place

video game
label: jeux vidéo @fr
type: Class

trade union
type: Class
label: syndicat professionnel @fr

currency
type: Class
label: devise @fr
type: ObjectProperty

prime minister
type: Class
label: premier ministre @fr

British royalty
type: Class
label: royauté Britannique @fr

links to Election
sub property of: event
range: Election
comment: Relazione tra Music Festival e Election @it
comment: Relation between Music Festival and Election
type: ObjectProperty
domain: music festival

Axiom
dbpedia infobox matching weight: 100.0
annotated property: relatedMatch
annotated source: links to Island
annotated target: location

links to Artery
comment: Relation between Music Festival and Artery
comment: Relazione tra Music Festival e Artery @it
range: artery
type: ObjectProperty
sub property of: anatomical structure
domain: music festival

links to Mammal
domain: music festival
comment: Relation between Music Festival and Mammal
sub property of: species
type: ObjectProperty
comment: Relazione tra Music Festival e Mammal @it
range: mammal

historic place
label: site historique @fr
type: Class

hospital
label: hôpital @fr
type: Class

links to College Coach
comment: Relation between Music Festival and College Coach
comment: Relazione tra Music Festival e College Coach @it
sub property of: person
domain: music festival
type: ObjectProperty
range: college coach

links to River
comment: Relation between Music Festival and River
type: ObjectProperty
range: river
domain: music festival
sub property of: place
comment: Relazione tra Music Festival e River @it

links to World Heritage Site
comment: Relation between Music Festival and World Heritage Site
type: ObjectProperty
range: World Heritage Site
domain: music festival
comment: Relazione tra Music Festival e World Heritage Site @it
sub property of: place

links to Member Of Parliament
type: ObjectProperty
domain: music festival
comment: Relazione tra Music Festival e Member Of Parliament @it
sub property of: person
range: member of parliament
comment: Relation between Music Festival and Member Of Parliament

links to Legislature
domain: music festival
range: legislature
sub property of: organização
type: ObjectProperty
comment: Relation between Music Festival and Legislature
comment: Relazione tra Music Festival e Legislature @it

links to Soccer Club
comment: Relation between Music Festival and Soccer Club
domain: music festival
range: soccer club
sub property of: organização
type: ObjectProperty
comment: Relazione tra Music Festival e Soccer Club @it

links to Trade Union
comment: Relazione tra Music Festival e Trade Union @it
type: ObjectProperty
range: trade union
sub property of: organização
domain: music festival
comment: Relation between Music Festival and Trade Union

links to Wrestler
range: wrestler
comment: Relation between Music Festival and Wrestler
type: ObjectProperty
sub property of: person
comment: Relazione tra Music Festival e Wrestler @it
domain: music festival

continent
type: Class
label: ήπειρος @el

president
label: président @fr
type: Class

figure skater
label: patineur artistique @fr
type: Class

links to Island
related match: location
type: NamedIndividual
comment: Relazione tra Music Festival e Island @it
range: island
comment: Relation between Music Festival and Island
domain: music festival
sub property of: place
type: ObjectProperty

links to Comics Character
sub property of: person
comment: Relation between Music Festival and Comics Character
domain: music festival
comment: Relazione tra Music Festival e Comics Character @it
type: ObjectProperty
range: comics character

person
label: personne @fr
type: ObjectProperty
label: pessoa @pt
label: Person @de

military unit
type: Class
label: unité militaire @fr

soccer manager
label: entraîneur de football @fr
type: Class

Axiom
dbpedia infobox matching weight: 100.0
annotated target: founders
annotated source: links to British Royalty
annotated property: relatedMatch

links to Skyscraper
comment: Relazione tra Music Festival e Skyscraper @it
type: ObjectProperty
sub property of: place
range: skyscraper
comment: Relation between Music Festival and Skyscraper
domain: music festival

links to Video Game
domain: music festival
sub property of: work
comment: Relation between Music Festival and Video Game
comment: Relazione tra Music Festival e Video Game @it
range: video game
type: ObjectProperty

writer
label: écrivain @fr
type: Class

record label
type: Class
label: label discographique @fr

links to Military Unit
range: military unit
sub property of: organização
comment: Relazione tra Music Festival e Military Unit @it
domain: music festival
type: ObjectProperty
comment: Relation between Music Festival and Military Unit

architect
type: Class
label: architecte @fr

model
type: Class
label: mannequin @fr

film festival
label: festival du film @fr
type: Class

links to President
type: ObjectProperty
domain: music festival
sub property of: person
comment: Relazione tra Music Festival e President @it
range: president
comment: Relation between Music Festival and President
related match: founders
type: NamedIndividual

links to Reptile
type: ObjectProperty
range: reptile
sub property of: species
domain: music festival
comment: Relation between Music Festival and Reptile
comment: Relazione tra Music Festival e Reptile @it

links to Bird
sub property of: species
type: ObjectProperty
range: bird
domain: music festival
comment: Relazione tra Music Festival e Bird @it
comment: Relation between Music Festival and Bird

links to Comics Creator
comment: Relazione tra Music Festival e Comics Creator @it
sub property of: person
range: comics creator
domain: music festival
comment: Relation between Music Festival and Comics Creator
type: ObjectProperty

links to Automobile
comment: Relation between Music Festival and Automobile
type: ObjectProperty
domain: music festival
sub property of: mean of transportation
comment: Relazione tra Music Festival e Automobile @it
range: automobile

links to Lake
domain: music festival
sub property of: place
comment: Relazione tra Music Festival e Lake @it
type: ObjectProperty
comment: Relation between Music Festival and Lake
range: lake

links to Governor
range: governor
sub property of: person
type: ObjectProperty
comment: Relation between Music Festival and Governor
domain: music festival
comment: Relazione tra Music Festival e Governor @it

comics creator
label: créateur de bandes dessinées @fr
type: Class

links to Radio Station
range: radio station
domain: music festival
type: ObjectProperty
sub property of: organização
comment: Relation between Music Festival and Radio Station
comment: Relazione tra Music Festival e Radio Station @it

aircraft
label: avion @fr
type: Class
label: αεροσκάφος @el

links to Office Holder
type: ObjectProperty
range: office holder
comment: Relazione tra Music Festival e Office Holder @it
sub property of: person
comment: Relation between Music Festival and Office Holder
domain: music festival

links to Adult Actor
range: adult actor
domain: music festival
type: ObjectProperty
sub property of: person
comment: Relazione tra Music Festival e Adult Actor @it
comment: Relation between Music Festival and Adult Actor

links to Boxer
comment: Relazione tra Music Festival e Boxer @it
comment: Relation between Music Festival and Boxer
sub property of: person
range: boxer
domain: music festival
type: ObjectProperty

soccer player
type: Class
label: joueur de football @fr

links to Beverage
domain: music festival
comment: Relazione tra Music Festival e Beverage @it
sub property of: beverage
type: ObjectProperty
comment: Relation between Music Festival and Beverage
range: beverage

links to Newspaper
sub property of: work
type: ObjectProperty
range: newspaper
comment: Relazione tra Music Festival e Newspaper @it
domain: music festival
comment: Relation between Music Festival and Newspaper

reptile
type: Class

legislature
type: Class
label: pouvoir législatif @fr

links to Chemical Compound
type: ObjectProperty
comment: Relazione tra Music Festival e Chemical Compound @it
range: chemical compound
domain: music festival
sub property of: chemical compound
comment: Relation between Music Festival and Chemical Compound

links to Ship
comment: Relazione tra Music Festival e Ship @it
domain: music festival
comment: Relation between Music Festival and Ship
range: ship
type: ObjectProperty
sub property of: mean of transportation

links to Shopping Mall
domain: music festival
type: ObjectProperty
comment: Relazione tra Music Festival e Shopping Mall @it
sub property of: place
range: shopping mall
comment: Relation between Music Festival and Shopping Mall

links to Eurovision Song Contest Entry
comment: Relation between Music Festival and Eurovision Song Contest Entry
type: ObjectProperty
sub property of: work
domain: music festival
range: Eurovision song contest entry
comment: Relazione tra Music Festival e Eurovision Song Contest Entry @it

airline
type: Class
label: compagnie aérienne @fr

monarch
label: monarque @fr
type: Class

links to Park
domain: music festival
comment: Relazione tra Music Festival e Park @it
range: park
comment: Relation between Music Festival and Park
sub property of: place
type: ObjectProperty

links to Formula One Racer
sub property of: person
range: Formula One racer
comment: Relation between Music Festival and Formula One Racer
type: ObjectProperty
comment: Relazione tra Music Festival e Formula One Racer @it
domain: music festival

congressman
type: Class
label: membre du Congrès @fr

golf player
type: Class
label: golfeur @fr

links to Historic Place
range: historic place
comment: Relazione tra Music Festival e Historic Place @it
comment: Relation between Music Festival and Historic Place
type: ObjectProperty
sub property of: place
domain: music festival

activity
label: activité @fr
label: Aktivität @de
type: ObjectProperty

journalist
type: Class
label: journaliste @fr

links to Flowering Plant
comment: Relation between Music Festival and Flowering Plant
domain: music festival
type: ObjectProperty
range: flowering plant
comment: Relazione tra Music Festival e Flowering Plant @it
sub property of: species

insect
label: insecte @fr
type: Class

american football team
type: Class
label: équipe américaine de football américain @fr

bird
type: Class
label: oiseau @fr

chemical compound
type: Class
type: ObjectProperty
label: produit chimique @fr

Gaelic games player
label: joueur de sports gaéliques @fr
type: Class

links to Single
type: ObjectProperty
sub property of: work
domain: music festival
comment: Relation between Music Festival and Single
range: single
comment: Relazione tra Music Festival e Single @it

links to Game
type: ObjectProperty
domain: music festival
comment: Relation between Music Festival and Game
range: game
sub property of: activity
comment: Relazione tra Music Festival e Game @it

links to Golf Player
sub property of: person
type: ObjectProperty
comment: Relation between Music Festival and Golf Player
range: golf player
domain: music festival
comment: Relazione tra Music Festival e Golf Player @it

links to Continent
domain: music festival
comment: Relazione tra Music Festival e Continent @it
comment: Relation between Music Festival and Continent
type: ObjectProperty
range: continent
sub property of: place

park
label: parc @fr
type: Class

rugby player
label: joueur de rugby @fr
type: Class

musical
label: musique @fr
type: Class

Axiom
dbpedia infobox matching weight: 100.0
annotated property: relatedMatch
annotated source: links to Town
annotated target: location

links to Military Conflict
type: ObjectProperty
domain: music festival
range: military conflict
comment: Relation between Music Festival and Military Conflict
sub property of: event
comment: Relazione tra Music Festival e Military Conflict @it

place
type: ObjectProperty
label: περιοχή @el
label: lieu @fr
label: lugar @pt

links to Award
type: ObjectProperty
range: award
comment: Relation between Music Festival and Award
comment: Relazione tra Music Festival e Award @it
domain: music festival
sub property of: award

links to Wrestling Event
type: ObjectProperty
domain: music festival
comment: Relation between Music Festival and Wrestling Event
sub property of: event
comment: Relazione tra Music Festival e Wrestling Event @it
range: wrestling event

links to Museum
type: ObjectProperty
domain: music festival
sub property of: place
comment: Relazione tra Music Festival e Museum @it
comment: Relation between Music Festival and Museum
range: museum

links to Airline
comment: Relazione tra Music Festival e Airline @it
type: ObjectProperty
comment: Relation between Music Festival and Airline
domain: music festival
range: airline
sub property of: organização

wrestling event
label: match de catch @fr
type: Class

infrastructure
type: ObjectProperty

mountain
label: Βουνό @el
label: montagne @fr
type: Class

criminal
label: criminel @fr
type: Class

links to Model
comment: Relation between Music Festival and Model
domain: music festival
sub property of: person
range: model
type: ObjectProperty
comment: Relazione tra Music Festival e Model @it

flowering plant
label: angiospermes @fr
type: Class

saint
type: Class

senator
type: Class
label: sénateur @fr

comedian
type: Class
label: comédien @fr

links to Insect
comment: Relation between Music Festival and Insect
sub property of: species
domain: music festival
range: insect
type: ObjectProperty
comment: Relazione tra Music Festival e Insect @it

links to Record Label
comment: Relazione tra Music Festival e Record Label @it
type: ObjectProperty
range: record label
comment: Relation between Music Festival and Record Label
sub property of: organização
domain: music festival

links to Baseball Player
type: ObjectProperty
domain: music festival
comment: Relazione tra Music Festival e Baseball Player @it
sub property of: person
comment: Relation between Music Festival and Baseball Player
range: baseball player

links to Drug
sub property of: drug
range: drug
domain: music festival
comment: Relazione tra Music Festival e Drug @it
comment: Relation between Music Festival and Drug
type: ObjectProperty

convention
label: congrès @fr
type: Class

book
type: Class
label: livre @fr
label: βιβλίο @el
label: llibre @ca
label: książka @pl

shopping mall
type: Class
label: centre commercial @fr

links to Planet
comment: Relazione tra Music Festival e Planet @it
sub property of: planet
type: ObjectProperty
domain: music festival
range: planet
comment: Relation between Music Festival and Planet

ski area
label: domaine skiable @fr
type: Class

non-profit organisation
type: Class
label: organisation à but non lucratif @fr

links to Aircraft
type: ObjectProperty
range: aircraft
domain: music festival
sub property of: mean of transportation
comment: Relazione tra Music Festival e Aircraft @it
comment: Relation between Music Festival and Aircraft

links to Road
type: ObjectProperty
comment: Relation between Music Festival and Road
domain: music festival
comment: Relazione tra Music Festival e Road @it
sub property of: infrastructure
range: road

links to Bridge
domain: music festival
sub property of: place
type: ObjectProperty
comment: Relazione tra Music Festival e Bridge @it
range: bridge
comment: Relation between Music Festival and Bridge

links to Congressman
range: congressman
domain: music festival
comment: Relation between Music Festival and Congressman
type: ObjectProperty
comment: Relazione tra Music Festival e Congressman @it
sub property of: person

links to Stadium
type: ObjectProperty
range: stadium
comment: Relation between Music Festival and Stadium
sub property of: place
domain: music festival
comment: Relazione tra Music Festival e Stadium @it
related match: location
type: NamedIndividual

links to Film Festival
comment: Relazione tra Music Festival e Film Festival @it
sub property of: event
comment: Relation between Music Festival and Film Festival
range: film festival
domain: music festival
type: ObjectProperty

links to Scientist
domain: music festival
sub property of: person
comment: Relazione tra Music Festival e Scientist @it
range: scientist
type: ObjectProperty
comment: Relation between Music Festival and Scientist

links to Soccer Player
sub property of: person
type: ObjectProperty
domain: music festival
comment: Relation between Music Festival and Soccer Player
comment: Relazione tra Music Festival e Soccer Player @it
range: soccer player

drug
type: ObjectProperty
label: médicament @fr
type: Class

magazine
label: περιοδικό @el
type: Class

links to Town
type: NamedIndividual
related match: location
comment: Relation between Music Festival and Town
type: ObjectProperty
sub property of: place
range: town
domain: music festival
comment: Relazione tra Music Festival e Town @it

links to Basketball Player
type: ObjectProperty
range: basketball player
sub property of: person
comment: Relation between Music Festival and Basketball Player
domain: music festival
comment: Relazione tra Music Festival e Basketball Player @it

award
type: ObjectProperty
label: récompense @fr
type: Class

sport
type: Class

anatomical structure
label: structure anatomique @fr
type: ObjectProperty

restaurant
type: Class

cricketer
label: joueur de cricket @fr
type: Class

single
type: Class

links to Senator
comment: Relazione tra Music Festival e Senator @it
range: senator
type: ObjectProperty
domain: music festival
comment: Relation between Music Festival and Senator
sub property of: person

links to Christian Bishop
range: Christian Bishop
comment: Relation between Music Festival and Christian Bishop
comment: Relazione tra Music Festival e Christian Bishop @it
type: ObjectProperty
sub property of: person
domain: music festival

town
type: Class
label: ville @fr

university
type: Class
label: université @fr
label: πανεπιστήμιο @el

links to Comedian
type: ObjectProperty
comment: Relation between Music Festival and Comedian
comment: Relazione tra Music Festival e Comedian @it
sub property of: person
range: comedian
domain: music festival

ethnic group
type: Class
type: ObjectProperty
label: groupe ethnique @fr

artery
label: artère @fr
type: Class
label: Arterie @de

hotel
label: hôtel @fr
type: Class

links to Fish
sub property of: species
comment: Relation between Music Festival and Fish
domain: music festival
comment: Relazione tra Music Festival e Fish @it
type: ObjectProperty
range: fish

music festival
type: Class
label: festival de musique @fr

college coach
type: Class
label: entraîneur universitaire @fr

television episode
label: épisode télévisé @fr
type: Class

village
type: Class
label: χωριό @el

links to Architect
comment: Relazione tra Music Festival e Architect @it
range: architect
domain: music festival
type: ObjectProperty
sub property of: person
comment: Relation between Music Festival and Architect

links to Colour
domain: music festival
type: ObjectProperty
comment: Relazione tra Music Festival e Colour @it
sub property of: colour
range: colour
comment: Relation between Music Festival and Colour

soccer club
label: club de football @fr
type: Class

links to Ski Area
comment: Relazione tra Music Festival e Ski Area @it
comment: Relation between Music Festival and Ski Area
type: ObjectProperty
domain: music festival
sub property of: place
range: ski area

links to Convention
comment: Relazione tra Music Festival e Convention @it
sub property of: event
type: ObjectProperty
comment: Relation between Music Festival and Convention
range: convention
domain: music festival

office holder
label: titulaire @fr
label: Amtsinhaber @de
type: Class

baseball player
type: Class
label: joueur de baseball @fr

military conflict
type: Class
label: conflit militaire @fr

website
label: Ιστότοπος @el
label: site web @fr
type: Class
type: ObjectProperty

links to School
comment: Relazione tra Music Festival e School @it
range: school
domain: music festival
comment: Relation between Music Festival and School
type: ObjectProperty
sub property of: organização

links to Ethnic Group
domain: music festival
comment: Relation between Music Festival and Ethnic Group
range: ethnic group
sub property of: ethnic group
comment: Relazione tra Music Festival e Ethnic Group @it
type: ObjectProperty

links to Protected Area
domain: music festival
comment: Relation between Music Festival and Protected Area
type: ObjectProperty
comment: Relazione tra Music Festival e Protected Area @it
range: protected area
sub property of: place

basketball player
type: Class
label: joueur de basketball @fr

adult actor
label: erwachsener Schauspieler @de
type: Class
label: acteur adulte @fr

links to Saint
domain: music festival
type: ObjectProperty
comment: Relazione tra Music Festival e Saint @it
sub property of: person
comment: Relation between Music Festival and Saint
range: saint

links to Musical
comment: Relazione tra Music Festival e Musical @it
type: ObjectProperty
comment: Relation between Music Festival and Musical
sub property of: work
range: musical
domain: music festival

links to Television Show
comment: Relazione tra Music Festival e Television Show @it
range: television show
type: ObjectProperty
sub property of: work
comment: Relation between Music Festival and Television Show
domain: music festival

mountain range
label: chaîne de montagne @fr
type: Class

Christian Bishop
label: évêque chrétien @fr
type: Class

links to Book
domain: music festival
range: book
comment: Relation between Music Festival and Book
comment: Relazione tra Music Festival e Book @it
sub property of: work
type: ObjectProperty

beverage
label: boisson @fr
type: Class
type: ObjectProperty

links to Broadcast
domain: music festival
comment: Relation between Music Festival and Broadcast
range: broadcast
type: ObjectProperty
comment: Relazione tra Music Festival e Broadcast @it
sub property of: organização

sports league
label: ligue sportive @fr
type: Class

links to Writer
domain: music festival
comment: Relazione tra Music Festival e Writer @it
type: ObjectProperty
comment: Relation between Music Festival and Writer
sub property of: person
range: writer

planet
type: ObjectProperty
label: planète @fr
type: Class

scientist
label: Wissenschaftler @de
type: Class
label: scientifique @fr

links to Hotel
domain: music festival
comment: Relazione tra Music Festival e Hotel @it
type: ObjectProperty
range: hotel
sub property of: place
comment: Relation between Music Festival and Hotel

organização
type: ObjectProperty
label: organisation
label: Organisation @de

links to Mountain Range
domain: music festival
type: ObjectProperty
comment: Relazione tra Music Festival e Mountain Range @it
range: mountain range
sub property of: place
comment: Relation between Music Festival and Mountain Range

bridge
label: pont @fr
type: Class

links to Gaelic Games Player
sub property of: person
type: ObjectProperty
comment: Relazione tra Music Festival e Gaelic Games Player @it
domain: music festival
comment: Relation between Music Festival and Gaelic Games Player
range: Gaelic games player

broadcast
label: Émission de télévision @fr
type: Class

links to Airport
type: ObjectProperty
domain: music festival
range: airport
comment: Relazione tra Music Festival e Airport @it
comment: Relation between Music Festival and Airport
sub property of: place

mammal
type: Class
label: mammifère @fr

Eurovision song contest entry
label: concours Eurovision de la chanson @fr
type: Class

island
label: île @fr
label: νησί @el
type: Class

links to Mayor
sub property of: person
comment: Relazione tra Music Festival e Mayor @it
range: mayor
domain: music festival
comment: Relation between Music Festival and Mayor
type: ObjectProperty

comics character
label: personnage de bandes dessinées @fr
type: Class

event
type: ObjectProperty
label: évènement @fr

links to Non- Profit Organisation
sub property of: organização
domain: music festival
range: non-profit organisation
comment: Relazione tra Music Festival e Non- Profit Organisation @it
comment: Relation between Music Festival and Non- Profit Organisation
type: ObjectProperty

Formula One racer
type: Class
label: pilote de formule 1 @fr

links to Sports League
domain: music festival
type: ObjectProperty
range: sports league
comment: Relazione tra Music Festival e Sports League @it
comment: Relation between Music Festival and Sports League
sub property of: organização

skyscraper
type: Class
label: gratte-ciel @fr

radio station
type: Class
label: station de radio @fr

member of parliament
label: membre du Parlement @fr
type: Class

links to British Royalty
type: NamedIndividual
related match: founders
sub property of: person
comment: Relation between Music Festival and British Royalty
range: British royalty
comment: Relazione tra Music Festival e British Royalty @it
domain: music festival
type: ObjectProperty

airport
label: aéroport @fr
label: Flughafen @de
type: Class