disease
label: maladie @fr
type: Class
type: ObjectProperty

links to Judge
domain: music genre
range: judge
sub property of: person
type: ObjectProperty
comment: Relazione tra Music Genre e Judge @it
comment: Relation between Music Genre and Judge

automobile
type: Class

Election
label: élection @fr
type: Class

links to Olympics
domain: music genre
comment: Relation between Music Genre and Olympics
comment: Relazione tra Music Genre e Olympics @it
sub property of: event
range: olympics
type: ObjectProperty

mean of transportation
type: ObjectProperty
label: moyen de transport @fr

american football player
label: joueur de football américain @fr
type: Class

stadium
label: stade @fr
type: Class

links to Military Unit
comment: Relation between Music Genre and Military Unit
sub property of: organização
type: ObjectProperty
comment: Relazione tra Music Genre e Military Unit @it
domain: music genre
range: military unit

amphibian
label: amphibien @fr
type: Class

pope
type: Class
label: pape @fr

links to President
range: president
comment: Relazione tra Music Genre e President @it
type: ObjectProperty
domain: music genre
sub property of: person
comment: Relation between Music Genre and President

species
label: espèce @fr
type: ObjectProperty

newspaper
label: journal @fr
type: Class

protected area
label: aire protégée @fr
label: προστατευμένη περιοχή @el
type: Class

game
type: Class
label: jeu @fr

road
label: route @fr
type: Class

links to Sport
domain: music genre
comment: Relation between Music Genre and Sport
sub property of: activity
range: sport
comment: Relazione tra Music Genre e Sport @it
type: ObjectProperty

boxer
label: boxeur @fr
type: Class

judge
type: Class
label: juge @fr

World Heritage Site
label: site du patrimoine mondial @fr
type: Class

links to Amphibian
comment: Relazione tra Music Genre e Amphibian @it
comment: Relation between Music Genre and Amphibian
type: ObjectProperty
sub property of: species
domain: music genre
range: amphibian

links to Bird
comment: Relazione tra Music Genre e Bird @it
comment: Relation between Music Genre and Bird
domain: music genre
range: bird
sub property of: species
type: ObjectProperty

links to Anatomical Structure
domain: music genre
comment: Relation between Music Genre and Anatomical Structure
comment: Relazione tra Music Genre e Anatomical Structure @it
sub property of: anatomical structure
type: ObjectProperty
range: anatomical structure

lake
label: lac @fr
type: Class

links to Basketball Player
comment: Relazione tra Music Genre e Basketball Player @it
sub property of: person
range: basketball player
comment: Relation between Music Genre and Basketball Player
type: ObjectProperty
domain: music genre

links to Airport
range: airport
type: ObjectProperty
sub property of: place
domain: music genre
comment: Relazione tra Music Genre e Airport @it
comment: Relation between Music Genre and Airport

links to Office Holder
domain: music genre
comment: Relazione tra Music Genre e Office Holder @it
comment: Relation between Music Genre and Office Holder
type: ObjectProperty
range: office holder
sub property of: person

links to Ship
range: ship
domain: music genre
sub property of: mean of transportation
type: ObjectProperty
comment: Relazione tra Music Genre e Ship @it
comment: Relation between Music Genre and Ship

links to Music Festival
comment: Relazione tra Music Genre e Music Festival @it
comment: Relation between Music Genre and Music Festival
sub property of: event
domain: music genre
type: ObjectProperty
range: music festival

links to School
type: ObjectProperty
comment: Relation between Music Genre and School
range: school
comment: Relazione tra Music Genre e School @it
domain: music genre
sub property of: organização

governor
type: Class
label: gouverneur @fr

links to Village
comment: Relazione tra Music Genre e Village @it
sub property of: place
domain: music genre
range: village
comment: Relation between Music Genre and Village
type: ObjectProperty

work
type: ObjectProperty
label: travail @fr
label: obra @pt

river
label: rivière @fr
type: Class

links to Space Shuttle
comment: Relazione tra Music Genre e Space Shuttle @it
comment: Relation between Music Genre and Space Shuttle
sub property of: mean of transportation
type: ObjectProperty
range: space shuttle
domain: music genre

school
label: école @fr
type: Class

museum
type: Class
label: musée @fr

ship
type: Class
label: navire @fr

links to Award
domain: music genre
type: ObjectProperty
range: award
comment: Relazione tra Music Genre e Award @it
sub property of: award
comment: Relation between Music Genre and Award

tennis player
label: joueur de tennis @fr
type: Class

video game
label: jeux vidéo @fr
type: Class

British royalty
type: Class
label: royauté Britannique @fr

prime minister
label: premier ministre @fr
type: Class

historic place
label: site historique @fr
type: Class

links to Convention
comment: Relation between Music Genre and Convention
type: ObjectProperty
comment: Relazione tra Music Genre e Convention @it
sub property of: event
range: convention
domain: music genre

links to Military Conflict
domain: music genre
comment: Relation between Music Genre and Military Conflict
type: ObjectProperty
comment: Relazione tra Music Genre e Military Conflict @it
range: military conflict
sub property of: event

president
label: président @fr
type: Class

person
label: Person @de
type: ObjectProperty
label: pessoa @pt
label: personne @fr

military unit
label: unité militaire @fr
type: Class

links to Election
type: ObjectProperty
domain: music genre
sub property of: event
comment: Relation between Music Genre and Election
comment: Relazione tra Music Genre e Election @it
range: Election

soccer manager
label: entraîneur de football @fr
type: Class

basketball team
type: Class

links to Soccer Player
sub property of: person
comment: Relation between Music Genre and Soccer Player
range: soccer player
comment: Relazione tra Music Genre e Soccer Player @it
domain: music genre
type: ObjectProperty

music genre
type: Class
label: género musical @pt
label: genre musical @fr

crustacean
type: Class
label: crustacés @fr

links to Flowering Plant
range: flowering plant
domain: music genre
sub property of: species
comment: Relazione tra Music Genre e Flowering Plant @it
type: ObjectProperty
comment: Relation between Music Genre and Flowering Plant
related match: instruments
type: NamedIndividual

film festival
label: festival du film @fr
type: Class

links to Mountain
range: mountain
comment: Relazione tra Music Genre e Mountain @it
domain: music genre
comment: Relation between Music Genre and Mountain
type: ObjectProperty
sub property of: place

links to Legislature
sub property of: organização
range: legislature
comment: Relazione tra Music Genre e Legislature @it
type: ObjectProperty
domain: music genre
comment: Relation between Music Genre and Legislature

Axiom
dbpedia infobox matching weight: 100.0
annotated property: relatedMatch
annotated target: instruments
annotated source: links to Flowering Plant

comics creator
label: créateur de bandes dessinées @fr
type: Class

links to Game
domain: music genre
type: ObjectProperty
sub property of: activity
range: game
comment: Relazione tra Music Genre e Game @it
comment: Relation between Music Genre and Game

links to Prime Minister
domain: music genre
comment: Relation between Music Genre and Prime Minister
range: prime minister
sub property of: person
comment: Relazione tra Music Genre e Prime Minister @it
type: ObjectProperty

links to Weapon
comment: Relazione tra Music Genre e Weapon @it
comment: Relation between Music Genre and Weapon
type: ObjectProperty
sub property of: device
range: weapon
domain: music genre

soccer player
label: joueur de football @fr
type: Class

reptile
type: Class

MusicGenre.owl
extracted from: dbpedia.org
has author: Valentina Presutti
comment: MusicGenre Encyclopedic Knowledge Pattern
imports: cpannotationschema.owl
has author: Andrea Giovanni Nuzzolese
has author: Aldo Gangemi
has intent: To represent the encyclopedic knowledge expressed by an object typed as MusicGenre
extracted from: en.wikipedia.org
type: Ontology
imports: dbpediainfoboxmatchingweight.owl

legislature
label: pouvoir législatif @fr
type: Class

links to Tennis Player
comment: Relazione tra Music Genre e Tennis Player @it
range: tennis player
sub property of: person
domain: music genre
type: ObjectProperty
comment: Relation between Music Genre and Tennis Player

links to Website
sub property of: website
comment: Relation between Music Genre and Website
range: website
comment: Relazione tra Music Genre e Website @it
domain: music genre
type: ObjectProperty

monarch
type: Class
label: monarque @fr

congressman
label: membre du Congrès @fr
type: Class

Axiom
dbpedia infobox matching weight: 100.0
annotated property: relatedMatch
annotated source: links to Drug
annotated target: otherTopics

activity
type: ObjectProperty
label: Aktivität @de
label: activité @fr

journalist
type: Class
label: journaliste @fr

links to Television Episode
comment: Relation between Music Genre and Television Episode
comment: Relazione tra Music Genre e Television Episode @it
domain: music genre
sub property of: work
type: ObjectProperty
range: television episode

space mission
label: mission spatiale @fr
label: διαστημική αποστολή @el
type: Class

insect
type: Class
label: insecte @fr

links to Congressman
type: ObjectProperty
comment: Relation between Music Genre and Congressman
sub property of: person
comment: Relazione tra Music Genre e Congressman @it
domain: music genre
range: congressman

links to Mountain Range
comment: Relazione tra Music Genre e Mountain Range @it
sub property of: place
comment: Relation between Music Genre and Mountain Range
type: ObjectProperty
domain: music genre
range: mountain range

links to Drug
related match: otherTopics
type: NamedIndividual
comment: Relation between Music Genre and Drug
domain: music genre
comment: Relazione tra Music Genre e Drug @it
sub property of: drug
range: drug
type: ObjectProperty

links to World Heritage Site
range: World Heritage Site
comment: Relazione tra Music Genre e World Heritage Site @it
domain: music genre
type: ObjectProperty
sub property of: place
comment: Relation between Music Genre and World Heritage Site

links to Disease
comment: Relation between Music Genre and Disease
range: disease
comment: Relazione tra Music Genre e Disease @it
type: ObjectProperty
sub property of: disease
domain: music genre

links to Playboy Playmate
range: Playboy Playmate
sub property of: person
domain: music genre
type: ObjectProperty
comment: Relation between Music Genre and Playboy Playmate
comment: Relazione tra Music Genre e Playboy Playmate @it

bird
label: oiseau @fr
type: Class

links to Book
type: ObjectProperty
sub property of: work
domain: music genre
comment: Relation between Music Genre and Book
range: book
comment: Relazione tra Music Genre e Book @it

links to Senator
domain: music genre
comment: Relation between Music Genre and Senator
type: ObjectProperty
comment: Relazione tra Music Genre e Senator @it
range: senator
sub property of: person

links to Scientist
comment: Relazione tra Music Genre e Scientist @it
sub property of: person
range: scientist
type: ObjectProperty
domain: music genre
comment: Relation between Music Genre and Scientist

Axiom
dbpedia infobox matching weight: 100.0
annotated property: relatedMatch
annotated source: links to Member Of Parliament
annotated target: otherTopics

links to Governor
type: ObjectProperty
domain: music genre
comment: Relation between Music Genre and Governor
range: governor
sub property of: person
comment: Relazione tra Music Genre e Governor @it

links to Planet
domain: music genre
comment: Relation between Music Genre and Planet
type: ObjectProperty
comment: Relazione tra Music Genre e Planet @it
sub property of: planet
range: planet

park
label: parc @fr
type: Class

links to Road
range: road
comment: Relazione tra Music Genre e Road @it
comment: Relation between Music Genre and Road
type: ObjectProperty
sub property of: infrastructure
domain: music genre

Axiom
dbpedia infobox matching weight: 50.0
annotated property: relatedMatch
annotated source: links to Island
annotated target: regionalScenes

links to Protected Area
comment: Relation between Music Genre and Protected Area
type: ObjectProperty
domain: music genre
range: protected area
sub property of: place
comment: Relazione tra Music Genre e Protected Area @it

links to Non- Profit Organisation
sub property of: organização
range: non-profit organisation
comment: Relazione tra Music Genre e Non- Profit Organisation @it
domain: music genre
type: ObjectProperty
comment: Relation between Music Genre and Non- Profit Organisation

american football league
type: Class

links to Adult Actor
sub property of: person
domain: music genre
type: ObjectProperty
comment: Relazione tra Music Genre e Adult Actor @it
comment: Relation between Music Genre and Adult Actor
range: adult actor

musical
type: Class
label: musique @fr

place
type: ObjectProperty
label: περιοχή @el
label: lieu @fr
label: lugar @pt

links to Soccer Manager
comment: Relazione tra Music Genre e Soccer Manager @it
range: soccer manager
domain: music genre
comment: Relation between Music Genre and Soccer Manager
sub property of: person
type: ObjectProperty

links to Musical
domain: music genre
type: ObjectProperty
sub property of: work
comment: Relazione tra Music Genre e Musical @it
range: musical
comment: Relation between Music Genre and Musical

infrastructure
type: ObjectProperty

mountain
type: Class
label: montagne @fr
label: Βουνό @el

Axiom
dbpedia infobox matching weight: 50.0
annotated source: links to Island
annotated property: relatedMatch
annotated target: culturalOrigins

criminal
label: criminel @fr
type: Class

space shuttle
label: navette spatiale @fr
type: Class

flowering plant
label: angiospermes @fr
type: Class

links to Criminal
domain: music genre
type: ObjectProperty
comment: Relazione tra Music Genre e Criminal @it
comment: Relation between Music Genre and Criminal
sub property of: person
range: criminal

saint
type: Class

senator
type: Class
label: sénateur @fr

links to Newspaper
range: newspaper
comment: Relation between Music Genre and Newspaper
type: ObjectProperty
sub property of: work
domain: music genre
comment: Relazione tra Music Genre e Newspaper @it

comedian
label: comédien @fr
type: Class

links to Boxer
comment: Relazione tra Music Genre e Boxer @it
comment: Relation between Music Genre and Boxer
type: ObjectProperty
domain: music genre
sub property of: person
range: boxer

links to Canal
comment: Relazione tra Music Genre e Canal @it
comment: Relation between Music Genre and Canal
range: canal
sub property of: place
domain: music genre
type: ObjectProperty

links to Comedian
comment: Relation between Music Genre and Comedian
type: ObjectProperty
sub property of: person
domain: music genre
range: comedian
comment: Relazione tra Music Genre e Comedian @it

links to British Royalty
comment: Relation between Music Genre and British Royalty
comment: Relazione tra Music Genre e British Royalty @it
range: British royalty
domain: music genre
sub property of: person
type: ObjectProperty

Playboy Playmate
type: Class
label: playmate pour Playboy @fr

convention
type: Class
label: congrès @fr

book
label: książka @pl
label: llibre @ca
label: βιβλίο @el
label: livre @fr
type: Class

device
label: appareil @fr
type: ObjectProperty

shopping mall
type: Class
label: centre commercial @fr

links to Philosopher
range: philosopher
domain: music genre
type: ObjectProperty
comment: Relation between Music Genre and Philosopher
comment: Relazione tra Music Genre e Philosopher @it
sub property of: person

links to Basketball Team
type: ObjectProperty
comment: Relazione tra Music Genre e Basketball Team @it
sub property of: organização
comment: Relation between Music Genre and Basketball Team
range: basketball team
domain: music genre

non-profit organisation
type: Class
label: organisation à but non lucratif @fr

links to Historic Place
range: historic place
comment: Relazione tra Music Genre e Historic Place @it
type: ObjectProperty
sub property of: place
comment: Relation between Music Genre and Historic Place
domain: music genre

links to Island
type: ObjectProperty
related match: culturalOrigins
comment: Relation between Music Genre and Island
related match: regionalScenes
type: NamedIndividual
range: island
sub property of: place
comment: Relazione tra Music Genre e Island @it
domain: music genre

weapon
label: arme @fr
type: Class

drug
type: Class
label: médicament @fr
type: ObjectProperty

links to River
comment: Relazione tra Music Genre e River @it
comment: Relation between Music Genre and River
domain: music genre
range: river
sub property of: place
type: ObjectProperty

links to Mammal
comment: Relazione tra Music Genre e Mammal @it
domain: music genre
range: mammal
type: ObjectProperty
sub property of: species
comment: Relation between Music Genre and Mammal

canal
type: Class

military person
type: Class
label: militaire @fr

links to Automobile
domain: music genre
comment: Relation between Music Genre and Automobile
type: ObjectProperty
sub property of: mean of transportation
comment: Relazione tra Music Genre e Automobile @it
range: automobile

philosopher
label: philosophe @fr
type: Class

award
type: ObjectProperty
label: récompense @fr
type: Class

links to Beverage
domain: music genre
range: beverage
comment: Relazione tra Music Genre e Beverage @it
comment: Relation between Music Genre and Beverage
sub property of: beverage
type: ObjectProperty

links to Shopping Mall
sub property of: place
comment: Relation between Music Genre and Shopping Mall
type: ObjectProperty
range: shopping mall
comment: Relazione tra Music Genre e Shopping Mall @it
domain: music genre

links to Journalist
comment: Relazione tra Music Genre e Journalist @it
range: journalist
type: ObjectProperty
comment: Relation between Music Genre and Journalist
domain: music genre
sub property of: person

sport
type: Class

anatomical structure
type: Class
type: ObjectProperty
label: structure anatomique @fr

links to Military Person
comment: Relazione tra Music Genre e Military Person @it
domain: music genre
type: ObjectProperty
sub property of: person
comment: Relation between Music Genre and Military Person
range: military person

town
label: ville @fr
type: Class

links to Reptile
comment: Relazione tra Music Genre e Reptile @it
type: ObjectProperty
range: reptile
comment: Relation between Music Genre and Reptile
sub property of: species
domain: music genre

university
type: Class
label: université @fr
label: πανεπιστήμιο @el

links to Lake
sub property of: place
domain: music genre
range: lake
comment: Relation between Music Genre and Lake
comment: Relazione tra Music Genre e Lake @it
type: ObjectProperty

links to Crustacean
range: crustacean
type: ObjectProperty
sub property of: species
comment: Relazione tra Music Genre e Crustacean @it
domain: music genre
comment: Relation between Music Genre and Crustacean

links to Video Game
comment: Relazione tra Music Genre e Video Game @it
sub property of: work
range: video game
type: ObjectProperty
domain: music genre
comment: Relation between Music Genre and Video Game

links to Comics Creator
sub property of: person
type: ObjectProperty
range: comics creator
comment: Relation between Music Genre and Comics Creator
comment: Relazione tra Music Genre e Comics Creator @it
domain: music genre

links to Stadium
comment: Relation between Music Genre and Stadium
type: ObjectProperty
domain: music genre
range: stadium
comment: Relazione tra Music Genre e Stadium @it
sub property of: place

hotel
label: hôtel @fr
type: Class

music festival
label: festival de musique @fr
type: Class

television episode
label: épisode télévisé @fr
type: Class

village
label: χωριό @el
type: Class

links to Museum
comment: Relazione tra Music Genre e Museum @it
sub property of: place
type: ObjectProperty
comment: Relation between Music Genre and Museum
range: museum
domain: music genre

links to Radio Station
comment: Relation between Music Genre and Radio Station
comment: Relazione tra Music Genre e Radio Station @it
type: ObjectProperty
sub property of: organização
range: radio station
domain: music genre

links to Space Mission
comment: Relazione tra Music Genre e Space Mission @it
sub property of: event
domain: music genre
comment: Relation between Music Genre and Space Mission
type: ObjectProperty
range: space mission

links to Baseball Player
comment: Relation between Music Genre and Baseball Player
range: baseball player
sub property of: person
type: ObjectProperty
domain: music genre
comment: Relazione tra Music Genre e Baseball Player @it

office holder
label: titulaire @fr
label: Amtsinhaber @de
type: Class

baseball player
label: joueur de baseball @fr
type: Class

military conflict
type: Class
label: conflit militaire @fr

website
label: site web @fr
label: Ιστότοπος @el
type: Class
type: ObjectProperty

basketball player
type: Class
label: joueur de basketball @fr

adult actor
label: acteur adulte @fr
type: Class
label: erwachsener Schauspieler @de

links to American Football League
comment: Relazione tra Music Genre e American Football League @it
sub property of: organização
comment: Relation between Music Genre and American Football League
type: ObjectProperty
domain: music genre
range: american football league

links to Park
range: park
domain: music genre
comment: Relation between Music Genre and Park
sub property of: place
comment: Relazione tra Music Genre e Park @it
type: ObjectProperty

mountain range
label: chaîne de montagne @fr
type: Class

beverage
type: ObjectProperty
type: Class
label: boisson @fr

links to Eurovision Song Contest Entry
comment: Relazione tra Music Genre e Eurovision Song Contest Entry @it
type: ObjectProperty
range: Eurovision song contest entry
sub property of: work
domain: music genre
comment: Relation between Music Genre and Eurovision Song Contest Entry

planet
type: Class
label: planète @fr
type: ObjectProperty

links to Monarch
type: ObjectProperty
domain: music genre
comment: Relazione tra Music Genre e Monarch @it
comment: Relation between Music Genre and Monarch
range: monarch
sub property of: person

links to Town
comment: Relation between Music Genre and Town
comment: Relazione tra Music Genre e Town @it
domain: music genre
sub property of: place
range: town
type: ObjectProperty

scientist
label: scientifique @fr
type: Class
label: Wissenschaftler @de

links to Comics Character
domain: music genre
comment: Relation between Music Genre and Comics Character
sub property of: person
range: comics character
comment: Relazione tra Music Genre e Comics Character @it
type: ObjectProperty

olympics
type: Class
label: Jeux Olympiques @fr

organização
type: ObjectProperty
label: organisation
label: Organisation @de

links to University
domain: music genre
comment: Relazione tra Music Genre e University @it
comment: Relation between Music Genre and University
range: university
sub property of: organização
type: ObjectProperty

links to Insect
range: insect
domain: music genre
sub property of: species
comment: Relazione tra Music Genre e Insect @it
type: ObjectProperty
comment: Relation between Music Genre and Insect

broadcast
label: Émission de télévision @fr
type: Class

mammal
label: mammifère @fr
type: Class

links to Saint
domain: music genre
comment: Relazione tra Music Genre e Saint @it
comment: Relation between Music Genre and Saint
type: ObjectProperty
sub property of: person
range: saint

Eurovision song contest entry
type: Class
label: concours Eurovision de la chanson @fr

island
type: Class
label: νησί @el
label: île @fr

links to Film Festival
domain: music genre
range: film festival
comment: Relation between Music Genre and Film Festival
sub property of: event
comment: Relazione tra Music Genre e Film Festival @it
type: ObjectProperty

comics character
label: personnage de bandes dessinées @fr
type: Class

event
label: évènement @fr
type: ObjectProperty

radio station
label: station de radio @fr
type: Class

member of parliament
label: membre du Parlement @fr
type: Class

links to Broadcast
type: ObjectProperty
range: broadcast
sub property of: organização
domain: music genre
comment: Relazione tra Music Genre e Broadcast @it
comment: Relation between Music Genre and Broadcast

links to American Football Player
range: american football player
comment: Relation between Music Genre and American Football Player
sub property of: person
comment: Relazione tra Music Genre e American Football Player @it
domain: music genre
type: ObjectProperty

links to Hotel
comment: Relation between Music Genre and Hotel
domain: music genre
sub property of: place
comment: Relazione tra Music Genre e Hotel @it
range: hotel
type: ObjectProperty

links to Member Of Parliament
comment: Relation between Music Genre and Member Of Parliament
range: member of parliament
domain: music genre
comment: Relazione tra Music Genre e Member Of Parliament @it
type: ObjectProperty
sub property of: person
related match: otherTopics
type: NamedIndividual

links to Pope
sub property of: person
type: ObjectProperty
domain: music genre
comment: Relazione tra Music Genre e Pope @it
range: pope
comment: Relation between Music Genre and Pope

airport
type: Class
label: Flughafen @de
label: aéroport @fr