links to Philosopher
sub property of: person
comment: Relazione tra Musical Artist e Philosopher @it
comment: Relation between Musical Artist and Philosopher
type: ObjectProperty
range: philosopher
domain: musical artist

links to Radio Station
comment: Relazione tra Musical Artist e Radio Station @it
sub property of: organisation
range: radio station
comment: Relation between Musical Artist and Radio Station
domain: musical artist
type: ObjectProperty

links to Fern
comment: Relation between Musical Artist and Fern
range: fern
domain: musical artist
type: ObjectProperty
sub property of: species
comment: Relazione tra Musical Artist e Fern @it

automobile
type: Class

colour
type: ObjectProperty
label: χρώμα @el
label: couleur @fr
type: Class

Election
type: Class
label: élection @fr

mean of transportation
type: ObjectProperty
label: moyen de transport @fr

links to Skyscraper
range: skyscraper
domain: musical artist
comment: Relazione tra Musical Artist e Skyscraper @it
sub property of: place
type: ObjectProperty
comment: Relation between Musical Artist and Skyscraper

soccer league
type: Class
label: ligue de football @fr

links to Aircraft
type: ObjectProperty
range: aircraft
domain: musical artist
sub property of: mean of transportation
comment: Relation between Musical Artist and Aircraft
comment: Relazione tra Musical Artist e Aircraft @it

links to Baseball Player
comment: Relation between Musical Artist and Baseball Player
domain: musical artist
sub property of: person
range: baseball player
comment: Relazione tra Musical Artist e Baseball Player @it
type: ObjectProperty

links to Fungus
range: fungus
comment: Relazione tra Musical Artist e Fungus @it
domain: musical artist
sub property of: species
comment: Relation between Musical Artist and Fungus
type: ObjectProperty

links to School
comment: Relazione tra Musical Artist e School @it
type: ObjectProperty
sub property of: organisation
domain: musical artist
comment: Relation between Musical Artist and School
range: school

Axiom
dbpedia infobox matching weight: 100.0
annotated property: relatedMatch
annotated source: links to Soccer Club
annotated target: clubs

links to Weapon
comment: Relation between Musical Artist and Weapon
type: ObjectProperty
sub property of: device
domain: musical artist
comment: Relazione tra Musical Artist e Weapon @it
range: weapon

Axiom
dbpedia infobox matching weight: 100.0
annotated target: label
annotated property: relatedMatch
annotated source: links to Television Episode

wrestler
label: lutteur @fr
type: Class

links to Sport
domain: musical artist
comment: Relazione tra Musical Artist e Sport @it
range: sport
comment: Relation between Musical Artist and Sport
type: ObjectProperty
sub property of: activity

species
label: espèce @fr
type: ObjectProperty

Axiom
dbpedia infobox matching weight: 100.0
annotated source: links to Language
annotated target: genre
annotated property: relatedMatch

links to Canadian Football Team
range: canadian football team
type: ObjectProperty
comment: Relation between Musical Artist and Canadian Football Team
sub property of: organisation
domain: musical artist
comment: Relazione tra Musical Artist e Canadian Football Team @it

links to Road
comment: Relazione tra Musical Artist e Road @it
sub property of: infrastructure
range: road
comment: Relation between Musical Artist and Road
type: ObjectProperty
domain: musical artist

road
label: route @fr
type: Class

boxer
type: Class
label: boxeur @fr

judge
label: juge @fr
type: Class

links to Soccer League
type: ObjectProperty
range: soccer league
comment: Relazione tra Musical Artist e Soccer League @it
comment: Relation between Musical Artist and Soccer League
domain: musical artist
sub property of: organisation

World Heritage Site
label: site du patrimoine mondial @fr
type: Class

links to Soccer Player
comment: Relazione tra Musical Artist e Soccer Player @it
comment: Relation between Musical Artist and Soccer Player
sub property of: person
range: soccer player
domain: musical artist
type: ObjectProperty
related match: members
type: NamedIndividual

station
type: Class

Axiom
dbpedia infobox matching weight: 100.0
annotated property: relatedMatch
annotated source: links to Soccer Player
annotated target: members

links to Formula One Racer
range: Formula One racer
sub property of: person
comment: Relation between Musical Artist and Formula One Racer
comment: Relazione tra Musical Artist e Formula One Racer @it
domain: musical artist
type: ObjectProperty

lake
type: Class
label: lac @fr

arachnid
label: arachnides @fr
type: Class

links to National Collegiate Athletic Association Athlete
range: national collegiate athletic association athlete
domain: musical artist
comment: Relazione tra Musical Artist e National Collegiate Athletic Association Athlete @it
comment: Relation between Musical Artist and National Collegiate Athletic Association Athlete
sub property of: person
type: ObjectProperty

governor
type: Class
label: gouverneur @fr

links to Fish
type: ObjectProperty
comment: Relation between Musical Artist and Fish
comment: Relazione tra Musical Artist e Fish @it
range: fish
domain: musical artist
sub property of: species

poker player
type: Class
label: joueur de poker @fr

links to Airport
domain: musical artist
type: ObjectProperty
sub property of: place
comment: Relation between Musical Artist and Airport
comment: Relazione tra Musical Artist e Airport @it
range: airport
type: NamedIndividual
related match: associatedActs

fish
type: Class
label: poisson @fr

ship
label: navire @fr
type: Class

tennis player
label: joueur de tennis @fr
type: Class

links to Prime Minister
type: ObjectProperty
sub property of: person
comment: Relation between Musical Artist and Prime Minister
comment: Relazione tra Musical Artist e Prime Minister @it
range: prime minister
domain: musical artist

links to Grand Prix
comment: Relation between Musical Artist and Grand Prix
type: ObjectProperty
domain: musical artist
range: Grand Prix
comment: Relazione tra Musical Artist e Grand Prix @it
sub property of: event

prime minister
label: premier ministre @fr
type: Class

Axiom
dbpedia infobox matching weight: 100.0
annotated property: relatedMatch
annotated source: links to Ice Hockey Player
annotated target: associatedActs

race
label: course @fr
type: Class

hospital
label: hôpital @fr
type: Class

links to Pope
comment: Relazione tra Musical Artist e Pope @it
type: ObjectProperty
sub property of: person
comment: Relation between Musical Artist and Pope
domain: musical artist
range: pope

links to Game
comment: Relazione tra Musical Artist e Game @it
type: ObjectProperty
domain: musical artist
range: game
sub property of: activity
comment: Relation between Musical Artist and Game

Axiom
dbpedia infobox matching weight: 100.0
annotated source: links to Wrestler
annotated target: trainer
annotated property: relatedMatch

Axiom
dbpedia infobox matching weight: 100.0
annotated source: links to Historic Place
annotated property: relatedMatch
annotated target: origin

links to Golf League
range: golf league
domain: musical artist
comment: Relazione tra Musical Artist e Golf League @it
type: ObjectProperty
comment: Relation between Musical Artist and Golf League
sub property of: organisation

president
type: Class
label: président @fr

links to Island
related match: origin
domain: musical artist
type: NamedIndividual
sub property of: place
range: island
related match: born
type: ObjectProperty
comment: Relazione tra Musical Artist e Island @it
comment: Relation between Musical Artist and Island

links to Olympic Result
range: olympic result
comment: Relazione tra Musical Artist e Olympic Result @it
comment: Relation between Musical Artist and Olympic Result
domain: musical artist
type: ObjectProperty
sub property of: olympic result

links to Model
related match: after
type: NamedIndividual
type: ObjectProperty
range: model
comment: Relation between Musical Artist and Model
comment: Relazione tra Musical Artist e Model @it
domain: musical artist
sub property of: person

moss
type: Class
label: mousses @fr

links to Film Festival
type: ObjectProperty
range: film festival
comment: Relation between Musical Artist and Film Festival
sub property of: event
domain: musical artist
comment: Relazione tra Musical Artist e Film Festival @it

military unit
type: Class
label: unité militaire @fr

links to Artery
type: ObjectProperty
domain: musical artist
range: artery
sub property of: anatomical structure
comment: Relation between Musical Artist and Artery
comment: Relazione tra Musical Artist e Artery @it

soccer manager
type: Class
label: entraîneur de football @fr

basketball team
type: Class

Axiom
dbpedia infobox matching weight: 50.0
annotated source: links to Island
annotated property: relatedMatch
annotated target: born

Axiom
dbpedia infobox matching weight: 100.0
annotated target: associatedActs
annotated property: relatedMatch
annotated source: links to Cricketer

links to Crustacean
domain: musical artist
sub property of: species
comment: Relazione tra Musical Artist e Crustacean @it
range: crustacean
comment: Relation between Musical Artist and Crustacean
type: ObjectProperty

links to Historic Place
sub property of: place
range: historic place
comment: Relazione tra Musical Artist e Historic Place @it
comment: Relation between Musical Artist and Historic Place
domain: musical artist
type: ObjectProperty
related match: origin
type: NamedIndividual

links to Election
type: ObjectProperty
sub property of: event
domain: musical artist
range: Election
comment: Relazione tra Musical Artist e Election @it
comment: Relation between Musical Artist and Election

links to World Heritage Site
sub property of: place
domain: musical artist
type: ObjectProperty
comment: Relazione tra Musical Artist e World Heritage Site @it
range: World Heritage Site
comment: Relation between Musical Artist and World Heritage Site

crustacean
type: Class
label: crustacés @fr

olympic result
type: ObjectProperty
type: Class
label: résultat de Jeux Olympiques @fr

film festival
label: festival du film @fr
type: Class

links to Trade Union
comment: Relation between Musical Artist and Trade Union
sub property of: organisation
domain: musical artist
comment: Relazione tra Musical Artist e Trade Union @it
range: trade union
type: ObjectProperty

Axiom
dbpedia infobox matching weight: 66.67
annotated property: relatedMatch
annotated source: links to Journalist
annotated target: before

links to Station
type: ObjectProperty
sub property of: place
comment: Relazione tra Musical Artist e Station @it
range: station
comment: Relation between Musical Artist and Station
domain: musical artist

links to Comics Character
comment: Relation between Musical Artist and Comics Character
sub property of: person
range: comics character
type: ObjectProperty
domain: musical artist
comment: Relazione tra Musical Artist e Comics Character @it

aircraft
label: avion @fr
type: Class
label: αεροσκάφος @el

Axiom
dbpedia infobox matching weight: 100.0
annotated target: associatedActs
annotated property: relatedMatch
annotated source: links to Book

links to Military Conflict
domain: musical artist
type: ObjectProperty
comment: Relazione tra Musical Artist e Military Conflict @it
comment: Relation between Musical Artist and Military Conflict
range: military conflict
sub property of: event

legislature
type: Class
label: pouvoir législatif @fr

airline
type: Class
label: compagnie aérienne @fr

Axiom
dbpedia infobox matching weight: 100.0
annotated property: relatedMatch
annotated target: after
annotated source: links to American Football Player

links to Museum
type: ObjectProperty
sub property of: place
comment: Relazione tra Musical Artist e Museum @it
range: museum
domain: musical artist
comment: Relation between Musical Artist and Museum

monarch
label: monarque @fr
type: Class

links to Nascar Driver
sub property of: person
type: ObjectProperty
comment: Relazione tra Musical Artist e Nascar Driver @it
comment: Relation between Musical Artist and Nascar Driver
range: nascar driver
domain: musical artist

golf player
type: Class
label: golfeur @fr

nascar driver
type: Class
label: pilote de la nascar @fr

space mission
type: Class
label: διαστημική αποστολή @el
label: mission spatiale @fr

insect
type: Class
label: insecte @fr

links to Soccer Club
range: soccer club
type: ObjectProperty
comment: Relazione tra Musical Artist e Soccer Club @it
sub property of: organisation
domain: musical artist
comment: Relation between Musical Artist and Soccer Club
type: NamedIndividual
related match: clubs

links to American Football League
range: american football league
comment: Relation between Musical Artist and American Football League
domain: musical artist
type: ObjectProperty
comment: Relazione tra Musical Artist e American Football League @it
sub property of: organisation

links to Lake
comment: Relation between Musical Artist and Lake
type: ObjectProperty
range: lake
domain: musical artist
comment: Relazione tra Musical Artist e Lake @it
sub property of: place

Axiom
dbpedia infobox matching weight: 80.0
annotated source: links to Comedian
annotated target: associatedActs
annotated property: relatedMatch

links to Canal
type: ObjectProperty
range: canal
comment: Relazione tra Musical Artist e Canal @it
sub property of: place
comment: Relation between Musical Artist and Canal
domain: musical artist

Supreme Court of the United States case
label: cas juridique de la Cour suprême des États-Unis @fr
type: Class

Axiom
dbpedia infobox matching weight: 100.0
annotated property: relatedMatch
annotated target: associatedActs
annotated source: links to Office Holder

Gaelic games player
label: joueur de sports gaéliques @fr
type: Class

links to Comedian
comment: Relazione tra Musical Artist e Comedian @it
range: comedian
sub property of: person
domain: musical artist
related match: associatedActs
type: ObjectProperty
related match: before
comment: Relation between Musical Artist and Comedian
type: NamedIndividual

musical artist
label: musicien @fr
type: Class
label: artista musical @pt

fungus
type: Class
label: fungi @fr

links to Soccer Manager
domain: musical artist
range: soccer manager
sub property of: person
comment: Relazione tra Musical Artist e Soccer Manager @it
type: ObjectProperty
comment: Relation between Musical Artist and Soccer Manager

links to Video Game
type: ObjectProperty
comment: Relation between Musical Artist and Video Game
domain: musical artist
sub property of: work
range: video game
comment: Relazione tra Musical Artist e Video Game @it
type: NamedIndividual
related match: associatedActs

links to Basketball League
comment: Relazione tra Musical Artist e Basketball League @it
type: ObjectProperty
comment: Relation between Musical Artist and Basketball League
domain: musical artist
sub property of: organisation
range: basketball league

brain
label: cerveau @fr
type: Class

park
type: Class
label: parc @fr

cardinal
type: Class

rugby player
label: joueur de rugby @fr
type: Class

Axiom
dbpedia infobox matching weight: 100.0
annotated source: links to Hospital
annotated target: died
annotated property: relatedMatch

american football league
type: Class

cyclist
label: cycliste @fr
type: Class

links to Judge
sub property of: person
domain: musical artist
comment: Relation between Musical Artist and Judge
range: judge
type: ObjectProperty
comment: Relazione tra Musical Artist e Judge @it

national collegiate athletic association athlete
type: Class
label: athlète de la national collegiate athletic association @fr

links to Governor
range: governor
sub property of: person
domain: musical artist
type: ObjectProperty
comment: Relazione tra Musical Artist e Governor @it
comment: Relation between Musical Artist and Governor

links to Badminton Player
type: ObjectProperty
domain: musical artist
comment: Relazione tra Musical Artist e Badminton Player @it
range: badminton player
sub property of: person
comment: Relation between Musical Artist and Badminton Player

wrestling event
type: Class
label: match de catch @fr

links to River
domain: musical artist
comment: Relation between Musical Artist and River
range: river
type: ObjectProperty
comment: Relazione tra Musical Artist e River @it
sub property of: place

links to Comics Creator
type: ObjectProperty
range: comics creator
comment: Relation between Musical Artist and Comics Creator
comment: Relazione tra Musical Artist e Comics Creator @it
domain: musical artist
sub property of: person

links to Rugby League
range: rugby league
sub property of: organisation
domain: musical artist
comment: Relazione tra Musical Artist e Rugby League @it
comment: Relation between Musical Artist and Rugby League
type: ObjectProperty

basketball league
type: Class
label: ligue de basketball @fr

links to Bird
comment: Relazione tra Musical Artist e Bird @it
domain: musical artist
sub property of: species
range: bird
type: ObjectProperty
comment: Relation between Musical Artist and Bird

saint
type: Class

senator
type: Class
label: sénateur @fr

valley
type: Class
label: vallée @fr

convention
label: congrès @fr
type: Class

links to Hotel
sub property of: place
range: hotel
comment: Relazione tra Musical Artist e Hotel @it
type: ObjectProperty
comment: Relation between Musical Artist and Hotel
domain: musical artist

book
label: książka @pl
label: llibre @ca
label: βιβλίο @el
label: livre @fr
type: Class

device
type: ObjectProperty
label: appareil @fr

shopping mall
type: Class
label: centre commercial @fr

ski area
label: domaine skiable @fr
type: Class

non-profit organisation
type: Class
label: organisation à but non lucratif @fr

space station
type: Class
label: station spatiale @fr

Axiom
dbpedia infobox matching weight: 50.0
annotated property: relatedMatch
annotated target: origin
annotated source: links to Island

links to Brain
type: ObjectProperty
comment: Relazione tra Musical Artist e Brain @it
sub property of: anatomical structure
domain: musical artist
range: brain
comment: Relation between Musical Artist and Brain

canadian football league
type: Class

rugby league
type: Class
label: ligue de rugby @fr

Axiom
dbpedia infobox matching weight: 6.67
annotated target: placeOfDeath
annotated property: relatedMatch
annotated source: links to Town

weapon
type: Class
label: arme @fr

links to Bone
comment: Relazione tra Musical Artist e Bone @it
range: bone
type: ObjectProperty
domain: musical artist
sub property of: anatomical structure
comment: Relation between Musical Artist and Bone

links to Criminal
comment: Relazione tra Musical Artist e Criminal @it
comment: Relation between Musical Artist and Criminal
sub property of: person
domain: musical artist
range: criminal
type: ObjectProperty

links to Office Holder
domain: musical artist
type: ObjectProperty
comment: Relation between Musical Artist and Office Holder
sub property of: person
range: office holder
comment: Relazione tra Musical Artist e Office Holder @it
related match: associatedActs
type: NamedIndividual

links to Bacteria
range: bacteria
comment: Relazione tra Musical Artist e Bacteria @it
domain: musical artist
sub property of: species
type: ObjectProperty
comment: Relation between Musical Artist and Bacteria

philosopher
label: philosophe @fr
type: Class

Axiom
dbpedia infobox matching weight: 50.0
annotated property: relatedMatch
annotated source: links to Figure Skater
annotated target: formercoach

links to Television Episode
comment: Relazione tra Musical Artist e Television Episode @it
range: television episode
type: ObjectProperty
domain: musical artist
sub property of: work
comment: Relation between Musical Artist and Television Episode
related match: label
type: NamedIndividual

links to Protein
comment: Relation between Musical Artist and Protein
domain: musical artist
range: protein
type: ObjectProperty
comment: Relazione tra Musical Artist e Protein @it
sub property of: protein

sport
type: Class

Axiom
dbpedia infobox matching weight: 33.33
annotated source: links to Journalist
annotated property: relatedMatch
annotated target: associatedActs

restaurant
type: Class

nerve
label: nerf @fr
type: Class

links to Senator
domain: musical artist
range: senator
sub property of: person
comment: Relation between Musical Artist and Senator
type: ObjectProperty
comment: Relazione tra Musical Artist e Senator @it

links to Space Mission
type: ObjectProperty
range: space mission
domain: musical artist
comment: Relation between Musical Artist and Space Mission
sub property of: event
comment: Relazione tra Musical Artist e Space Mission @it

town
label: ville @fr
type: Class

links to Poker Player
related match: before
type: NamedIndividual
comment: Relazione tra Musical Artist e Poker Player @it
sub property of: person
comment: Relation between Musical Artist and Poker Player
domain: musical artist
type: ObjectProperty
range: poker player

links to Site Of Special Scientific Interest
sub property of: place
comment: Relation between Musical Artist and Site Of Special Scientific Interest
domain: musical artist
type: ObjectProperty
comment: Relazione tra Musical Artist e Site Of Special Scientific Interest @it
range: Site of Special Scientific Interest

artery
label: artère @fr
type: Class
label: Arterie @de

links to Ambassador
comment: Relation between Musical Artist and Ambassador
comment: Relazione tra Musical Artist e Ambassador @it
sub property of: person
domain: musical artist
type: ObjectProperty
range: ambassador

hotel
label: hôtel @fr
type: Class

music festival
type: Class
label: festival de musique @fr

links to Book
related match: associatedActs
type: NamedIndividual
domain: musical artist
comment: Relazione tra Musical Artist e Book @it
type: ObjectProperty
comment: Relation between Musical Artist and Book
range: book
sub property of: work

links to Rocket
comment: Relazione tra Musical Artist e Rocket @it
sub property of: mean of transportation
type: ObjectProperty
domain: musical artist
comment: Relation between Musical Artist and Rocket
range: rocket

links to Cricketer
related match: associatedActs
type: NamedIndividual
sub property of: person
range: cricketer
type: ObjectProperty
domain: musical artist
comment: Relation between Musical Artist and Cricketer
comment: Relazione tra Musical Artist e Cricketer @it

links to Playboy Playmate
comment: Relation between Musical Artist and Playboy Playmate
domain: musical artist
range: Playboy Playmate
comment: Relazione tra Musical Artist e Playboy Playmate @it
type: ObjectProperty
sub property of: person

muscle
type: Class

village
type: Class
label: χωριό @el

ice hockey league
type: Class
label: ligue d'hockey sur glace @fr

links to Field Hockey League
comment: Relazione tra Musical Artist e Field Hockey League @it
domain: musical artist
range: field hockey league
sub property of: organisation
type: ObjectProperty
comment: Relation between Musical Artist and Field Hockey League

office holder
label: titulaire @fr
label: Amtsinhaber @de
type: Class

links to College Coach
sub property of: person
comment: Relation between Musical Artist and College Coach
type: ObjectProperty
comment: Relazione tra Musical Artist e College Coach @it
domain: musical artist
range: college coach

baseball player
type: Class
label: joueur de baseball @fr

website
type: ObjectProperty
type: Class
label: site web @fr
label: Ιστότοπος @el

grape
label: raisin @fr
type: Class

links to Protected Area
sub property of: place
type: ObjectProperty
comment: Relazione tra Musical Artist e Protected Area @it
domain: musical artist
range: protected area
comment: Relation between Musical Artist and Protected Area

links to Music Festival
comment: Relazione tra Musical Artist e Music Festival @it
type: ObjectProperty
comment: Relation between Musical Artist and Music Festival
sub property of: event
range: music festival
domain: musical artist
related match: associatedActs
type: NamedIndividual

basketball player
label: joueur de basketball @fr
type: Class

links to Mountain
domain: musical artist
comment: Relation between Musical Artist and Mountain
sub property of: place
type: ObjectProperty
range: mountain
comment: Relazione tra Musical Artist e Mountain @it

adult actor
label: erwachsener Schauspieler @de
type: Class
label: acteur adulte @fr

ice hockey player
type: Class
label: joueur de hockey sur glace @fr

links to Language
type: NamedIndividual
related match: genre
domain: musical artist
comment: Relazione tra Musical Artist e Language @it
sub property of: language
comment: Relation between Musical Artist and Language
range: language
type: ObjectProperty

beverage
type: ObjectProperty
type: Class
label: boisson @fr

links to Ice Hockey Player
related match: associatedActs
type: NamedIndividual
range: ice hockey player
comment: Relazione tra Musical Artist e Ice Hockey Player @it
type: ObjectProperty
comment: Relation between Musical Artist and Ice Hockey Player
sub property of: person
domain: musical artist

planet
type: ObjectProperty
label: planète @fr
type: Class

links to Christian Bishop
type: ObjectProperty
sub property of: person
range: Christian Bishop
domain: musical artist
comment: Relazione tra Musical Artist e Christian Bishop @it
comment: Relation between Musical Artist and Christian Bishop

links to Canadian Football League
sub property of: organisation
comment: Relation between Musical Artist and Canadian Football League
comment: Relazione tra Musical Artist e Canadian Football League @it
range: canadian football league
type: ObjectProperty
domain: musical artist

scientist
label: scientifique @fr
label: Wissenschaftler @de
type: Class

golf league
type: Class
label: ligue de golf @fr

olympics
label: Jeux Olympiques @fr
type: Class

bridge
label: pont @fr
type: Class

links to Conifer
comment: Relation between Musical Artist and Conifer
range: conifer
sub property of: species
comment: Relazione tra Musical Artist e Conifer @it
domain: musical artist
type: ObjectProperty

island
label: île @fr
label: νησί @el
type: Class

links to Adult Actor
type: ObjectProperty
sub property of: person
domain: musical artist
comment: Relazione tra Musical Artist e Adult Actor @it
comment: Relation between Musical Artist and Adult Actor
range: adult actor

comics character
type: Class
label: personnage de bandes dessinées @fr

event
type: ObjectProperty
label: évènement @fr

skyscraper
label: gratte-ciel @fr
type: Class

Formula One racer
label: pilote de formule 1 @fr
type: Class

radio station
label: station de radio @fr
type: Class

links to Chancellor
domain: musical artist
comment: Relazione tra Musical Artist e Chancellor @it
range: chancellor
type: ObjectProperty
comment: Relation between Musical Artist and Chancellor
sub property of: person

links to Locomotive
range: locomotive
comment: Relation between Musical Artist and Locomotive
domain: musical artist
type: ObjectProperty
sub property of: mean of transportation
comment: Relazione tra Musical Artist e Locomotive @it

member of parliament
label: membre du Parlement @fr
type: Class

bone
type: Class
label: Knochen @de
label: os @fr

airport
type: Class
label: Flughafen @de
label: aéroport @fr

conifer
label: conifères @fr
type: Class

links to Amphibian
comment: Relazione tra Musical Artist e Amphibian @it
type: ObjectProperty
range: amphibian
sub property of: species
domain: musical artist
comment: Relation between Musical Artist and Amphibian

rocket
label: fusée @fr
type: Class

disease
type: ObjectProperty
type: Class
label: maladie @fr

links to Muscle
comment: Relazione tra Musical Artist e Muscle @it
domain: musical artist
type: ObjectProperty
range: muscle
comment: Relation between Musical Artist and Muscle
sub property of: anatomical structure

Axiom
dbpedia infobox matching weight: 50.0
annotated target: formerpartner
annotated property: relatedMatch
annotated source: links to Figure Skater

american football player
type: Class
label: joueur de football américain @fr

Legal Case
type: ObjectProperty
label: cas juridique @fr

stadium
type: Class
label: stade @fr

links to Mountain Range
comment: Relazione tra Musical Artist e Mountain Range @it
sub property of: place
domain: musical artist
type: ObjectProperty
comment: Relation between Musical Artist and Mountain Range
range: mountain range

links to Gaelic Games Player
type: ObjectProperty
range: Gaelic games player
sub property of: person
comment: Relazione tra Musical Artist e Gaelic Games Player @it
domain: musical artist
comment: Relation between Musical Artist and Gaelic Games Player

astronaut
label: astronaute @fr
label: Astronaut @de
type: Class

links to Restaurant
sub property of: place
range: restaurant
comment: Relation between Musical Artist and Restaurant
type: ObjectProperty
domain: musical artist
comment: Relazione tra Musical Artist e Restaurant @it

Site of Special Scientific Interest
label: site d'intérêt scientifique particulier @fr
type: Class

mayor
label: maire @fr
type: Class

amphibian
type: Class
label: amphibien @fr

pope
type: Class
label: pape @fr

links to Currency
range: currency
type: ObjectProperty
comment: Relazione tra Musical Artist e Currency @it
domain: musical artist
comment: Relation between Musical Artist and Currency
sub property of: currency

Axiom
dbpedia infobox matching weight: 40.0
annotated source: links to Town
annotated target: origin
annotated property: relatedMatch

newspaper
label: journal @fr
type: Class

protected area
label: aire protégée @fr
label: προστατευμένη περιοχή @el
type: Class

game
label: jeu @fr
type: Class

links to Hockey Team
comment: Relation between Musical Artist and Hockey Team
comment: Relazione tra Musical Artist e Hockey Team @it
sub property of: organisation
domain: musical artist
range: hockey team
type: ObjectProperty

language
type: ObjectProperty
label: langage @fr
type: Class

tennis league
label: ligue de tennis @fr
type: Class

links to Basketball Team
comment: Relazione tra Musical Artist e Basketball Team @it
range: basketball team
comment: Relation between Musical Artist and Basketball Team
sub property of: organisation
type: ObjectProperty
domain: musical artist

links to Musical
range: musical
sub property of: work
comment: Relation between Musical Artist and Musical
domain: musical artist
type: ObjectProperty
comment: Relazione tra Musical Artist e Musical @it
type: NamedIndividual
related match: associatedActs

links to Golf Player
sub property of: person
comment: Relazione tra Musical Artist e Golf Player @it
domain: musical artist
type: ObjectProperty
range: golf player
comment: Relation between Musical Artist and Golf Player

links to Beverage
range: beverage
comment: Relation between Musical Artist and Beverage
comment: Relazione tra Musical Artist e Beverage @it
type: ObjectProperty
sub property of: beverage
domain: musical artist

Axiom
dbpedia infobox matching weight: 100.0
annotated property: relatedMatch
annotated target: associatedActs
annotated source: links to Video Game

links to Ethnic Group
type: NamedIndividual
related match: occupation
range: ethnic group
sub property of: ethnic group
comment: Relazione tra Musical Artist e Ethnic Group @it
type: ObjectProperty
domain: musical artist
comment: Relation between Musical Artist and Ethnic Group

work
type: ObjectProperty
label: travail @fr
label: obra @pt

river
label: rivière @fr
type: Class

lacrosse league
type: Class
label: ligue de crosse @fr

school
type: Class
label: école @fr

museum
type: Class
label: musée @fr

video game
type: Class
label: jeux vidéo @fr

trade union
label: syndicat professionnel @fr
type: Class

currency
type: ObjectProperty
type: Class
label: devise @fr

British royalty
label: royauté Britannique @fr
type: Class

historic place
label: site historique @fr
type: Class

links to Shopping Mall
range: shopping mall
sub property of: place
domain: musical artist
comment: Relation between Musical Artist and Shopping Mall
type: ObjectProperty
comment: Relazione tra Musical Artist e Shopping Mall @it

links to Moss
range: moss
comment: Relazione tra Musical Artist e Moss @it
type: ObjectProperty
comment: Relation between Musical Artist and Moss
domain: musical artist
sub property of: species

links to Valley
domain: musical artist
comment: Relation between Musical Artist and Valley
sub property of: place
type: ObjectProperty
comment: Relazione tra Musical Artist e Valley @it
range: valley

links to Journalist
related match: associatedActs
related match: before
comment: Relation between Musical Artist and Journalist
comment: Relazione tra Musical Artist e Journalist @it
sub property of: person
range: journalist
type: NamedIndividual
type: ObjectProperty
domain: musical artist

links to Arachnid
type: ObjectProperty
comment: Relazione tra Musical Artist e Arachnid @it
sub property of: species
domain: musical artist
range: arachnid
comment: Relation between Musical Artist and Arachnid

links to British Royalty
domain: musical artist
range: British royalty
sub property of: person
comment: Relazione tra Musical Artist e British Royalty @it
type: ObjectProperty
comment: Relation between Musical Artist and British Royalty

links to Park
comment: Relation between Musical Artist and Park
domain: musical artist
sub property of: place
range: park
type: ObjectProperty
comment: Relazione tra Musical Artist e Park @it

continent
type: Class
label: ήπειρος @el

figure skater
label: patineur artistique @fr
type: Class

links to Legislature
range: legislature
domain: musical artist
sub property of: organisation
comment: Relazione tra Musical Artist e Legislature @it
type: ObjectProperty
comment: Relation between Musical Artist and Legislature

links to Historic Building
comment: Relazione tra Musical Artist e Historic Building @it
type: ObjectProperty
domain: musical artist
sub property of: place
comment: Relation between Musical Artist and Historic Building
range: historic building

links to Architect
range: architect
domain: musical artist
type: ObjectProperty
comment: Relation between Musical Artist and Architect
comment: Relazione tra Musical Artist e Architect @it
sub property of: person

person
label: Person @de
type: ObjectProperty
label: pessoa @pt
label: personne @fr

links to Award
comment: Relazione tra Musical Artist e Award @it
comment: Relation between Musical Artist and Award
sub property of: award
domain: musical artist
type: ObjectProperty
range: award
type: NamedIndividual
related match: title

Axiom
dbpedia infobox matching weight: 100.0
annotated target: associatedActs
annotated property: relatedMatch
annotated source: links to Ship

canadian football team
type: Class
label: équipe canadienne de football américain @fr

writer
label: écrivain @fr
type: Class

architect
type: Class
label: architecte @fr

model
type: Class
label: mannequin @fr

ambassador
type: Class
label: ambassadeur @fr

links to Insect
comment: Relation between Musical Artist and Insect
type: ObjectProperty
range: insect
sub property of: species
domain: musical artist
comment: Relazione tra Musical Artist e Insect @it

Axiom
dbpedia infobox matching weight: 100.0
annotated source: links to Poker Player
annotated property: relatedMatch
annotated target: before

links to Town
related match: origin
comment: Relation between Musical Artist and Town
range: town
related match: born
domain: musical artist
comment: Relazione tra Musical Artist e Town @it
type: NamedIndividual
related match: placeOfDeath
type: ObjectProperty
sub property of: place

links to Village
type: NamedIndividual
related match: died
comment: Relation between Musical Artist and Village
related match: origin
type: ObjectProperty
domain: musical artist
comment: Relazione tra Musical Artist e Village @it
range: village
sub property of: place

links to Basketball Player
domain: musical artist
comment: Relation between Musical Artist and Basketball Player
sub property of: person
range: basketball player
type: ObjectProperty
comment: Relazione tra Musical Artist e Basketball Player @it

Grand Prix
label: grand prix @fr
type: Class

chancellor
label: chancelier @fr
type: Class

comics creator
label: créateur de bandes dessinées @fr
type: Class

links to Continent
comment: Relation between Musical Artist and Continent
sub property of: place
domain: musical artist
comment: Relazione tra Musical Artist e Continent @it
type: ObjectProperty
range: continent

hockey team
label: équipe de hockey @fr
type: Class

links to Colour
comment: Relation between Musical Artist and Colour
range: colour
sub property of: colour
domain: musical artist
comment: Relazione tra Musical Artist e Colour @it
type: ObjectProperty

soccer player
label: joueur de football @fr
type: Class

links to Lacrosse League
type: ObjectProperty
domain: musical artist
comment: Relation between Musical Artist and Lacrosse League
comment: Relazione tra Musical Artist e Lacrosse League @it
sub property of: organisation
range: lacrosse league

links to Military Person
comment: Relation between Musical Artist and Military Person
domain: musical artist
range: military person
sub property of: person
type: ObjectProperty
comment: Relazione tra Musical Artist e Military Person @it

reptile
type: Class

links to Planet
sub property of: planet
comment: Relazione tra Musical Artist e Planet @it
domain: musical artist
comment: Relation between Musical Artist and Planet
range: planet
type: ObjectProperty

cave
label: grotte @fr
type: Class

congressman
label: membre du Congrès @fr
type: Class

links to Cyclist
sub property of: person
comment: Relation between Musical Artist and Cyclist
range: cyclist
comment: Relazione tra Musical Artist e Cyclist @it
type: ObjectProperty
domain: musical artist

Axiom
dbpedia infobox matching weight: 100.0
annotated source: links to Musical
annotated property: relatedMatch
annotated target: associatedActs

links to Newspaper
domain: musical artist
comment: Relation between Musical Artist and Newspaper
comment: Relazione tra Musical Artist e Newspaper @it
range: newspaper
sub property of: work
type: ObjectProperty

activity
label: activité @fr
label: Aktivität @de
type: ObjectProperty

journalist
type: Class
label: journaliste @fr

links to Boxer
comment: Relation between Musical Artist and Boxer
sub property of: person
range: boxer
type: ObjectProperty
domain: musical artist
comment: Relazione tra Musical Artist e Boxer @it

links to Wrestler
type: NamedIndividual
related match: trainer
sub property of: person
domain: musical artist
type: ObjectProperty
comment: Relazione tra Musical Artist e Wrestler @it
range: wrestler
comment: Relation between Musical Artist and Wrestler

american football team
label: équipe américaine de football américain @fr
type: Class

links to American Football Team
range: american football team
domain: musical artist
sub property of: organisation
comment: Relation between Musical Artist and American Football Team
comment: Relazione tra Musical Artist e American Football Team @it
type: ObjectProperty

links to Astronaut
range: astronaut
comment: Relation between Musical Artist and Astronaut
type: ObjectProperty
comment: Relazione tra Musical Artist e Astronaut @it
sub property of: person
domain: musical artist

chemical compound
type: Class
type: ObjectProperty
label: produit chimique @fr

bird
type: Class
label: oiseau @fr

links to Mayor
comment: Relation between Musical Artist and Mayor
range: mayor
domain: musical artist
type: ObjectProperty
comment: Relazione tra Musical Artist e Mayor @it
sub property of: person

fern
type: Class
label: fougères @fr

Axiom
dbpedia infobox matching weight: 100.0
annotated source: links to Model
annotated property: relatedMatch
annotated target: after

links to Airline
comment: Relazione tra Musical Artist e Airline @it
domain: musical artist
type: ObjectProperty
sub property of: organisation
range: airline
comment: Relation between Musical Artist and Airline

Axiom
dbpedia infobox matching weight: 100.0
annotated source: links to Award
annotated target: title
annotated property: relatedMatch

links to Rugby Player
comment: Relazione tra Musical Artist e Rugby Player @it
sub property of: person
type: ObjectProperty
range: rugby player
comment: Relation between Musical Artist and Rugby Player
domain: musical artist

links to Member Of Parliament
comment: Relazione tra Musical Artist e Member Of Parliament @it
sub property of: person
comment: Relation between Musical Artist and Member Of Parliament
domain: musical artist
type: ObjectProperty
range: member of parliament

links to Wrestling Event
sub property of: event
type: ObjectProperty
comment: Relazione tra Musical Artist e Wrestling Event @it
domain: musical artist
comment: Relation between Musical Artist and Wrestling Event
range: wrestling event

musical
label: musique @fr
type: Class

links to Disease
sub property of: disease
range: disease
domain: musical artist
comment: Relation between Musical Artist and Disease
comment: Relazione tra Musical Artist e Disease @it
type: ObjectProperty

links to Stadium
domain: musical artist
comment: Relation between Musical Artist and Stadium
type: ObjectProperty
range: stadium
comment: Relazione tra Musical Artist e Stadium @it
sub property of: place

links to Space Shuttle
range: space shuttle
comment: Relazione tra Musical Artist e Space Shuttle @it
comment: Relation between Musical Artist and Space Shuttle
type: ObjectProperty
domain: musical artist
sub property of: mean of transportation

place
label: lugar @pt
label: lieu @fr
label: περιοχή @el
type: ObjectProperty

links to Scientist
range: scientist
comment: Relation between Musical Artist and Scientist
domain: musical artist
type: ObjectProperty
sub property of: person
comment: Relazione tra Musical Artist e Scientist @it

links to Race
type: ObjectProperty
domain: musical artist
comment: Relazione tra Musical Artist e Race @it
range: race
sub property of: event
comment: Relation between Musical Artist and Race

infrastructure
type: ObjectProperty

Axiom
dbpedia infobox matching weight: 100.0
annotated target: associatedActs
annotated property: relatedMatch
annotated source: links to Music Festival

mountain
type: Class
label: montagne @fr
label: Βουνό @el

links to Nerve
type: ObjectProperty
comment: Relazione tra Musical Artist e Nerve @it
domain: musical artist
sub property of: anatomical structure
range: nerve
comment: Relation between Musical Artist and Nerve

links to Mixed Martial Arts Event
type: ObjectProperty
comment: Relazione tra Musical Artist e Mixed Martial Arts Event @it
domain: musical artist
comment: Relation between Musical Artist and Mixed Martial Arts Event
sub property of: event
range: mixed martial arts event

links to Ship
related match: associatedActs
type: NamedIndividual
comment: Relazione tra Musical Artist e Ship @it
comment: Relation between Musical Artist and Ship
domain: musical artist
range: ship
type: ObjectProperty
sub property of: mean of transportation

criminal
type: Class
label: criminel @fr

space shuttle
type: Class
label: navette spatiale @fr

Axiom
dbpedia infobox matching weight: 20.0
annotated target: before
annotated source: links to Comedian
annotated property: relatedMatch

comedian
type: Class
label: comédien @fr

green alga
type: Class
label: algue verte @fr

Playboy Playmate
type: Class
label: playmate pour Playboy @fr

links to Congressman
comment: Relation between Musical Artist and Congressman
domain: musical artist
sub property of: person
comment: Relazione tra Musical Artist e Congressman @it
range: congressman
type: ObjectProperty

Axiom
dbpedia infobox matching weight: 100.0
annotated target: occupation
annotated source: links to Ethnic Group
annotated property: relatedMatch

Axiom
dbpedia infobox matching weight: 53.33
annotated property: relatedMatch
annotated source: links to Town
annotated target: born

bacteria
type: Class
label: bactérie @fr

links to Motorcycle Racing League
comment: Relazione tra Musical Artist e Motorcycle Racing League @it
comment: Relation between Musical Artist and Motorcycle Racing League
sub property of: organisation
domain: musical artist
type: ObjectProperty
range: motorcycle racing league

links to Website
comment: Relazione tra Musical Artist e Website @it
domain: musical artist
range: website
comment: Relation between Musical Artist and Website
sub property of: website
type: ObjectProperty
type: NamedIndividual
related match: label

mollusca
type: Class
label: mollusque @fr

links to Chemical Compound
type: ObjectProperty
range: chemical compound
sub property of: chemical compound
domain: musical artist
comment: Relazione tra Musical Artist e Chemical Compound @it
comment: Relation between Musical Artist and Chemical Compound

Axiom
dbpedia infobox matching weight: 100.0
annotated target: label
annotated property: relatedMatch
annotated source: links to Website

links to Drug
domain: musical artist
sub property of: drug
comment: Relation between Musical Artist and Drug
range: drug
type: ObjectProperty
comment: Relazione tra Musical Artist e Drug @it

drug
type: Class
label: médicament @fr
type: ObjectProperty

links to College
range: college
domain: musical artist
comment: Relazione tra Musical Artist e College @it
sub property of: organisation
type: ObjectProperty
comment: Relation between Musical Artist and College

links to Space Station
comment: Relation between Musical Artist and Space Station
range: space station
sub property of: mean of transportation
comment: Relazione tra Musical Artist e Space Station @it
domain: musical artist
type: ObjectProperty

links to Tennis League
comment: Relation between Musical Artist and Tennis League
range: tennis league
comment: Relazione tra Musical Artist e Tennis League @it
type: ObjectProperty
sub property of: organisation
domain: musical artist

canal
type: Class

links to Olympics
domain: musical artist
type: ObjectProperty
comment: Relazione tra Musical Artist e Olympics @it
sub property of: event
range: olympics
comment: Relation between Musical Artist and Olympics

military person
type: Class
label: militaire @fr

Axiom
dbpedia infobox matching weight: 66.67
annotated source: links to Village
annotated property: relatedMatch
annotated target: origin

award
type: ObjectProperty
label: récompense @fr
type: Class

locomotive
type: Class

college
type: Class

anatomical structure
label: structure anatomique @fr
type: ObjectProperty

cricketer
label: joueur de cricket @fr
type: Class

links to Cardinal
type: ObjectProperty
sub property of: person
comment: Relazione tra Musical Artist e Cardinal @it
range: cardinal
comment: Relation between Musical Artist and Cardinal
domain: musical artist

Axiom
dbpedia infobox matching weight: 33.33
annotated property: relatedMatch
annotated source: links to Village
annotated target: died

mixed martial arts event
type: Class
label: évènement d'arts martiaux mixtes @fr

links to Mammal
range: mammal
domain: musical artist
comment: Relazione tra Musical Artist e Mammal @it
type: ObjectProperty
sub property of: species
comment: Relation between Musical Artist and Mammal

protein
type: ObjectProperty
type: Class
label: protéine @fr

ethnic group
type: Class
type: ObjectProperty
label: groupe ethnique @fr

links to Green Alga
range: green alga
type: ObjectProperty
domain: musical artist
sub property of: species
comment: Relation between Musical Artist and Green Alga
comment: Relazione tra Musical Artist e Green Alga @it

links to Hospital
type: NamedIndividual
related match: died
comment: Relazione tra Musical Artist e Hospital @it
domain: musical artist
type: ObjectProperty
range: hospital
sub property of: place
comment: Relation between Musical Artist and Hospital

links to Military Unit
comment: Relation between Musical Artist and Military Unit
sub property of: organisation
type: ObjectProperty
comment: Relazione tra Musical Artist e Military Unit @it
domain: musical artist
range: military unit

motorcycle racing league
label: ligue de courses motocycliste @fr
type: Class

field hockey league
label: ligue d'hockey sur gazon @fr
type: Class

links to Figure Skater
comment: Relazione tra Musical Artist e Figure Skater @it
type: NamedIndividual
comment: Relation between Musical Artist and Figure Skater
type: ObjectProperty
domain: musical artist
sub property of: person
related match: formercoach
range: figure skater
related match: formerpartner

college coach
label: entraîneur universitaire @fr
type: Class

links to Mollusca
comment: Relation between Musical Artist and Mollusca
range: mollusca
domain: musical artist
type: ObjectProperty
sub property of: species
comment: Relazione tra Musical Artist e Mollusca @it

television episode
label: épisode télévisé @fr
type: Class

links to Monarch
comment: Relazione tra Musical Artist e Monarch @it
comment: Relation between Musical Artist and Monarch
type: ObjectProperty
range: monarch
domain: musical artist
sub property of: person

soccer club
type: Class
label: club de football @fr

historic building
label: bâtiment historique @fr
type: Class

links to Tennis Player
comment: Relazione tra Musical Artist e Tennis Player @it
domain: musical artist
type: ObjectProperty
range: tennis player
sub property of: person
comment: Relation between Musical Artist and Tennis Player

military conflict
type: Class
label: conflit militaire @fr

links to President
comment: Relazione tra Musical Artist e President @it
comment: Relation between Musical Artist and President
type: ObjectProperty
sub property of: person
range: president
domain: musical artist

links to Grape
sub property of: species
comment: Relation between Musical Artist and Grape
domain: musical artist
type: ObjectProperty
comment: Relazione tra Musical Artist e Grape @it
range: grape

links to Ski Area
domain: musical artist
range: ski area
comment: Relation between Musical Artist and Ski Area
sub property of: place
comment: Relazione tra Musical Artist e Ski Area @it
type: ObjectProperty

links to Eurovision Song Contest Entry
domain: musical artist
comment: Relation between Musical Artist and Eurovision Song Contest Entry
range: Eurovision song contest entry
type: ObjectProperty
sub property of: work
comment: Relazione tra Musical Artist e Eurovision Song Contest Entry @it

mountain range
type: Class
label: chaîne de montagne @fr

Christian Bishop
type: Class
label: évêque chrétien @fr

links to Bridge
range: bridge
type: ObjectProperty
comment: Relation between Musical Artist and Bridge
domain: musical artist
sub property of: place
comment: Relazione tra Musical Artist e Bridge @it

links to Baseball League
comment: Relazione tra Musical Artist e Baseball League @it
sub property of: organisation
domain: musical artist
comment: Relation between Musical Artist and Baseball League
type: ObjectProperty
range: baseball league

links to Writer
comment: Relazione tra Musical Artist e Writer @it
domain: musical artist
sub property of: person
type: ObjectProperty
range: writer
comment: Relation between Musical Artist and Writer

links to American Football Player
type: NamedIndividual
related match: after
comment: Relation between Musical Artist and American Football Player
sub property of: person
range: american football player
comment: Relazione tra Musical Artist e American Football Player @it
domain: musical artist
type: ObjectProperty

links to Reptile
comment: Relazione tra Musical Artist e Reptile @it
comment: Relation between Musical Artist and Reptile
type: ObjectProperty
range: reptile
sub property of: species
domain: musical artist

MusicalArtist.owl
imports: cpannotationschema.owl
has author: Aldo Gangemi
has author: Valentina Presutti
extracted from: dbpedia.org
type: Ontology
has author: Andrea Giovanni Nuzzolese
comment: MusicalArtist Encyclopedic Knowledge Pattern
extracted from: en.wikipedia.org
imports: dbpediainfoboxmatchingweight.owl
has intent: To represent the encyclopedic knowledge expressed by an object typed as MusicalArtist

badminton player
type: Class
label: joueur de badminton @fr

organisation
label: Organisation @de
label: organização @pt
type: ObjectProperty

links to Saint
sub property of: person
comment: Relation between Musical Artist and Saint
range: saint
comment: Relazione tra Musical Artist e Saint @it
type: ObjectProperty
domain: musical artist

links to Cave
type: ObjectProperty
range: cave
comment: Relazione tra Musical Artist e Cave @it
sub property of: place
comment: Relation between Musical Artist and Cave
domain: musical artist

baseball league
label: ligue de baseball @fr
type: Class

links to Automobile
comment: Relazione tra Musical Artist e Automobile @it
comment: Relation between Musical Artist and Automobile
sub property of: mean of transportation
range: automobile
domain: musical artist
type: ObjectProperty

mammal
label: mammifère @fr
type: Class

Eurovision song contest entry
label: concours Eurovision de la chanson @fr
type: Class

Axiom
dbpedia infobox matching weight: 100.0
annotated target: associatedActs
annotated property: relatedMatch
annotated source: links to Airport

links to Ice Hockey League
domain: musical artist
range: ice hockey league
comment: Relazione tra Musical Artist e Ice Hockey League @it
comment: Relation between Musical Artist and Ice Hockey League
sub property of: organisation
type: ObjectProperty

links to Supreme Court Of The United States Case
domain: musical artist
range: Supreme Court of the United States case
type: ObjectProperty
sub property of: Legal Case
comment: Relation between Musical Artist and Supreme Court Of The United States Case
comment: Relazione tra Musical Artist e Supreme Court Of The United States Case @it

links to Convention
type: ObjectProperty
comment: Relation between Musical Artist and Convention
domain: musical artist
comment: Relazione tra Musical Artist e Convention @it
range: convention
sub property of: event

links to Non- Profit Organisation
range: non-profit organisation
comment: Relazione tra Musical Artist e Non- Profit Organisation @it
domain: musical artist
comment: Relation between Musical Artist and Non- Profit Organisation
sub property of: organisation
type: ObjectProperty