links to Musical Artist
domain: nascar driver
comment: Relation between Nascar Driver and Musical Artist
range: musical artist
type: ObjectProperty
sub property of: person
comment: Relazione tra Nascar Driver e Musical Artist @it

television show
type: Class
label: émission de télévision @fr

links to Basketball League
domain: nascar driver
type: ObjectProperty
comment: Relazione tra Nascar Driver e Basketball League @it
comment: Relation between Nascar Driver and Basketball League
range: basketball league
sub property of: organização

disease
type: ObjectProperty
type: Class
label: maladie @fr

Axiom
dbpedia infobox matching weight: 100.0
annotated source: links to Video Game
annotated property: relatedMatch
annotated target: years

links to Wine Region
comment: Relazione tra Nascar Driver e Wine Region @it
sub property of: place
range: wine region
type: ObjectProperty
comment: Relation between Nascar Driver and Wine Region
domain: nascar driver

mean of transportation
type: ObjectProperty
label: moyen de transport @fr

american football player
label: joueur de football américain @fr
type: Class

links to Website
comment: Relazione tra Nascar Driver e Website @it
comment: Relation between Nascar Driver and Website
type: ObjectProperty
sub property of: website
range: website
domain: nascar driver

stadium
type: Class
label: stade @fr

links to Museum
range: museum
domain: nascar driver
comment: Relazione tra Nascar Driver e Museum @it
sub property of: place
comment: Relation between Nascar Driver and Museum
type: ObjectProperty

links to Book
comment: Relation between Nascar Driver and Book
comment: Relazione tra Nascar Driver e Book @it
type: ObjectProperty
sub property of: work
domain: nascar driver
range: book

wrestler
label: lutteur @fr
type: Class

species
type: ObjectProperty
label: espèce @fr

links to Film
domain: nascar driver
range: film
type: ObjectProperty
comment: Relation between Nascar Driver and Film
comment: Relazione tra Nascar Driver e Film @it
sub property of: work

newspaper
label: journal @fr
type: Class

protected area
type: Class
label: προστατευμένη περιοχή @el
label: aire protégée @fr

game
label: jeu @fr
type: Class

road
label: route @fr
type: Class

boxer
type: Class
label: boxeur @fr

World Heritage Site
label: site du patrimoine mondial @fr
type: Class

links to Basketball Player
domain: nascar driver
comment: Relation between Nascar Driver and Basketball Player
type: ObjectProperty
range: basketball player
comment: Relazione tra Nascar Driver e Basketball Player @it
sub property of: person

links to American Football Player
comment: Relation between Nascar Driver and American Football Player
comment: Relazione tra Nascar Driver e American Football Player @it
sub property of: person
type: ObjectProperty
domain: nascar driver
range: american football player

links to Record Label
type: ObjectProperty
domain: nascar driver
sub property of: organização
comment: Relation between Nascar Driver and Record Label
range: record label
comment: Relazione tra Nascar Driver e Record Label @it

links to Village
related match: birthplace
type: NamedIndividual
comment: Relation between Nascar Driver and Village
type: ObjectProperty
sub property of: place
comment: Relazione tra Nascar Driver e Village @it
range: village
domain: nascar driver

links to American Football Team
comment: Relazione tra Nascar Driver e American Football Team @it
range: american football team
type: ObjectProperty
comment: Relation between Nascar Driver and American Football Team
domain: nascar driver
sub property of: organização

lake
label: lac @fr
type: Class

links to Lake
comment: Relazione tra Nascar Driver e Lake @it
comment: Relation between Nascar Driver and Lake
type: ObjectProperty
domain: nascar driver
range: lake
sub property of: place

links to Wrestler
comment: Relazione tra Nascar Driver e Wrestler @it
domain: nascar driver
comment: Relation between Nascar Driver and Wrestler
range: wrestler
sub property of: person
type: ObjectProperty

work
label: obra @pt
label: travail @fr
type: ObjectProperty

links to Ethnic Group
range: ethnic group
comment: Relation between Nascar Driver and Ethnic Group
sub property of: ethnic group
domain: nascar driver
comment: Relazione tra Nascar Driver e Ethnic Group @it
type: ObjectProperty

links to Baseball League
domain: nascar driver
comment: Relation between Nascar Driver and Baseball League
sub property of: organização
comment: Relazione tra Nascar Driver e Baseball League @it
range: baseball league
type: ObjectProperty

links to Band
range: Band
type: ObjectProperty
comment: Relation between Nascar Driver and Band
sub property of: organização
comment: Relazione tra Nascar Driver e Band @it
domain: nascar driver

school
label: école @fr
type: Class

fish
type: Class
label: poisson @fr

museum
label: musée @fr
type: Class

tennis player
label: joueur de tennis @fr
type: Class

video game
type: Class
label: jeux vidéo @fr

trade union
type: Class
label: syndicat professionnel @fr

currency
type: ObjectProperty
type: Class
label: devise @fr

historic place
label: site historique @fr
type: Class

hospital
label: hôpital @fr
type: Class

links to Olympics
range: olympics
type: ObjectProperty
comment: Relazione tra Nascar Driver e Olympics @it
comment: Relation between Nascar Driver and Olympics
domain: nascar driver
sub property of: event

links to Drug
comment: Relazione tra Nascar Driver e Drug @it
type: ObjectProperty
comment: Relation between Nascar Driver and Drug
domain: nascar driver
range: drug
sub property of: drug

links to Song
comment: Relation between Nascar Driver and Song
range: song
domain: nascar driver
type: ObjectProperty
comment: Relazione tra Nascar Driver e Song @it
sub property of: work

Axiom
dbpedia infobox matching weight: 2.7
annotated source: links to Formula One Racer
annotated property: relatedMatch
annotated target: years

links to Trade Union
comment: Relation between Nascar Driver and Trade Union
domain: nascar driver
type: ObjectProperty
sub property of: organização
comment: Relazione tra Nascar Driver e Trade Union @it
range: trade union

continent
type: Class
label: ήπειρος @el

links to Television Episode
type: ObjectProperty
comment: Relazione tra Nascar Driver e Television Episode @it
comment: Relation between Nascar Driver and Television Episode
range: television episode
domain: nascar driver
sub property of: work

links to Boxer
comment: Relation between Nascar Driver and Boxer
range: boxer
type: ObjectProperty
sub property of: person
domain: nascar driver
comment: Relazione tra Nascar Driver e Boxer @it

links to Weapon
sub property of: device
comment: Relation between Nascar Driver and Weapon
range: weapon
domain: nascar driver
comment: Relazione tra Nascar Driver e Weapon @it
type: ObjectProperty

president
label: président @fr
type: Class

album
label: Album @de
type: Class

links to World Heritage Site
range: World Heritage Site
domain: nascar driver
comment: Relazione tra Nascar Driver e World Heritage Site @it
sub property of: place
type: ObjectProperty
comment: Relation between Nascar Driver and World Heritage Site

links to Hockey Team
range: hockey team
sub property of: organização
comment: Relazione tra Nascar Driver e Hockey Team @it
domain: nascar driver
type: ObjectProperty
comment: Relation between Nascar Driver and Hockey Team

person
label: personne @fr
label: pessoa @pt
type: ObjectProperty
label: Person @de

military unit
label: unité militaire @fr
type: Class

links to Military Conflict
range: military conflict
type: ObjectProperty
sub property of: event
comment: Relation between Nascar Driver and Military Conflict
domain: nascar driver
comment: Relazione tra Nascar Driver e Military Conflict @it

basketball team
type: Class

links to Hospital
type: ObjectProperty
sub property of: place
comment: Relation between Nascar Driver and Hospital
comment: Relazione tra Nascar Driver e Hospital @it
range: hospital
domain: nascar driver

links to Mountain Range
comment: Relation between Nascar Driver and Mountain Range
range: mountain range
sub property of: place
comment: Relazione tra Nascar Driver e Mountain Range @it
domain: nascar driver
type: ObjectProperty

links to Music Genre
sub property of: music genre
comment: Relation between Nascar Driver and Music Genre
type: ObjectProperty
domain: nascar driver
comment: Relazione tra Nascar Driver e Music Genre @it
range: music genre

music genre
type: Class
label: género musical @pt
type: ObjectProperty
label: genre musical @fr

writer
label: écrivain @fr
type: Class

record label
label: label discographique @fr
type: Class

Axiom
dbpedia infobox matching weight: 100.0
annotated property: relatedMatch
annotated source: links to Baseball Player
annotated target: after

model
type: Class
label: mannequin @fr

links to Fish
comment: Relazione tra Nascar Driver e Fish @it
domain: nascar driver
range: fish
comment: Relation between Nascar Driver and Fish
sub property of: species
type: ObjectProperty

film festival
type: Class
label: festival du film @fr

links to Actor
type: ObjectProperty
comment: Relazione tra Nascar Driver e Actor @it
sub property of: person
comment: Relation between Nascar Driver and Actor
range: actor
domain: nascar driver

links to Formula One Racer
related match: years
type: ObjectProperty
range: Formula One racer
comment: Relazione tra Nascar Driver e Formula One Racer @it
sub property of: person
comment: Relation between Nascar Driver and Formula One Racer
type: NamedIndividual
related match: after
related match: before
domain: nascar driver

Grand Prix
type: Class
label: grand prix @fr

links to Military Unit
sub property of: organização
type: ObjectProperty
comment: Relazione tra Nascar Driver e Military Unit @it
comment: Relation between Nascar Driver and Military Unit
domain: nascar driver
range: military unit

aircraft
label: avion @fr
type: Class
label: αεροσκάφος @el

links to Senator
type: ObjectProperty
comment: Relazione tra Nascar Driver e Senator @it
domain: nascar driver
comment: Relation between Nascar Driver and Senator
sub property of: person
range: senator

Axiom
dbpedia infobox matching weight: 45.95
annotated source: links to Formula One Racer
annotated property: relatedMatch
annotated target: before

hockey team
label: équipe de hockey @fr
type: Class

soccer player
type: Class
label: joueur de football @fr

links to School
domain: nascar driver
comment: Relation between Nascar Driver and School
comment: Relazione tra Nascar Driver e School @it
type: ObjectProperty
sub property of: organização
range: school

links to Continent
domain: nascar driver
comment: Relation between Nascar Driver and Continent
type: ObjectProperty
range: continent
comment: Relazione tra Nascar Driver e Continent @it
sub property of: place

links to Flowering Plant
type: ObjectProperty
comment: Relation between Nascar Driver and Flowering Plant
range: flowering plant
domain: nascar driver
sub property of: species
comment: Relazione tra Nascar Driver e Flowering Plant @it

airline
label: compagnie aérienne @fr
type: Class

links to Sport
domain: nascar driver
comment: Relation between Nascar Driver and Sport
range: sport
type: ObjectProperty
comment: Relazione tra Nascar Driver e Sport @it
sub property of: activity

golf player
type: Class
label: golfeur @fr

nascar driver
label: pilote de la nascar @fr
type: Class

activity
type: ObjectProperty
label: Aktivität @de
label: activité @fr

journalist
label: journaliste @fr
type: Class

links to Ski Area
sub property of: place
comment: Relazione tra Nascar Driver e Ski Area @it
comment: Relation between Nascar Driver and Ski Area
range: ski area
type: ObjectProperty
domain: nascar driver

links to Grand Prix
range: Grand Prix
comment: Relazione tra Nascar Driver e Grand Prix @it
domain: nascar driver
type: ObjectProperty
comment: Relation between Nascar Driver and Grand Prix
sub property of: event

Axiom
dbpedia infobox matching weight: 51.35
annotated target: after
annotated source: links to Formula One Racer
annotated property: relatedMatch

film
label: ταινία @el
type: Class

links to Aircraft
comment: Relazione tra Nascar Driver e Aircraft @it
sub property of: mean of transportation
range: aircraft
domain: nascar driver
type: ObjectProperty
comment: Relation between Nascar Driver and Aircraft

american football team
type: Class
label: équipe américaine de football américain @fr

links to Golf Player
range: golf player
domain: nascar driver
sub property of: person
type: ObjectProperty
comment: Relation between Nascar Driver and Golf Player
comment: Relazione tra Nascar Driver e Golf Player @it

chemical compound
type: Class
type: ObjectProperty
label: produit chimique @fr

links to Cyclist
sub property of: person
comment: Relation between Nascar Driver and Cyclist
type: ObjectProperty
comment: Relazione tra Nascar Driver e Cyclist @it
range: cyclist
domain: nascar driver

links to Anatomical Structure
sub property of: anatomical structure
type: ObjectProperty
comment: Relazione tra Nascar Driver e Anatomical Structure @it
range: anatomical structure
comment: Relation between Nascar Driver and Anatomical Structure
domain: nascar driver

musical artist
label: musicien @fr
type: Class
label: artista musical @pt

links to Stadium
type: ObjectProperty
domain: nascar driver
sub property of: place
range: stadium
comment: Relazione tra Nascar Driver e Stadium @it
comment: Relation between Nascar Driver and Stadium

links to Album
sub property of: work
comment: Relation between Nascar Driver and Album
range: album
comment: Relazione tra Nascar Driver e Album @it
domain: nascar driver
type: ObjectProperty

rugby player
type: Class
label: joueur de rugby @fr

links to Non- Profit Organisation
type: ObjectProperty
comment: Relazione tra Nascar Driver e Non- Profit Organisation @it
domain: nascar driver
sub property of: organização
range: non-profit organisation
comment: Relation between Nascar Driver and Non- Profit Organisation

american football league
type: Class

links to Comedian
comment: Relazione tra Nascar Driver e Comedian @it
type: ObjectProperty
comment: Relation between Nascar Driver and Comedian
sub property of: person
domain: nascar driver
range: comedian

links to Model
sub property of: person
comment: Relation between Nascar Driver and Model
domain: nascar driver
type: ObjectProperty
comment: Relazione tra Nascar Driver e Model @it
range: model

links to Road
domain: nascar driver
type: ObjectProperty
range: road
comment: Relation between Nascar Driver and Road
comment: Relazione tra Nascar Driver e Road @it
sub property of: infrastructure

actor
label: Schauspieler @de
type: Class
label: acteur @fr

links to Basketball Team
sub property of: organização
comment: Relazione tra Nascar Driver e Basketball Team @it
domain: nascar driver
type: ObjectProperty
comment: Relation between Nascar Driver and Basketball Team
range: basketball team

cyclist
label: cycliste @fr
type: Class

place
label: lugar @pt
label: lieu @fr
label: περιοχή @el
type: ObjectProperty

infrastructure
type: ObjectProperty

basketball league
label: ligue de basketball @fr
type: Class

links to Tennis Player
range: tennis player
sub property of: person
comment: Relazione tra Nascar Driver e Tennis Player @it
type: ObjectProperty
domain: nascar driver
comment: Relation between Nascar Driver and Tennis Player

flowering plant
label: angiospermes @fr
type: Class

links to Television Show
comment: Relazione tra Nascar Driver e Television Show @it
range: television show
type: ObjectProperty
sub property of: work
domain: nascar driver
comment: Relation between Nascar Driver and Television Show

links to Baseball Player
range: baseball player
domain: nascar driver
type: ObjectProperty
comment: Relazione tra Nascar Driver e Baseball Player @it
sub property of: person
comment: Relation between Nascar Driver and Baseball Player
type: NamedIndividual
related match: after

saint
type: Class

senator
label: sénateur @fr
type: Class

comedian
label: comédien @fr
type: Class

links to Protected Area
range: protected area
type: ObjectProperty
comment: Relazione tra Nascar Driver e Protected Area @it
comment: Relation between Nascar Driver and Protected Area
domain: nascar driver
sub property of: place

song
type: Class
label: chanson @fr

links to Chemical Compound
comment: Relation between Nascar Driver and Chemical Compound
type: ObjectProperty
domain: nascar driver
range: chemical compound
sub property of: chemical compound
comment: Relazione tra Nascar Driver e Chemical Compound @it

book
type: Class
label: livre @fr
label: βιβλίο @el
label: llibre @ca
label: książka @pl

links to Office Holder
type: ObjectProperty
sub property of: person
range: office holder
comment: Relazione tra Nascar Driver e Office Holder @it
comment: Relation between Nascar Driver and Office Holder
domain: nascar driver

device
type: ObjectProperty
label: appareil @fr

links to Newspaper
domain: nascar driver
range: newspaper
comment: Relation between Nascar Driver and Newspaper
comment: Relazione tra Nascar Driver e Newspaper @it
type: ObjectProperty
sub property of: work

links to Saint
comment: Relation between Nascar Driver and Saint
type: ObjectProperty
range: saint
sub property of: person
comment: Relazione tra Nascar Driver e Saint @it
domain: nascar driver

ski area
type: Class
label: domaine skiable @fr

links to Film Festival
comment: Relation between Nascar Driver and Film Festival
range: film festival
type: ObjectProperty
comment: Relazione tra Nascar Driver e Film Festival @it
domain: nascar driver
sub property of: event

non-profit organisation
type: Class
label: organisation à but non lucratif @fr

links to Hotel
sub property of: place
range: hotel
comment: Relazione tra Nascar Driver e Hotel @it
domain: nascar driver
comment: Relation between Nascar Driver and Hotel
type: ObjectProperty

links to Mammal
domain: nascar driver
type: ObjectProperty
comment: Relazione tra Nascar Driver e Mammal @it
comment: Relation between Nascar Driver and Mammal
range: mammal
sub property of: species

wine region
type: Class
label: région viticole @fr

weapon
type: Class
label: arme @fr

drug
type: ObjectProperty
label: médicament @fr
type: Class

links to Ice Hockey Player
comment: Relation between Nascar Driver and Ice Hockey Player
comment: Relazione tra Nascar Driver e Ice Hockey Player @it
range: ice hockey player
domain: nascar driver
type: ObjectProperty
sub property of: person

magazine
label: περιοδικό @el
type: Class

links to Auto Racing League
range: auto racing league
type: ObjectProperty
comment: Relazione tra Nascar Driver e Auto Racing League @it
sub property of: organização
comment: Relation between Nascar Driver and Auto Racing League
domain: nascar driver

links to Currency
sub property of: currency
comment: Relazione tra Nascar Driver e Currency @it
comment: Relation between Nascar Driver and Currency
range: currency
domain: nascar driver
type: ObjectProperty

military person
type: Class
label: militaire @fr

links to Broadcast
comment: Relazione tra Nascar Driver e Broadcast @it
type: ObjectProperty
comment: Relation between Nascar Driver and Broadcast
range: broadcast
sub property of: organização
domain: nascar driver

Axiom
dbpedia infobox matching weight: 100.0
annotated source: links to Village
annotated property: relatedMatch
annotated target: birthplace

links to Soccer Club
comment: Relation between Nascar Driver and Soccer Club
type: ObjectProperty
sub property of: organização
range: soccer club
domain: nascar driver
comment: Relazione tra Nascar Driver e Soccer Club @it

sport
type: Class

anatomical structure
label: structure anatomique @fr
type: ObjectProperty
type: Class

single
type: Class

links to Magazine
range: magazine
type: ObjectProperty
comment: Relation between Nascar Driver and Magazine
comment: Relazione tra Nascar Driver e Magazine @it
domain: nascar driver
sub property of: work

Band
label: banda @pt
label: Musikgruppe @de
type: Class
label: groupe de musique @fr

links to Airport
range: airport
sub property of: place
type: ObjectProperty
comment: Relazione tra Nascar Driver e Airport @it
comment: Relation between Nascar Driver and Airport
domain: nascar driver

university
label: πανεπιστήμιο @el
label: université @fr
type: Class

auto racing league
label: la ligue de course automobile @fr
type: Class

ethnic group
label: groupe ethnique @fr
type: ObjectProperty
type: Class

links to Military Person
comment: Relation between Nascar Driver and Military Person
range: military person
comment: Relazione tra Nascar Driver e Military Person @it
type: ObjectProperty
sub property of: person
domain: nascar driver

links to Island
comment: Relazione tra Nascar Driver e Island @it
sub property of: place
range: island
domain: nascar driver
comment: Relation between Nascar Driver and Island
type: ObjectProperty

hotel
type: Class
label: hôtel @fr

college coach
type: Class
label: entraîneur universitaire @fr

links to Disease
domain: nascar driver
type: ObjectProperty
range: disease
sub property of: disease
comment: Relation between Nascar Driver and Disease
comment: Relazione tra Nascar Driver e Disease @it

television episode
label: épisode télévisé @fr
type: Class

village
type: Class
label: χωριό @el

ice hockey league
type: Class
label: ligue d'hockey sur glace @fr

links to University
domain: nascar driver
sub property of: organização
comment: Relation between Nascar Driver and University
comment: Relazione tra Nascar Driver e University @it
range: university
type: ObjectProperty

links to President
range: president
comment: Relazione tra Nascar Driver e President @it
comment: Relation between Nascar Driver and President
type: ObjectProperty
sub property of: person
domain: nascar driver

soccer club
type: Class
label: club de football @fr

NascarDriver.owl
has author: Valentina Presutti
has intent: To represent the encyclopedic knowledge expressed by an object typed as NascarDriver
has author: Andrea Giovanni Nuzzolese
comment: NascarDriver Encyclopedic Knowledge Pattern
imports: dbpediainfoboxmatchingweight.owl
extracted from: en.wikipedia.org
imports: cpannotationschema.owl
extracted from: dbpedia.org
has author: Aldo Gangemi
type: Ontology

links to Game
comment: Relation between Nascar Driver and Game
type: ObjectProperty
comment: Relazione tra Nascar Driver e Game @it
sub property of: activity
range: game
domain: nascar driver

office holder
label: titulaire @fr
type: Class
label: Amtsinhaber @de

baseball player
type: Class
label: joueur de baseball @fr

military conflict
type: Class
label: conflit militaire @fr

website
label: Ιστότοπος @el
label: site web @fr
type: Class
type: ObjectProperty

links to Historic Place
range: historic place
comment: Relation between Nascar Driver and Historic Place
type: ObjectProperty
comment: Relazione tra Nascar Driver e Historic Place @it
sub property of: place
domain: nascar driver

basketball player
type: Class
label: joueur de basketball @fr

links to Video Game
range: video game
comment: Relazione tra Nascar Driver e Video Game @it
type: ObjectProperty
sub property of: work
domain: nascar driver
comment: Relation between Nascar Driver and Video Game
type: NamedIndividual
related match: years

links to Airline
type: ObjectProperty
range: airline
comment: Relation between Nascar Driver and Airline
sub property of: organização
domain: nascar driver
comment: Relazione tra Nascar Driver e Airline @it

ice hockey player
label: joueur de hockey sur glace @fr
type: Class

mountain range
label: chaîne de montagne @fr
type: Class

beverage
label: boisson @fr
type: Class
type: ObjectProperty

links to Beverage
domain: nascar driver
sub property of: beverage
comment: Relazione tra Nascar Driver e Beverage @it
comment: Relation between Nascar Driver and Beverage
type: ObjectProperty
range: beverage

links to College Coach
range: college coach
sub property of: person
comment: Relation between Nascar Driver and College Coach
comment: Relazione tra Nascar Driver e College Coach @it
domain: nascar driver
type: ObjectProperty

links to Soccer Player
type: ObjectProperty
range: soccer player
comment: Relazione tra Nascar Driver e Soccer Player @it
comment: Relation between Nascar Driver and Soccer Player
sub property of: person
domain: nascar driver

links to Ice Hockey League
type: ObjectProperty
comment: Relation between Nascar Driver and Ice Hockey League
sub property of: organização
range: ice hockey league
comment: Relazione tra Nascar Driver e Ice Hockey League @it
domain: nascar driver

links to Radio Station
domain: nascar driver
comment: Relazione tra Nascar Driver e Radio Station @it
type: ObjectProperty
comment: Relation between Nascar Driver and Radio Station
range: radio station
sub property of: organização

links to Journalist
range: journalist
comment: Relation between Nascar Driver and Journalist
sub property of: person
comment: Relazione tra Nascar Driver e Journalist @it
type: ObjectProperty
domain: nascar driver

olympics
label: Jeux Olympiques @fr
type: Class

organização
type: ObjectProperty
label: organisation
label: Organisation @de

links to Comics Character
type: ObjectProperty
range: comics character
sub property of: person
comment: Relation between Nascar Driver and Comics Character
domain: nascar driver
comment: Relazione tra Nascar Driver e Comics Character @it

baseball league
label: ligue de baseball @fr
type: Class

links to American Football League
type: ObjectProperty
range: american football league
comment: Relation between Nascar Driver and American Football League
domain: nascar driver
comment: Relazione tra Nascar Driver e American Football League @it
sub property of: organização

links to Writer
type: ObjectProperty
domain: nascar driver
comment: Relation between Nascar Driver and Writer
range: writer
comment: Relazione tra Nascar Driver e Writer @it
sub property of: person

broadcast
type: Class
label: Émission de télévision @fr

mammal
type: Class
label: mammifère @fr

island
type: Class
label: νησί @el
label: île @fr

comics character
label: personnage de bandes dessinées @fr
type: Class

links to Single
comment: Relazione tra Nascar Driver e Single @it
range: single
domain: nascar driver
type: ObjectProperty
sub property of: work
comment: Relation between Nascar Driver and Single

event
type: ObjectProperty
label: évènement @fr

Formula One racer
label: pilote de formule 1 @fr
type: Class

radio station
label: station de radio @fr
type: Class

links to Rugby Player
sub property of: person
comment: Relazione tra Nascar Driver e Rugby Player @it
range: rugby player
type: ObjectProperty
domain: nascar driver
comment: Relation between Nascar Driver and Rugby Player

airport
label: aéroport @fr
label: Flughafen @de
type: Class