links to Film
range: film
type: ObjectProperty
comment: Relazione tra Olympic Result e Film @it
sub property of: work
comment: Relation between Olympic Result and Film
domain: olympic result

links to Baseball Player
domain: olympic result
comment: Relation between Olympic Result and Baseball Player
sub property of: person
type: ObjectProperty
range: baseball player
comment: Relazione tra Olympic Result e Baseball Player @it

television show
type: Class
label: émission de télévision @fr

disease
type: ObjectProperty
type: Class
label: maladie @fr

cardinal
type: Class

rugby player
type: Class
label: joueur de rugby @fr

links to Soccer Club
type: ObjectProperty
domain: olympic result
range: soccer club
comment: Relazione tra Olympic Result e Soccer Club @it
sub property of: organização
comment: Relation between Olympic Result and Soccer Club
related match: club
type: NamedIndividual

links to Journalist
range: journalist
comment: Relazione tra Olympic Result e Journalist @it
comment: Relation between Olympic Result and Journalist
sub property of: person
domain: olympic result
type: ObjectProperty

links to Website
domain: olympic result
type: ObjectProperty
comment: Relation between Olympic Result and Website
sub property of: website
comment: Relazione tra Olympic Result e Website @it
range: website

links to Writer
sub property of: person
type: ObjectProperty
comment: Relazione tra Olympic Result e Writer @it
range: writer
comment: Relation between Olympic Result and Writer
domain: olympic result

american football player
label: joueur de football américain @fr
type: Class

actor
label: acteur @fr
type: Class
label: Schauspieler @de

stadium
type: Class
label: stade @fr

place
type: ObjectProperty
label: περιοχή @el
label: lieu @fr
label: lugar @pt

links to Badminton Player
type: ObjectProperty
comment: Relation between Olympic Result and Badminton Player
domain: olympic result
sub property of: person
range: badminton player
comment: Relazione tra Olympic Result e Badminton Player @it

soccer league
type: Class
label: ligue de football @fr

national collegiate athletic association athlete
type: Class
label: athlète de la national collegiate athletic association @fr

links to Chemical Compound
type: ObjectProperty
comment: Relation between Olympic Result and Chemical Compound
range: chemical compound
comment: Relazione tra Olympic Result e Chemical Compound @it
sub property of: chemical compound
domain: olympic result

links to Boxer
domain: olympic result
comment: Relation between Olympic Result and Boxer
range: boxer
type: ObjectProperty
comment: Relazione tra Olympic Result e Boxer @it
sub property of: person

links to Actor
comment: Relation between Olympic Result and Actor
domain: olympic result
sub property of: person
comment: Relazione tra Olympic Result e Actor @it
type: ObjectProperty
range: actor

links to Golf Player
type: ObjectProperty
sub property of: person
comment: Relation between Olympic Result and Golf Player
range: golf player
comment: Relazione tra Olympic Result e Golf Player @it
domain: olympic result

links to National Collegiate Athletic Association Athlete
comment: Relazione tra Olympic Result e National Collegiate Athletic Association Athlete @it
sub property of: person
domain: olympic result
range: national collegiate athletic association athlete
type: ObjectProperty
comment: Relation between Olympic Result and National Collegiate Athletic Association Athlete

wrestler
label: lutteur @fr
type: Class

criminal
type: Class
label: criminel @fr

mayor
label: maire @fr
type: Class

links to Radio Station
comment: Relazione tra Olympic Result e Radio Station @it
range: radio station
sub property of: organização
type: ObjectProperty
domain: olympic result
comment: Relation between Olympic Result and Radio Station

saint
type: Class

links to President
comment: Relation between Olympic Result and President
comment: Relazione tra Olympic Result e President @it
sub property of: person
range: president
domain: olympic result
type: ObjectProperty

newspaper
label: journal @fr
type: Class

links to Formula One Racer
type: ObjectProperty
comment: Relazione tra Olympic Result e Formula One Racer @it
sub property of: person
comment: Relation between Olympic Result and Formula One Racer
domain: olympic result
range: Formula One racer

links to American Football Player
domain: olympic result
sub property of: person
type: ObjectProperty
comment: Relation between Olympic Result and American Football Player
range: american football player
comment: Relazione tra Olympic Result e American Football Player @it

boxer
type: Class
label: boxeur @fr

judge
label: juge @fr
type: Class

language
type: ObjectProperty
label: langage @fr
type: Class

links to Soccer Manager
comment: Relation between Olympic Result and Soccer Manager
type: ObjectProperty
comment: Relazione tra Olympic Result e Soccer Manager @it
range: soccer manager
sub property of: person
domain: olympic result

links to Comics Creator
comment: Relation between Olympic Result and Comics Creator
range: comics creator
sub property of: person
type: ObjectProperty
comment: Relazione tra Olympic Result e Comics Creator @it
domain: olympic result

links to Soccer League
comment: Relation between Olympic Result and Soccer League
comment: Relazione tra Olympic Result e Soccer League @it
sub property of: organização
type: ObjectProperty
range: soccer league
domain: olympic result

ski area
type: Class
label: domaine skiable @fr

links to Tennis Player
type: ObjectProperty
comment: Relation between Olympic Result and Tennis Player
comment: Relazione tra Olympic Result e Tennis Player @it
range: tennis player
domain: olympic result
sub property of: person

links to University
sub property of: organização
comment: Relation between Olympic Result and University
comment: Relazione tra Olympic Result e University @it
type: ObjectProperty
domain: olympic result
range: university

links to Cricketer
comment: Relazione tra Olympic Result e Cricketer @it
comment: Relation between Olympic Result and Cricketer
domain: olympic result
type: ObjectProperty
range: cricketer
sub property of: person

links to Currency
comment: Relation between Olympic Result and Currency
sub property of: currency
comment: Relazione tra Olympic Result e Currency @it
range: currency
domain: olympic result
type: ObjectProperty

links to Congressman
comment: Relazione tra Olympic Result e Congressman @it
comment: Relation between Olympic Result and Congressman
domain: olympic result
type: ObjectProperty
range: congressman
sub property of: person

links to Hockey Team
comment: Relazione tra Olympic Result e Hockey Team @it
comment: Relation between Olympic Result and Hockey Team
type: ObjectProperty
sub property of: organização
range: hockey team
domain: olympic result

links to Rugby Player
type: ObjectProperty
domain: olympic result
range: rugby player
comment: Relation between Olympic Result and Rugby Player
sub property of: person
comment: Relazione tra Olympic Result e Rugby Player @it

links to Village
comment: Relazione tra Olympic Result e Village @it
range: village
comment: Relation between Olympic Result and Village
type: ObjectProperty
sub property of: place
domain: olympic result

governor
label: gouverneur @fr
type: Class

company
type: Class
label: entreprise @fr

drug
type: Class
label: médicament @fr
type: ObjectProperty

administrative region
label: région administrative @fr
type: Class

links to Cardinal
comment: Relation between Olympic Result and Cardinal
sub property of: person
type: ObjectProperty
comment: Relazione tra Olympic Result e Cardinal @it
range: cardinal
domain: olympic result

links to College Coach
sub property of: person
type: ObjectProperty
comment: Relazione tra Olympic Result e College Coach @it
range: college coach
comment: Relation between Olympic Result and College Coach
domain: olympic result

work
label: obra @pt
label: travail @fr
type: ObjectProperty

links to School
comment: Relation between Olympic Result and School
sub property of: organização
range: school
type: ObjectProperty
domain: olympic result
comment: Relazione tra Olympic Result e School @it

school
label: école @fr
type: Class

links to Nascar Driver
sub property of: person
domain: olympic result
type: ObjectProperty
comment: Relazione tra Olympic Result e Nascar Driver @it
range: nascar driver
comment: Relation between Olympic Result and Nascar Driver

tennis player
label: joueur de tennis @fr
type: Class

links to Member Of Parliament
comment: Relazione tra Olympic Result e Member Of Parliament @it
range: member of parliament
comment: Relation between Olympic Result and Member Of Parliament
type: ObjectProperty
sub property of: person
domain: olympic result

military person
type: Class
label: militaire @fr

philosopher
label: philosophe @fr
type: Class

links to Wrestler
range: wrestler
comment: Relazione tra Olympic Result e Wrestler @it
comment: Relation between Olympic Result and Wrestler
domain: olympic result
type: ObjectProperty
sub property of: person

currency
type: ObjectProperty
type: Class
label: devise @fr

British royalty
type: Class
label: royauté Britannique @fr

anatomical structure
type: ObjectProperty
label: structure anatomique @fr

links to Scientist
comment: Relation between Olympic Result and Scientist
domain: olympic result
comment: Relazione tra Olympic Result e Scientist @it
sub property of: person
type: ObjectProperty
range: scientist

sport
type: Class

cricketer
label: joueur de cricket @fr
type: Class

links to Basketball Player
domain: olympic result
sub property of: person
comment: Relation between Olympic Result and Basketball Player
comment: Relazione tra Olympic Result e Basketball Player @it
type: ObjectProperty
range: basketball player

town
type: Class
label: ville @fr

links to Musical Artist
range: musical artist
sub property of: person
type: ObjectProperty
comment: Relation between Olympic Result and Musical Artist
comment: Relazione tra Olympic Result e Musical Artist @it
domain: olympic result

links to Mountain Range
comment: Relazione tra Olympic Result e Mountain Range @it
domain: olympic result
range: mountain range
sub property of: place
type: ObjectProperty
comment: Relation between Olympic Result and Mountain Range

links to Airport
comment: Relazione tra Olympic Result e Airport @it
range: airport
comment: Relation between Olympic Result and Airport
domain: olympic result
sub property of: place
type: ObjectProperty

university
type: Class
label: université @fr
label: πανεπιστήμιο @el

continent
label: ήπειρος @el
type: Class

ethnic group
type: Class
type: ObjectProperty
label: groupe ethnique @fr

president
type: Class
label: président @fr

links to Bone
comment: Relazione tra Olympic Result e Bone @it
type: ObjectProperty
range: bone
domain: olympic result
sub property of: anatomical structure
comment: Relation between Olympic Result and Bone

links to Administrative Region
comment: Relation between Olympic Result and Administrative Region
type: ObjectProperty
domain: olympic result
comment: Relazione tra Olympic Result e Administrative Region @it
range: administrative region
sub property of: place

person
label: personne @fr
type: ObjectProperty
label: pessoa @pt
label: Person @de

links to Legislature
type: ObjectProperty
comment: Relazione tra Olympic Result e Legislature @it
comment: Relation between Olympic Result and Legislature
domain: olympic result
sub property of: organização
range: legislature

links to Town
domain: olympic result
type: ObjectProperty
range: town
sub property of: place
comment: Relazione tra Olympic Result e Town @it
comment: Relation between Olympic Result and Town

college coach
label: entraîneur universitaire @fr
type: Class

soccer manager
type: Class
label: entraîneur de football @fr

village
label: χωριό @el
type: Class

links to Governor
domain: olympic result
sub property of: person
type: ObjectProperty
comment: Relation between Olympic Result and Governor
range: governor
comment: Relazione tra Olympic Result e Governor @it

ice hockey league
type: Class
label: ligue d'hockey sur glace @fr

soccer club
type: Class
label: club de football @fr

writer
type: Class
label: écrivain @fr

links to British Royalty
domain: olympic result
comment: Relation between Olympic Result and British Royalty
type: ObjectProperty
sub property of: person
comment: Relazione tra Olympic Result e British Royalty @it
range: British royalty

office holder
type: Class
label: Amtsinhaber @de
label: titulaire @fr

OlympicResult.owl
imports: dbpediainfoboxmatchingweight.owl
has author: Valentina Presutti
has intent: To represent the encyclopedic knowledge expressed by an object typed as OlympicResult
imports: cpannotationschema.owl
extracted from: dbpedia.org
has author: Aldo Gangemi
comment: OlympicResult Encyclopedic Knowledge Pattern
has author: Andrea Giovanni Nuzzolese
type: Ontology
extracted from: en.wikipedia.org

baseball player
label: joueur de baseball @fr
type: Class

military conflict
label: conflit militaire @fr
type: Class

website
type: ObjectProperty
type: Class
label: site web @fr
label: Ιστότοπος @el

links to Television Show
type: ObjectProperty
comment: Relation between Olympic Result and Television Show
sub property of: work
domain: olympic result
range: television show
comment: Relazione tra Olympic Result e Television Show @it

links to Company
comment: Relation between Olympic Result and Company
comment: Relazione tra Olympic Result e Company @it
type: ObjectProperty
domain: olympic result
range: company
sub property of: organização

olympic result
type: Class
label: résultat de Jeux Olympiques @fr

links to Ski Area
comment: Relazione tra Olympic Result e Ski Area @it
range: ski area
sub property of: place
comment: Relation between Olympic Result and Ski Area
type: ObjectProperty
domain: olympic result

links to Mayor
range: mayor
domain: olympic result
comment: Relation between Olympic Result and Mayor
comment: Relazione tra Olympic Result e Mayor @it
type: ObjectProperty
sub property of: person

links to Baseball League
sub property of: organização
domain: olympic result
comment: Relazione tra Olympic Result e Baseball League @it
type: ObjectProperty
range: baseball league
comment: Relation between Olympic Result and Baseball League

links to Newspaper
type: ObjectProperty
comment: Relazione tra Olympic Result e Newspaper @it
domain: olympic result
comment: Relation between Olympic Result and Newspaper
range: newspaper
sub property of: work

links to Criminal
comment: Relazione tra Olympic Result e Criminal @it
domain: olympic result
range: criminal
sub property of: person
type: ObjectProperty
comment: Relation between Olympic Result and Criminal

basketball player
label: joueur de basketball @fr
type: Class

links to Military Person
comment: Relazione tra Olympic Result e Military Person @it
range: military person
comment: Relation between Olympic Result and Military Person
type: ObjectProperty
sub property of: person
domain: olympic result

links to Military Conflict
type: ObjectProperty
comment: Relazione tra Olympic Result e Military Conflict @it
comment: Relation between Olympic Result and Military Conflict
range: military conflict
sub property of: event
domain: olympic result

mountain range
label: chaîne de montagne @fr
type: Class

comics creator
label: créateur de bandes dessinées @fr
type: Class

Axiom
dbpedia infobox matching weight: 100.0
annotated property: relatedMatch
annotated target: club
annotated source: links to Soccer Club

hockey team
type: Class
label: équipe de hockey @fr

links to Office Holder
sub property of: person
type: ObjectProperty
domain: olympic result
range: office holder
comment: Relazione tra Olympic Result e Office Holder @it
comment: Relation between Olympic Result and Office Holder

scientist
label: scientifique @fr
type: Class
label: Wissenschaftler @de

links to Ethnic Group
domain: olympic result
range: ethnic group
type: ObjectProperty
sub property of: ethnic group
comment: Relation between Olympic Result and Ethnic Group
comment: Relazione tra Olympic Result e Ethnic Group @it

links to Sport
comment: Relation between Olympic Result and Sport
range: sport
comment: Relazione tra Olympic Result e Sport @it
domain: olympic result
type: ObjectProperty
sub property of: activity

legislature
label: pouvoir législatif @fr
type: Class

badminton player
type: Class
label: joueur de badminton @fr

organização
type: ObjectProperty
label: organisation
label: Organisation @de

baseball league
label: ligue de baseball @fr
type: Class

congressman
type: Class
label: membre du Congrès @fr

links to Language
range: language
sub property of: language
comment: Relation between Olympic Result and Language
comment: Relazione tra Olympic Result e Language @it
type: ObjectProperty
domain: olympic result

golf player
type: Class
label: golfeur @fr

nascar driver
label: pilote de la nascar @fr
type: Class

activity
type: ObjectProperty
label: Aktivität @de
label: activité @fr

links to Stadium
comment: Relation between Olympic Result and Stadium
comment: Relazione tra Olympic Result e Stadium @it
sub property of: place
domain: olympic result
range: stadium
type: ObjectProperty

journalist
type: Class
label: journaliste @fr

broadcast
type: Class
label: Émission de télévision @fr

links to Gaelic Games Player
domain: olympic result
comment: Relazione tra Olympic Result e Gaelic Games Player @it
comment: Relation between Olympic Result and Gaelic Games Player
sub property of: person
range: Gaelic games player
type: ObjectProperty

links to Broadcast
comment: Relation between Olympic Result and Broadcast
sub property of: organização
domain: olympic result
range: broadcast
type: ObjectProperty
comment: Relazione tra Olympic Result e Broadcast @it

film
type: Class
label: ταινία @el

links to Saint
range: saint
comment: Relazione tra Olympic Result e Saint @it
comment: Relation between Olympic Result and Saint
domain: olympic result
type: ObjectProperty
sub property of: person

links to Ice Hockey League
type: ObjectProperty
comment: Relation between Olympic Result and Ice Hockey League
range: ice hockey league
domain: olympic result
sub property of: organização
comment: Relazione tra Olympic Result e Ice Hockey League @it

links to Disease
type: ObjectProperty
comment: Relation between Olympic Result and Disease
comment: Relazione tra Olympic Result e Disease @it
range: disease
domain: olympic result
sub property of: disease

island
label: île @fr
label: νησί @el
type: Class

chemical compound
label: produit chimique @fr
type: ObjectProperty
type: Class

event
type: ObjectProperty
label: évènement @fr

Formula One racer
label: pilote de formule 1 @fr
type: Class

Gaelic games player
type: Class
label: joueur de sports gaéliques @fr

radio station
label: station de radio @fr
type: Class

links to Philosopher
range: philosopher
comment: Relation between Olympic Result and Philosopher
type: ObjectProperty
domain: olympic result
comment: Relazione tra Olympic Result e Philosopher @it
sub property of: person

bone
label: os @fr
label: Knochen @de
type: Class

member of parliament
type: Class
label: membre du Parlement @fr

links to Island
domain: olympic result
sub property of: place
type: ObjectProperty
range: island
comment: Relation between Olympic Result and Island
comment: Relazione tra Olympic Result e Island @it

musical artist
label: musicien @fr
type: Class
label: artista musical @pt

links to Drug
domain: olympic result
comment: Relazione tra Olympic Result e Drug @it
range: drug
sub property of: drug
type: ObjectProperty
comment: Relation between Olympic Result and Drug

links to Continent
comment: Relation between Olympic Result and Continent
range: continent
domain: olympic result
sub property of: place
comment: Relazione tra Olympic Result e Continent @it
type: ObjectProperty

links to Judge
type: ObjectProperty
comment: Relazione tra Olympic Result e Judge @it
domain: olympic result
comment: Relation between Olympic Result and Judge
range: judge
sub property of: person

airport
type: Class
label: Flughafen @de
label: aéroport @fr