links to Book
type: ObjectProperty
comment: Relazione tra Poker Player e Book @it
domain: poker player
range: book
comment: Relation between Poker Player and Book
sub property of: work

links to Wrestler
comment: Relation between Poker Player and Wrestler
range: wrestler
sub property of: person
domain: poker player
comment: Relazione tra Poker Player e Wrestler @it
type: ObjectProperty

park
type: Class
label: parc @fr

links to Skyscraper
comment: Relazione tra Poker Player e Skyscraper @it
sub property of: place
domain: poker player
range: skyscraper
comment: Relation between Poker Player and Skyscraper
type: ObjectProperty

disease
label: maladie @fr
type: Class
type: ObjectProperty

links to American Football Team
sub property of: organização
domain: poker player
range: american football team
comment: Relation between Poker Player and American Football Team
comment: Relazione tra Poker Player e American Football Team @it
type: ObjectProperty

colour
type: Class
label: couleur @fr
label: χρώμα @el
type: ObjectProperty

automobile
type: Class

musical
type: Class
label: musique @fr

links to Island
range: island
comment: Relation between Poker Player and Island
comment: Relazione tra Poker Player e Island @it
type: ObjectProperty
sub property of: place
domain: poker player

links to Lake
range: lake
sub property of: place
domain: poker player
comment: Relazione tra Poker Player e Lake @it
type: ObjectProperty
comment: Relation between Poker Player and Lake

actor
label: acteur @fr
type: Class
label: Schauspieler @de

american football player
label: joueur de football américain @fr
type: Class

mean of transportation
type: ObjectProperty
label: moyen de transport @fr

links to Congressman
domain: poker player
type: ObjectProperty
range: congressman
comment: Relazione tra Poker Player e Congressman @it
sub property of: person
comment: Relation between Poker Player and Congressman

stadium
label: stade @fr
type: Class

place
label: lugar @pt
label: lieu @fr
label: περιοχή @el
type: ObjectProperty

links to President
domain: poker player
comment: Relation between Poker Player and President
type: ObjectProperty
sub property of: person
range: president
comment: Relazione tra Poker Player e President @it

PokerPlayer.owl
has intent: To represent the encyclopedic knowledge expressed by an object typed as PokerPlayer
extracted from: en.wikipedia.org
has author: Valentina Presutti
extracted from: dbpedia.org
type: Ontology
has author: Aldo Gangemi
has author: Andrea Giovanni Nuzzolese
comment: PokerPlayer Encyclopedic Knowledge Pattern
imports: dbpediainfoboxmatchingweight.owl
imports: cpannotationschema.owl

infrastructure
type: ObjectProperty

links to Office Holder
type: ObjectProperty
sub property of: person
range: office holder
domain: poker player
comment: Relazione tra Poker Player e Office Holder @it
comment: Relation between Poker Player and Office Holder

basketball league
type: Class
label: ligue de basketball @fr

links to Town
domain: poker player
comment: Relazione tra Poker Player e Town @it
range: town
comment: Relation between Poker Player and Town
sub property of: place
type: ObjectProperty

links to Governor
type: ObjectProperty
domain: poker player
sub property of: person
comment: Relation between Poker Player and Governor
comment: Relazione tra Poker Player e Governor @it
range: governor

wrestler
type: Class
label: lutteur @fr

links to Military Conflict
comment: Relazione tra Poker Player e Military Conflict @it
type: ObjectProperty
domain: poker player
range: military conflict
sub property of: event
comment: Relation between Poker Player and Military Conflict

species
label: espèce @fr
type: ObjectProperty

links to Comics Character
range: comics character
domain: poker player
type: ObjectProperty
comment: Relazione tra Poker Player e Comics Character @it
comment: Relation between Poker Player and Comics Character
sub property of: person

links to Colour
comment: Relation between Poker Player and Colour
sub property of: colour
comment: Relazione tra Poker Player e Colour @it
range: colour
domain: poker player
type: ObjectProperty

comedian
type: Class
label: comédien @fr

links to Scientist
sub property of: person
domain: poker player
comment: Relation between Poker Player and Scientist
type: ObjectProperty
range: scientist
comment: Relazione tra Poker Player e Scientist @it

newspaper
label: journal @fr
type: Class

game
label: jeu @fr
type: Class

road
type: Class
label: route @fr

links to Basketball League
comment: Relation between Poker Player and Basketball League
sub property of: organização
comment: Relazione tra Poker Player e Basketball League @it
type: ObjectProperty
domain: poker player
range: basketball league

boxer
label: boxeur @fr
type: Class

book
label: książka @pl
label: llibre @ca
label: βιβλίο @el
label: livre @fr
type: Class

links to Television Episode
type: ObjectProperty
range: television episode
comment: Relation between Poker Player and Television Episode
sub property of: work
domain: poker player
comment: Relazione tra Poker Player e Television Episode @it

language
type: Class
label: langage @fr
type: ObjectProperty

links to Historic Place
comment: Relazione tra Poker Player e Historic Place @it
domain: poker player
range: historic place
sub property of: place
comment: Relation between Poker Player and Historic Place
type: ObjectProperty

links to Tennis Player
domain: poker player
comment: Relazione tra Poker Player e Tennis Player @it
sub property of: person
comment: Relation between Poker Player and Tennis Player
range: tennis player
type: ObjectProperty

links to Language
sub property of: language
type: ObjectProperty
range: language
comment: Relazione tra Poker Player e Language @it
domain: poker player
comment: Relation between Poker Player and Language

non-profit organisation
type: Class
label: organisation à but non lucratif @fr

canadian football league
type: Class

lake
label: lac @fr
type: Class

links to Website
type: ObjectProperty
range: website
comment: Relation between Poker Player and Website
sub property of: website
domain: poker player
comment: Relazione tra Poker Player e Website @it

links to Newspaper
domain: poker player
type: ObjectProperty
comment: Relazione tra Poker Player e Newspaper @it
range: newspaper
sub property of: work
comment: Relation between Poker Player and Newspaper

governor
label: gouverneur @fr
type: Class

drug
type: ObjectProperty
label: médicament @fr
type: Class

links to Comedian
domain: poker player
comment: Relazione tra Poker Player e Comedian @it
range: comedian
sub property of: person
comment: Relation between Poker Player and Comedian
type: ObjectProperty

links to Film
type: ObjectProperty
sub property of: work
range: film
comment: Relation between Poker Player and Film
domain: poker player
comment: Relazione tra Poker Player e Film @it

poker player
label: joueur de poker @fr
type: Class

work
label: obra @pt
label: travail @fr
type: ObjectProperty

links to Boxer
comment: Relation between Poker Player and Boxer
sub property of: person
domain: poker player
range: boxer
comment: Relazione tra Poker Player e Boxer @it
type: ObjectProperty

magazine
type: Class
label: περιοδικό @el

school
label: école @fr
type: Class

ship
type: Class
label: navire @fr

links to Sport
range: sport
domain: poker player
type: ObjectProperty
comment: Relazione tra Poker Player e Sport @it
sub property of: activity
comment: Relation between Poker Player and Sport

tennis player
label: joueur de tennis @fr
type: Class

links to Baseball Player
comment: Relation between Poker Player and Baseball Player
range: baseball player
type: ObjectProperty
comment: Relazione tra Poker Player e Baseball Player @it
domain: poker player
sub property of: person

links to Mammal
sub property of: species
domain: poker player
range: mammal
comment: Relation between Poker Player and Mammal
comment: Relazione tra Poker Player e Mammal @it
type: ObjectProperty

video game
type: Class
label: jeux vidéo @fr

links to Canadian Football Team
range: canadian football team
comment: Relazione tra Poker Player e Canadian Football Team @it
domain: poker player
sub property of: organização
type: ObjectProperty
comment: Relation between Poker Player and Canadian Football Team

links to Drug
comment: Relazione tra Poker Player e Drug @it
comment: Relation between Poker Player and Drug
sub property of: drug
type: ObjectProperty
domain: poker player
range: drug

links to American Football Player
type: ObjectProperty
comment: Relazione tra Poker Player e American Football Player @it
sub property of: person
range: american football player
comment: Relation between Poker Player and American Football Player
domain: poker player

currency
type: Class
label: devise @fr
type: ObjectProperty

links to Video Game
comment: Relazione tra Poker Player e Video Game @it
range: video game
comment: Relation between Poker Player and Video Game
domain: poker player
sub property of: work
type: ObjectProperty

British royalty
label: royauté Britannique @fr
type: Class

historic place
type: Class
label: site historique @fr

sport
type: Class

single
type: Class

Band
label: banda @pt
label: Musikgruppe @de
type: Class
label: groupe de musique @fr

town
type: Class
label: ville @fr

links to Conifer
range: conifer
comment: Relazione tra Poker Player e Conifer @it
comment: Relation between Poker Player and Conifer
domain: poker player
sub property of: species
type: ObjectProperty

links to Currency
sub property of: currency
type: ObjectProperty
range: currency
comment: Relation between Poker Player and Currency
domain: poker player
comment: Relazione tra Poker Player e Currency @it

links to Ethnic Group
range: ethnic group
comment: Relazione tra Poker Player e Ethnic Group @it
type: ObjectProperty
comment: Relation between Poker Player and Ethnic Group
domain: poker player
sub property of: ethnic group

continent
type: Class
label: ήπειρος @el

ethnic group
label: groupe ethnique @fr
type: ObjectProperty
type: Class

links to British Royalty
type: ObjectProperty
comment: Relazione tra Poker Player e British Royalty @it
domain: poker player
range: British royalty
comment: Relation between Poker Player and British Royalty
sub property of: person

president
type: Class
label: président @fr

album
label: Album @de
type: Class

person
label: personne @fr
type: ObjectProperty
label: pessoa @pt
label: Person @de

military unit
label: unité militaire @fr
type: Class

television episode
type: Class
label: épisode télévisé @fr

basketball team
type: Class

village
label: χωριό @el
type: Class

canadian football team
label: équipe canadienne de football américain @fr
type: Class

soccer club
label: club de football @fr
type: Class

music genre
label: genre musical @fr
type: ObjectProperty
label: género musical @pt
type: Class

writer
type: Class
label: écrivain @fr

links to Golf Player
sub property of: person
type: ObjectProperty
comment: Relation between Poker Player and Golf Player
domain: poker player
comment: Relazione tra Poker Player e Golf Player @it
range: golf player

baseball player
type: Class
label: joueur de baseball @fr

office holder
label: titulaire @fr
label: Amtsinhaber @de
type: Class

military conflict
label: conflit militaire @fr
type: Class

website
label: site web @fr
label: Ιστότοπος @el
type: Class
type: ObjectProperty

links to Musical Artist
domain: poker player
type: ObjectProperty
comment: Relazione tra Poker Player e Musical Artist @it
related match: before
type: NamedIndividual
range: musical artist
comment: Relation between Poker Player and Musical Artist
related match: after
sub property of: person

links to Radio Station
type: ObjectProperty
comment: Relazione tra Poker Player e Radio Station @it
sub property of: organização
domain: poker player
comment: Relation between Poker Player and Radio Station
range: radio station

links to Game
range: game
domain: poker player
type: ObjectProperty
comment: Relazione tra Poker Player e Game @it
comment: Relation between Poker Player and Game
sub property of: activity

links to Road
range: road
comment: Relation between Poker Player and Road
domain: poker player
sub property of: infrastructure
type: ObjectProperty
comment: Relazione tra Poker Player e Road @it

links to Musical
comment: Relation between Poker Player and Musical
comment: Relazione tra Poker Player e Musical @it
sub property of: work
type: ObjectProperty
domain: poker player
range: musical

links to Park
range: park
domain: poker player
type: ObjectProperty
sub property of: place
comment: Relazione tra Poker Player e Park @it
comment: Relation between Poker Player and Park

links to Military Unit
range: military unit
comment: Relazione tra Poker Player e Military Unit @it
domain: poker player
type: ObjectProperty
sub property of: organização
comment: Relation between Poker Player and Military Unit

Axiom
dbpedia infobox matching weight: 50.0
annotated property: relatedMatch
annotated target: before
annotated source: links to Musical Artist

links to Canadian Football League
range: canadian football league
domain: poker player
comment: Relation between Poker Player and Canadian Football League
sub property of: organização
comment: Relazione tra Poker Player e Canadian Football League @it
type: ObjectProperty

mountain range
type: Class
label: chaîne de montagne @fr

links to Soccer Player
comment: Relazione tra Poker Player e Soccer Player @it
type: ObjectProperty
sub property of: person
comment: Relation between Poker Player and Soccer Player
domain: poker player
range: soccer player

beverage
label: boisson @fr
type: Class
type: ObjectProperty

links to Baseball League
comment: Relazione tra Poker Player e Baseball League @it
range: baseball league
domain: poker player
type: ObjectProperty
sub property of: organização
comment: Relation between Poker Player and Baseball League

links to Village
comment: Relazione tra Poker Player e Village @it
range: village
type: ObjectProperty
domain: poker player
comment: Relation between Poker Player and Village
sub property of: place

links to Legislature
sub property of: organização
type: ObjectProperty
domain: poker player
comment: Relazione tra Poker Player e Legislature @it
comment: Relation between Poker Player and Legislature
range: legislature

links to Disease
domain: poker player
type: ObjectProperty
comment: Relazione tra Poker Player e Disease @it
range: disease
comment: Relation between Poker Player and Disease
sub property of: disease

links to Nascar Driver
range: nascar driver
type: ObjectProperty
comment: Relazione tra Poker Player e Nascar Driver @it
comment: Relation between Poker Player and Nascar Driver
domain: poker player
sub property of: person

links to Actor
domain: poker player
sub property of: person
comment: Relazione tra Poker Player e Actor @it
comment: Relation between Poker Player and Actor
range: actor
type: ObjectProperty

soccer player
type: Class
label: joueur de football @fr

scientist
label: Wissenschaftler @de
type: Class
label: scientifique @fr

links to Single
domain: poker player
type: ObjectProperty
comment: Relation between Poker Player and Single
comment: Relazione tra Poker Player e Single @it
range: single
sub property of: work

links to Album
type: ObjectProperty
range: album
sub property of: work
comment: Relation between Poker Player and Album
domain: poker player
comment: Relazione tra Poker Player e Album @it

legislature
type: Class
label: pouvoir législatif @fr

links to Band
comment: Relazione tra Poker Player e Band @it
range: Band
type: ObjectProperty
comment: Relation between Poker Player and Band
domain: poker player
sub property of: organização

links to School
domain: poker player
comment: Relation between Poker Player and School
sub property of: organização
range: school
comment: Relazione tra Poker Player e School @it
type: ObjectProperty

organização
type: ObjectProperty
label: organisation
label: Organisation @de

links to Automobile
range: automobile
type: ObjectProperty
sub property of: mean of transportation
comment: Relazione tra Poker Player e Automobile @it
comment: Relation between Poker Player and Automobile
domain: poker player

baseball league
type: Class
label: ligue de baseball @fr

congressman
type: Class
label: membre du Congrès @fr

Axiom
dbpedia infobox matching weight: 50.0
annotated property: relatedMatch
annotated target: after
annotated source: links to Musical Artist

golf player
type: Class
label: golfeur @fr

nascar driver
type: Class
label: pilote de la nascar @fr

activity
label: activité @fr
label: Aktivität @de
type: ObjectProperty

journalist
type: Class
label: journaliste @fr

links to Non- Profit Organisation
comment: Relazione tra Poker Player e Non- Profit Organisation @it
domain: poker player
comment: Relation between Poker Player and Non- Profit Organisation
type: ObjectProperty
range: non-profit organisation
sub property of: organização

links to Music Genre
range: music genre
domain: poker player
comment: Relation between Poker Player and Music Genre
comment: Relazione tra Poker Player e Music Genre @it
sub property of: music genre
type: ObjectProperty

links to Journalist
sub property of: person
type: ObjectProperty
range: journalist
domain: poker player
comment: Relazione tra Poker Player e Journalist @it
comment: Relation between Poker Player and Journalist

film
type: Class
label: ταινία @el

mammal
type: Class
label: mammifère @fr

american football team
label: équipe américaine de football américain @fr
type: Class

links to Basketball Team
comment: Relation between Poker Player and Basketball Team
comment: Relazione tra Poker Player e Basketball Team @it
range: basketball team
sub property of: organização
type: ObjectProperty
domain: poker player

island
type: Class
label: νησί @el
label: île @fr

links to Writer
type: ObjectProperty
sub property of: person
domain: poker player
comment: Relation between Poker Player and Writer
comment: Relazione tra Poker Player e Writer @it
range: writer

comics character
type: Class
label: personnage de bandes dessinées @fr

event
type: ObjectProperty
label: évènement @fr

skyscraper
label: gratte-ciel @fr
type: Class

links to Beverage
type: ObjectProperty
sub property of: beverage
comment: Relazione tra Poker Player e Beverage @it
comment: Relation between Poker Player and Beverage
range: beverage
domain: poker player

radio station
type: Class
label: station de radio @fr

links to Soccer Club
range: soccer club
comment: Relazione tra Poker Player e Soccer Club @it
sub property of: organização
comment: Relation between Poker Player and Soccer Club
domain: poker player
type: ObjectProperty

links to Member Of Parliament
domain: poker player
comment: Relazione tra Poker Player e Member Of Parliament @it
comment: Relation between Poker Player and Member Of Parliament
range: member of parliament
sub property of: person
type: ObjectProperty

member of parliament
type: Class
label: membre du Parlement @fr

musical artist
label: artista musical @pt
type: Class
label: musicien @fr

links to Mountain Range
sub property of: place
comment: Relazione tra Poker Player e Mountain Range @it
range: mountain range
type: ObjectProperty
domain: poker player
comment: Relation between Poker Player and Mountain Range

links to Ship
range: ship
sub property of: mean of transportation
comment: Relation between Poker Player and Ship
comment: Relazione tra Poker Player e Ship @it
type: ObjectProperty
domain: poker player

links to Stadium
comment: Relation between Poker Player and Stadium
domain: poker player
type: ObjectProperty
comment: Relazione tra Poker Player e Stadium @it
sub property of: place
range: stadium

links to Magazine
sub property of: work
comment: Relazione tra Poker Player e Magazine @it
domain: poker player
type: ObjectProperty
range: magazine
comment: Relation between Poker Player and Magazine

links to Continent
sub property of: place
comment: Relation between Poker Player and Continent
range: continent
type: ObjectProperty
comment: Relazione tra Poker Player e Continent @it
domain: poker player

conifer
type: Class
label: conifères @fr