links to Musical Artist
type: ObjectProperty
sub property of: person
comment: Relation between Prime Minister and Musical Artist
domain: prime minister
range: musical artist
comment: Relazione tra Prime Minister e Musical Artist @it

Axiom
dbpedia infobox matching weight: 1.96
annotated property: relatedMatch
annotated target: post4preceded
annotated source: links to Member Of Parliament

links to Disease
comment: Relazione tra Prime Minister e Disease @it
type: ObjectProperty
comment: Relation between Prime Minister and Disease
range: disease
sub property of: disease
domain: prime minister

television show
type: Class
label: émission de télévision @fr

links to Philosopher
comment: Relazione tra Prime Minister e Philosopher @it
range: philosopher
type: ObjectProperty
sub property of: person
comment: Relation between Prime Minister and Philosopher
domain: prime minister
related match: before
type: NamedIndividual

disease
type: ObjectProperty
type: Class
label: maladie @fr

colour
type: ObjectProperty
label: χρώμα @el
label: couleur @fr
type: Class

links to Mountain Range
comment: Relazione tra Prime Minister e Mountain Range @it
domain: prime minister
sub property of: place
range: mountain range
type: ObjectProperty
comment: Relation between Prime Minister and Mountain Range

Axiom
dbpedia infobox matching weight: 25.0
annotated property: relatedMatch
annotated target: president
annotated source: links to Monarch

mean of transportation
label: moyen de transport @fr
type: ObjectProperty

links to Governor
related match: governorGeneral
range: governor
related match: post3preceded
related match: before
sub property of: person
domain: prime minister
comment: Relation between Prime Minister and Governor
type: ObjectProperty
comment: Relazione tra Prime Minister e Governor @it
type: NamedIndividual

Axiom
dbpedia infobox matching weight: 33.33
annotated property: relatedMatch
annotated source: links to Writer
annotated target: years

stadium
label: stade @fr
type: Class

soccer league
type: Class
label: ligue de football @fr

links to Currency
domain: prime minister
comment: Relazione tra Prime Minister e Currency @it
range: currency
sub property of: currency
type: ObjectProperty
comment: Relation between Prime Minister and Currency

Axiom
dbpedia infobox matching weight: 100.0
annotated property: relatedMatch
annotated source: links to School
annotated target: almaMater

links to Film
comment: Relation between Prime Minister and Film
sub property of: work
range: film
domain: prime minister
type: ObjectProperty
comment: Relazione tra Prime Minister e Film @it

mayor
type: Class
label: maire @fr

pope
label: pape @fr
type: Class

species
label: espèce @fr
type: ObjectProperty

Axiom
dbpedia infobox matching weight: 55.56
annotated target: after
annotated source: links to Military Person
annotated property: relatedMatch

newspaper
type: Class
label: journal @fr

Axiom
dbpedia infobox matching weight: 100.0
annotated property: relatedMatch
annotated target: commands
annotated source: links to Ship

game
type: Class
label: jeu @fr

protected area
type: Class
label: προστατευμένη περιοχή @el
label: aire protégée @fr

road
type: Class
label: route @fr

links to Town
comment: Relazione tra Prime Minister e Town @it
comment: Relation between Prime Minister and Town
type: NamedIndividual
related match: deathPlace
sub property of: place
domain: prime minister
range: town
related match: placeOfDeath
related match: placeOfBirth
related match: birthPlace
type: ObjectProperty

judge
type: Class
label: juge @fr

links to Cardinal
type: ObjectProperty
sub property of: person
range: cardinal
comment: Relazione tra Prime Minister e Cardinal @it
comment: Relation between Prime Minister and Cardinal
domain: prime minister

World Heritage Site
label: site du patrimoine mondial @fr
type: Class

Axiom
dbpedia infobox matching weight: 1.96
annotated property: relatedMatch
annotated target: children
annotated source: links to Member Of Parliament

links to Baseball League
sub property of: organisation
comment: Relation between Prime Minister and Baseball League
type: ObjectProperty
comment: Relazione tra Prime Minister e Baseball League @it
domain: prime minister
range: baseball league

links to Bone
type: ObjectProperty
comment: Relation between Prime Minister and Bone
range: bone
sub property of: anatomical structure
domain: prime minister
comment: Relazione tra Prime Minister e Bone @it

station
type: Class

language
type: Class
label: langage @fr
type: ObjectProperty

Axiom
dbpedia infobox matching weight: 66.67
annotated target: before
annotated property: relatedMatch
annotated source: links to Writer

links to Soccer Club
type: ObjectProperty
sub property of: organisation
domain: prime minister
comment: Relazione tra Prime Minister e Soccer Club @it
comment: Relation between Prime Minister and Soccer Club
range: soccer club

tennis league
type: Class
label: ligue de tennis @fr

links to Airline
type: ObjectProperty
range: airline
sub property of: organisation
comment: Relazione tra Prime Minister e Airline @it
domain: prime minister
comment: Relation between Prime Minister and Airline

lake
type: Class
label: lac @fr

Axiom
dbpedia infobox matching weight: 11.11
annotated property: relatedMatch
annotated target: governor
annotated source: links to Military Person

Axiom
dbpedia infobox matching weight: 100.0
annotated target: after
annotated source: links to Cricketer
annotated property: relatedMatch

governor
type: Class
label: gouverneur @fr

links to Fish
range: fish
domain: prime minister
comment: Relation between Prime Minister and Fish
comment: Relazione tra Prime Minister e Fish @it
sub property of: species
type: ObjectProperty

work
label: obra @pt
label: travail @fr
type: ObjectProperty

river
type: Class
label: rivière @fr

links to Lighthouse
range: lighthouse
type: ObjectProperty
domain: prime minister
comment: Relazione tra Prime Minister e Lighthouse @it
comment: Relation between Prime Minister and Lighthouse
sub property of: place

school
type: Class
label: école @fr

Axiom
dbpedia infobox matching weight: 25.0
annotated property: relatedMatch
annotated source: links to Town
annotated target: deathPlace

ship
label: navire @fr
type: Class

museum
type: Class
label: musée @fr

fish
label: poisson @fr
type: Class

links to Road
domain: prime minister
type: ObjectProperty
comment: Relation between Prime Minister and Road
comment: Relazione tra Prime Minister e Road @it
sub property of: infrastructure
range: road

video game
label: jeux vidéo @fr
type: Class

trade union
label: syndicat professionnel @fr
type: Class

links to Bridge
domain: prime minister
range: bridge
comment: Relation between Prime Minister and Bridge
sub property of: place
type: ObjectProperty
comment: Relazione tra Prime Minister e Bridge @it

Axiom
dbpedia infobox matching weight: 50.0
annotated target: before
annotated source: links to Mayor
annotated property: relatedMatch

currency
type: ObjectProperty
type: Class
label: devise @fr

prime minister
label: premier ministre @fr
type: Class

historic place
label: site historique @fr
type: Class

Axiom
dbpedia infobox matching weight: 25.0
annotated source: links to Town
annotated property: relatedMatch
annotated target: placeOfDeath

hospital
label: hôpital @fr
type: Class

links to Radio Station
range: radio station
type: ObjectProperty
domain: prime minister
comment: Relazione tra Prime Minister e Radio Station @it
comment: Relation between Prime Minister and Radio Station
sub property of: organisation

links to Conifer
domain: prime minister
comment: Relation between Prime Minister and Conifer
range: conifer
sub property of: species
type: ObjectProperty
comment: Relazione tra Prime Minister e Conifer @it

lunar crater
label: cratère lunaire @fr
type: Class

links to Ambassador
domain: prime minister
range: ambassador
sub property of: person
type: ObjectProperty
comment: Relazione tra Prime Minister e Ambassador @it
comment: Relation between Prime Minister and Ambassador

links to Colour
type: ObjectProperty
comment: Relation between Prime Minister and Colour
range: colour
sub property of: colour
comment: Relazione tra Prime Minister e Colour @it
domain: prime minister

Axiom
dbpedia infobox matching weight: 9.09
annotated property: relatedMatch
annotated source: links to Governor
annotated target: post3preceded

links to Newspaper
comment: Relazione tra Prime Minister e Newspaper @it
range: newspaper
comment: Relation between Prime Minister and Newspaper
sub property of: work
type: ObjectProperty
domain: prime minister

continent
type: Class
label: ήπειρος @el

links to Military Person
related match: before
range: military person
type: NamedIndividual
related match: after
related match: regent
sub property of: person
domain: prime minister
related match: governor
type: ObjectProperty
comment: Relation between Prime Minister and Military Person
comment: Relazione tra Prime Minister e Military Person @it

album
label: Album @de
type: Class

figure skater
label: patineur artistique @fr
type: Class

links to Book
domain: prime minister
sub property of: work
type: ObjectProperty
range: book
comment: Relazione tra Prime Minister e Book @it
comment: Relation between Prime Minister and Book

person
label: Person @de
label: pessoa @pt
type: ObjectProperty
label: personne @fr

military unit
label: unité militaire @fr
type: Class

links to Television Episode
sub property of: work
domain: prime minister
comment: Relation between Prime Minister and Television Episode
range: television episode
type: ObjectProperty
comment: Relazione tra Prime Minister e Television Episode @it

links to Mayor
range: mayor
domain: prime minister
sub property of: person
comment: Relation between Prime Minister and Mayor
related match: after
type: NamedIndividual
type: ObjectProperty
comment: Relazione tra Prime Minister e Mayor @it
related match: before

links to Protected Area
comment: Relation between Prime Minister and Protected Area
comment: Relazione tra Prime Minister e Protected Area @it
type: ObjectProperty
domain: prime minister
range: protected area
sub property of: place

links to Power Station
sub property of: infrastructure
type: ObjectProperty
domain: prime minister
comment: Relation between Prime Minister and Power Station
range: power station
comment: Relazione tra Prime Minister e Power Station @it

soccer manager
type: Class
label: entraîneur de football @fr

links to School
comment: Relation between Prime Minister and School
range: school
sub property of: organisation
comment: Relazione tra Prime Minister e School @it
domain: prime minister
type: ObjectProperty
related match: almaMater
type: NamedIndividual

links to Hospital
comment: Relazione tra Prime Minister e Hospital @it
domain: prime minister
type: ObjectProperty
comment: Relation between Prime Minister and Hospital
range: hospital
sub property of: place

music genre
label: genre musical @fr
type: ObjectProperty
label: género musical @pt
type: Class

PrimeMinister.owl
imports: dbpediainfoboxmatchingweight.owl
imports: cpannotationschema.owl
comment: PrimeMinister Encyclopedic Knowledge Pattern
type: Ontology
has author: Aldo Gangemi
has intent: To represent the encyclopedic knowledge expressed by an object typed as PrimeMinister
extracted from: en.wikipedia.org
has author: Valentina Presutti
extracted from: dbpedia.org
has author: Andrea Giovanni Nuzzolese

writer
label: écrivain @fr
type: Class

record label
type: Class
label: label discographique @fr

architect
label: architecte @fr
type: Class

links to Album
type: ObjectProperty
sub property of: work
domain: prime minister
comment: Relation between Prime Minister and Album
comment: Relazione tra Prime Minister e Album @it
range: album

links to Ski Area
range: ski area
domain: prime minister
comment: Relation between Prime Minister and Ski Area
sub property of: place
comment: Relazione tra Prime Minister e Ski Area @it
type: ObjectProperty

ambassador
label: ambassadeur @fr
type: Class

links to Island
sub property of: place
comment: Relazione tra Prime Minister e Island @it
comment: Relation between Prime Minister and Island
domain: prime minister
type: ObjectProperty
range: island

links to Olympics
range: olympics
sub property of: event
comment: Relation between Prime Minister and Olympics
domain: prime minister
type: ObjectProperty
comment: Relazione tra Prime Minister e Olympics @it

links to Rugby Player
type: ObjectProperty
domain: prime minister
comment: Relazione tra Prime Minister e Rugby Player @it
comment: Relation between Prime Minister and Rugby Player
range: rugby player
sub property of: person

links to Cricketer
type: NamedIndividual
related match: after
type: ObjectProperty
comment: Relazione tra Prime Minister e Cricketer @it
comment: Relation between Prime Minister and Cricketer
range: cricketer
sub property of: person
domain: prime minister

links to Magazine
range: magazine
type: ObjectProperty
sub property of: work
domain: prime minister
comment: Relation between Prime Minister and Magazine
comment: Relazione tra Prime Minister e Magazine @it

links to Mammal
comment: Relazione tra Prime Minister e Mammal @it
type: ObjectProperty
range: mammal
sub property of: species
comment: Relation between Prime Minister and Mammal
domain: prime minister

links to Song
domain: prime minister
range: song
comment: Relation between Prime Minister and Song
comment: Relazione tra Prime Minister e Song @it
sub property of: work
type: ObjectProperty

lighthouse
label: phare @fr
type: Class

chancellor
label: chancelier @fr
type: Class

aircraft
label: αεροσκάφος @el
type: Class
label: avion @fr

links to Sport
type: ObjectProperty
sub property of: activity
comment: Relazione tra Prime Minister e Sport @it
range: sport
comment: Relation between Prime Minister and Sport
domain: prime minister

Axiom
dbpedia infobox matching weight: 100.0
annotated property: relatedMatch
annotated target: deputy
annotated source: links to Basketball Player

links to College
comment: Relation between Prime Minister and College
range: college
domain: prime minister
comment: Relazione tra Prime Minister e College @it
type: ObjectProperty
sub property of: organisation

links to Band
sub property of: organisation
domain: prime minister
comment: Relazione tra Prime Minister e Band @it
range: Band
type: ObjectProperty
comment: Relation between Prime Minister and Band

soccer player
type: Class
label: joueur de football @fr

links to Airport
comment: Relation between Prime Minister and Airport
range: airport
type: ObjectProperty
domain: prime minister
sub property of: place
comment: Relazione tra Prime Minister e Airport @it

links to Journalist
sub property of: person
range: journalist
comment: Relazione tra Prime Minister e Journalist @it
comment: Relation between Prime Minister and Journalist
domain: prime minister
type: ObjectProperty

links to Bird
comment: Relation between Prime Minister and Bird
comment: Relazione tra Prime Minister e Bird @it
domain: prime minister
range: bird
sub property of: species
type: ObjectProperty

airline
type: Class
label: compagnie aérienne @fr

links to Mountain
comment: Relazione tra Prime Minister e Mountain @it
sub property of: place
type: ObjectProperty
comment: Relation between Prime Minister and Mountain
range: mountain
domain: prime minister

links to Ice Hockey Player
type: ObjectProperty
sub property of: person
domain: prime minister
comment: Relazione tra Prime Minister e Ice Hockey Player @it
range: ice hockey player
comment: Relation between Prime Minister and Ice Hockey Player

links to Continent
sub property of: place
domain: prime minister
comment: Relazione tra Prime Minister e Continent @it
comment: Relation between Prime Minister and Continent
range: continent
type: ObjectProperty

monarch
type: Class
label: monarque @fr

congressman
type: Class
label: membre du Congrès @fr

links to Stadium
comment: Relazione tra Prime Minister e Stadium @it
range: stadium
type: ObjectProperty
domain: prime minister
comment: Relation between Prime Minister and Stadium
sub property of: place

Axiom
dbpedia infobox matching weight: 1.96
annotated property: relatedMatch
annotated source: links to Member Of Parliament
annotated target: post1followed

activity
type: ObjectProperty
label: Aktivität @de
label: activité @fr

Axiom
dbpedia infobox matching weight: 100.0
annotated source: links to Village
annotated property: relatedMatch
annotated target: residence

Axiom
dbpedia infobox matching weight: 1.96
annotated property: relatedMatch
annotated source: links to Member Of Parliament
annotated target: post2followed

links to Skyscraper
range: skyscraper
type: ObjectProperty
comment: Relation between Prime Minister and Skyscraper
sub property of: place
comment: Relazione tra Prime Minister e Skyscraper @it
domain: prime minister

journalist
type: Class
label: journaliste @fr

links to Video Game
type: ObjectProperty
sub property of: work
comment: Relazione tra Prime Minister e Video Game @it
range: video game
domain: prime minister
comment: Relation between Prime Minister and Video Game

film
label: ταινία @el
type: Class

Axiom
dbpedia infobox matching weight: 31.37
annotated target: before
annotated source: links to Member Of Parliament
annotated property: relatedMatch

links to Website
sub property of: website
domain: prime minister
comment: Relazione tra Prime Minister e Website @it
type: ObjectProperty
comment: Relation between Prime Minister and Website
range: website

links to Television Show
type: ObjectProperty
range: television show
sub property of: work
comment: Relazione tra Prime Minister e Television Show @it
domain: prime minister
comment: Relation between Prime Minister and Television Show

links to World Heritage Site
comment: Relation between Prime Minister and World Heritage Site
type: ObjectProperty
sub property of: place
range: World Heritage Site
domain: prime minister
comment: Relazione tra Prime Minister e World Heritage Site @it

bird
label: oiseau @fr
type: Class

chemical compound
type: Class
type: ObjectProperty
label: produit chimique @fr

power station
type: Class

Gaelic games player
label: joueur de sports gaéliques @fr
type: Class

links to Military Unit
type: NamedIndividual
related match: unit
range: military unit
type: ObjectProperty
comment: Relation between Prime Minister and Military Unit
comment: Relazione tra Prime Minister e Military Unit @it
domain: prime minister
sub property of: organisation

musical artist
label: artista musical @pt
type: Class
label: musicien @fr

links to Figure Skater
comment: Relation between Prime Minister and Figure Skater
sub property of: person
comment: Relazione tra Prime Minister e Figure Skater @it
domain: prime minister
range: figure skater
type: ObjectProperty

Axiom
dbpedia infobox matching weight: 25.0
annotated source: links to Monarch
annotated target: monarch
annotated property: relatedMatch

links to Lunar Crater
type: ObjectProperty
comment: Relation between Prime Minister and Lunar Crater
domain: prime minister
range: lunar crater
comment: Relazione tra Prime Minister e Lunar Crater @it
sub property of: place

links to Language
type: ObjectProperty
comment: Relazione tra Prime Minister e Language @it
sub property of: language
comment: Relation between Prime Minister and Language
range: language
domain: prime minister
related match: languagesspoken
type: NamedIndividual

fictional character
type: Class
label: personnage de fiction @fr

park
type: Class
label: parc @fr

links to Scientist
type: ObjectProperty
type: NamedIndividual
range: scientist
comment: Relazione tra Prime Minister e Scientist @it
related match: after
comment: Relation between Prime Minister and Scientist
domain: prime minister
related match: before
sub property of: person

links to Comedian
range: comedian
domain: prime minister
sub property of: person
comment: Relation between Prime Minister and Comedian
type: ObjectProperty
comment: Relazione tra Prime Minister e Comedian @it

cardinal
type: Class

rugby player
label: joueur de rugby @fr
type: Class

links to Soccer Player
comment: Relation between Prime Minister and Soccer Player
type: ObjectProperty
domain: prime minister
range: soccer player
sub property of: person
comment: Relazione tra Prime Minister e Soccer Player @it

links to Baseball Player
sub property of: person
domain: prime minister
comment: Relation between Prime Minister and Baseball Player
comment: Relazione tra Prime Minister e Baseball Player @it
range: baseball player
type: ObjectProperty

musical
type: Class
label: musique @fr

Axiom
dbpedia infobox matching weight: 56.86
annotated property: relatedMatch
annotated source: links to Member Of Parliament
annotated target: after

links to Tennis League
sub property of: organisation
range: tennis league
domain: prime minister
comment: Relation between Prime Minister and Tennis League
type: ObjectProperty
comment: Relazione tra Prime Minister e Tennis League @it

links to Senator
comment: Relation between Prime Minister and Senator
range: senator
domain: prime minister
type: ObjectProperty
sub property of: person
comment: Relazione tra Prime Minister e Senator @it

actor
label: acteur @fr
type: Class
label: Schauspieler @de

cyclist
label: cycliste @fr
type: Class

place
type: ObjectProperty
label: περιοχή @el
label: lieu @fr
label: lugar @pt

Axiom
dbpedia infobox matching weight: 25.0
annotated source: links to Town
annotated property: relatedMatch
annotated target: birthPlace

links to Gaelic Games Player
range: Gaelic games player
type: ObjectProperty
comment: Relation between Prime Minister and Gaelic Games Player
comment: Relazione tra Prime Minister e Gaelic Games Player @it
domain: prime minister
sub property of: person

links to Architect
domain: prime minister
comment: Relation between Prime Minister and Architect
comment: Relazione tra Prime Minister e Architect @it
range: architect
type: ObjectProperty
sub property of: person

infrastructure
type: ObjectProperty

mountain
type: Class
label: montagne @fr
label: Βουνό @el

criminal
label: criminel @fr
type: Class

flowering plant
label: angiospermes @fr
type: Class

Axiom
dbpedia infobox matching weight: 100.0
annotated source: links to Chancellor
annotated property: relatedMatch
annotated target: before

senator
type: Class
label: sénateur @fr

saint
type: Class

comedian
type: Class
label: comédien @fr

song
label: chanson @fr
type: Class

links to Music Genre
range: music genre
domain: prime minister
comment: Relazione tra Prime Minister e Music Genre @it
comment: Relation between Prime Minister and Music Genre
sub property of: music genre
type: ObjectProperty

book
label: llibre @ca
label: książka @pl
label: βιβλίο @el
label: livre @fr
type: Class

links to Judge
related match: post4followed
type: NamedIndividual
type: ObjectProperty
comment: Relazione tra Prime Minister e Judge @it
range: judge
comment: Relation between Prime Minister and Judge
domain: prime minister
sub property of: person

links to Pope
type: ObjectProperty
comment: Relazione tra Prime Minister e Pope @it
range: pope
comment: Relation between Prime Minister and Pope
domain: prime minister
sub property of: person

device
type: ObjectProperty
label: appareil @fr

shopping mall
label: centre commercial @fr
type: Class

gridiron football player
type: Class
label: joueur de football américain gridiron @fr

links to Park
comment: Relazione tra Prime Minister e Park @it
domain: prime minister
range: park
comment: Relation between Prime Minister and Park
type: ObjectProperty
sub property of: place

ski area
label: domaine skiable @fr
type: Class

non-profit organisation
type: Class
label: organisation à but non lucratif @fr

links to Drug
comment: Relazione tra Prime Minister e Drug @it
domain: prime minister
sub property of: drug
type: ObjectProperty
comment: Relation between Prime Minister and Drug
range: drug

Axiom
dbpedia infobox matching weight: 100.0
annotated source: links to Judge
annotated target: post4followed
annotated property: relatedMatch

links to Chancellor
related match: before
type: NamedIndividual
range: chancellor
sub property of: person
domain: prime minister
comment: Relazione tra Prime Minister e Chancellor @it
type: ObjectProperty
comment: Relation between Prime Minister and Chancellor

weapon
type: Class
label: arme @fr

drug
type: Class
label: médicament @fr
type: ObjectProperty

links to Aircraft
comment: Relazione tra Prime Minister e Aircraft @it
domain: prime minister
sub property of: mean of transportation
comment: Relation between Prime Minister and Aircraft
type: ObjectProperty
range: aircraft

links to Historic Building
comment: Relazione tra Prime Minister e Historic Building @it
sub property of: place
comment: Relation between Prime Minister and Historic Building
domain: prime minister
type: ObjectProperty
range: historic building

magazine
type: Class
label: περιοδικό @el

canal
type: Class

military person
label: militaire @fr
type: Class

philosopher
label: philosophe @fr
type: Class

award
type: ObjectProperty
label: récompense @fr
type: Class

links to Weapon
sub property of: device
comment: Relation between Prime Minister and Weapon
domain: prime minister
type: ObjectProperty
range: weapon
comment: Relazione tra Prime Minister e Weapon @it

college
type: Class

anatomical structure
type: ObjectProperty
label: structure anatomique @fr

sport
type: Class

Axiom
dbpedia infobox matching weight: 50.0
annotated target: after
annotated source: links to Mayor
annotated property: relatedMatch

links to Record Label
comment: Relazione tra Prime Minister e Record Label @it
type: ObjectProperty
range: record label
comment: Relation between Prime Minister and Record Label
domain: prime minister
sub property of: organisation

cricketer
label: joueur de cricket @fr
type: Class

single
type: Class

Band
label: banda @pt
label: Musikgruppe @de
type: Class
label: groupe de musique @fr

town
label: ville @fr
type: Class

Axiom
dbpedia infobox matching weight: 25.0
annotated property: relatedMatch
annotated target: before
annotated source: links to Monarch

links to Writer
related match: years
comment: Relation between Prime Minister and Writer
comment: Relazione tra Prime Minister e Writer @it
type: NamedIndividual
type: ObjectProperty
related match: before
range: writer
sub property of: person
domain: prime minister

links to Criminal
type: NamedIndividual
related match: after
comment: Relation between Prime Minister and Criminal
comment: Relazione tra Prime Minister e Criminal @it
type: ObjectProperty
sub property of: person
domain: prime minister
range: criminal

Axiom
dbpedia infobox matching weight: 25.0
annotated property: relatedMatch
annotated source: links to Monarch
annotated target: after

links to Trade Union
type: ObjectProperty
comment: Relazione tra Prime Minister e Trade Union @it
domain: prime minister
sub property of: organisation
comment: Relation between Prime Minister and Trade Union
range: trade union

hotel
label: hôtel @fr
type: Class

links to Musical
sub property of: work
range: musical
comment: Relation between Prime Minister and Musical
comment: Relazione tra Prime Minister e Musical @it
domain: prime minister
type: ObjectProperty

television episode
label: épisode télévisé @fr
type: Class

village
type: Class
label: χωριό @el

links to Canal
sub property of: place
type: ObjectProperty
range: canal
comment: Relazione tra Prime Minister e Canal @it
domain: prime minister
comment: Relation between Prime Minister and Canal

ice hockey league
label: ligue d'hockey sur glace @fr
type: Class

soccer club
type: Class
label: club de football @fr

Axiom
dbpedia infobox matching weight: 100.0
annotated target: before
annotated property: relatedMatch
annotated source: links to Philosopher

Axiom
dbpedia infobox matching weight: 72.73
annotated target: governorGeneral
annotated property: relatedMatch
annotated source: links to Governor

links to Ice Hockey League
comment: Relazione tra Prime Minister e Ice Hockey League @it
type: ObjectProperty
sub property of: organisation
range: ice hockey league
domain: prime minister
comment: Relation between Prime Minister and Ice Hockey League

historic building
label: bâtiment historique @fr
type: Class

baseball player
type: Class
label: joueur de baseball @fr

links to Award
sub property of: award
range: award
type: ObjectProperty
comment: Relazione tra Prime Minister e Award @it
comment: Relation between Prime Minister and Award
domain: prime minister

website
type: ObjectProperty
type: Class
label: site web @fr
label: Ιστότοπος @el

Axiom
dbpedia infobox matching weight: 100.0
annotated property: relatedMatch
annotated source: links to Military Unit
annotated target: unit

Axiom
dbpedia infobox matching weight: 33.33
annotated source: links to Scientist
annotated property: relatedMatch
annotated target: after

Axiom
dbpedia infobox matching weight: 3.92
annotated source: links to Member Of Parliament
annotated property: relatedMatch
annotated target: alongside

basketball player
label: joueur de basketball @fr
type: Class

links to Congressman
domain: prime minister
type: ObjectProperty
sub property of: person
comment: Relation between Prime Minister and Congressman
range: congressman
comment: Relazione tra Prime Minister e Congressman @it

ice hockey player
label: joueur de hockey sur glace @fr
type: Class

links to River
comment: Relazione tra Prime Minister e River @it
sub property of: place
domain: prime minister
comment: Relation between Prime Minister and River
range: river
type: ObjectProperty

links to Basketball Player
type: NamedIndividual
related match: deputy
type: ObjectProperty
comment: Relation between Prime Minister and Basketball Player
sub property of: person
range: basketball player
comment: Relazione tra Prime Minister e Basketball Player @it
domain: prime minister

mountain range
type: Class
label: chaîne de montagne @fr

Christian Bishop
type: Class
label: évêque chrétien @fr

Axiom
dbpedia infobox matching weight: 22.22
annotated property: relatedMatch
annotated target: before
annotated source: links to Military Person

beverage
type: ObjectProperty
type: Class
label: boisson @fr

links to Ship
type: NamedIndividual
related match: commands
domain: prime minister
comment: Relazione tra Prime Minister e Ship @it
sub property of: mean of transportation
range: ship
type: ObjectProperty
comment: Relation between Prime Minister and Ship

links to Beverage
comment: Relazione tra Prime Minister e Beverage @it
comment: Relation between Prime Minister and Beverage
sub property of: beverage
type: ObjectProperty
range: beverage
domain: prime minister

Axiom
dbpedia infobox matching weight: 100.0
annotated property: relatedMatch
annotated target: after
annotated source: links to Criminal

links to Game
domain: prime minister
type: ObjectProperty
sub property of: activity
comment: Relazione tra Prime Minister e Game @it
comment: Relation between Prime Minister and Game
range: game

links to Planet
comment: Relation between Prime Minister and Planet
type: ObjectProperty
sub property of: planet
range: planet
domain: prime minister
comment: Relazione tra Prime Minister e Planet @it

links to Fictional Character
type: ObjectProperty
sub property of: person
comment: Relazione tra Prime Minister e Fictional Character @it
range: fictional character
comment: Relation between Prime Minister and Fictional Character
domain: prime minister

planet
type: Class
label: planète @fr
type: ObjectProperty

links to Christian Bishop
domain: prime minister
type: ObjectProperty
comment: Relation between Prime Minister and Christian Bishop
comment: Relazione tra Prime Minister e Christian Bishop @it
range: Christian Bishop
sub property of: person

links to Soccer League
domain: prime minister
type: ObjectProperty
sub property of: organisation
comment: Relazione tra Prime Minister e Soccer League @it
comment: Relation between Prime Minister and Soccer League
range: soccer league

links to Flowering Plant
type: ObjectProperty
domain: prime minister
range: flowering plant
sub property of: species
comment: Relazione tra Prime Minister e Flowering Plant @it
comment: Relation between Prime Minister and Flowering Plant

scientist
label: scientifique @fr
type: Class
label: Wissenschaftler @de

links to Museum
range: museum
type: ObjectProperty
sub property of: place
domain: prime minister
comment: Relation between Prime Minister and Museum
comment: Relazione tra Prime Minister e Museum @it

links to Station
type: ObjectProperty
domain: prime minister
sub property of: place
comment: Relation between Prime Minister and Station
range: station
comment: Relazione tra Prime Minister e Station @it

Axiom
dbpedia infobox matching weight: 18.18
annotated target: before
annotated source: links to Governor
annotated property: relatedMatch

olympics
label: Jeux Olympiques @fr
type: Class

Axiom
dbpedia infobox matching weight: 25.0
annotated property: relatedMatch
annotated source: links to Town
annotated target: placeOfBirth

organisation
label: Organisation @de
label: organização @pt
type: ObjectProperty

baseball league
label: ligue de baseball @fr
type: Class

links to Monarch
related match: monarch
type: ObjectProperty
domain: prime minister
sub property of: person
related match: before
range: monarch
comment: Relazione tra Prime Minister e Monarch @it
related match: after
type: NamedIndividual
comment: Relation between Prime Minister and Monarch
related match: president

links to Member Of Parliament
related match: post2followed
related match: post4preceded
sub property of: person
related match: before
related match: alongside
type: NamedIndividual
type: ObjectProperty
comment: Relazione tra Prime Minister e Member Of Parliament @it
related match: post1followed
domain: prime minister
related match: children
related match: after
range: member of parliament
comment: Relation between Prime Minister and Member Of Parliament

links to Hotel
domain: prime minister
type: ObjectProperty
comment: Relazione tra Prime Minister e Hotel @it
range: hotel
comment: Relation between Prime Minister and Hotel
sub property of: place

links to Gridiron Football Player
range: gridiron football player
sub property of: person
comment: Relazione tra Prime Minister e Gridiron Football Player @it
comment: Relation between Prime Minister and Gridiron Football Player
type: ObjectProperty
domain: prime minister

bridge
label: pont @fr
type: Class

Axiom
dbpedia infobox matching weight: 100.0
annotated target: languagesspoken
annotated source: links to Language
annotated property: relatedMatch

broadcast
label: Émission de télévision @fr
type: Class

links to Saint
comment: Relazione tra Prime Minister e Saint @it
type: ObjectProperty
range: saint
sub property of: person
comment: Relation between Prime Minister and Saint
domain: prime minister

links to Village
related match: residence
type: NamedIndividual
domain: prime minister
comment: Relation between Prime Minister and Village
comment: Relazione tra Prime Minister e Village @it
range: village
type: ObjectProperty
sub property of: place

links to Soccer Manager
comment: Relation between Prime Minister and Soccer Manager
range: soccer manager
type: ObjectProperty
sub property of: person
comment: Relazione tra Prime Minister e Soccer Manager @it
domain: prime minister

links to Actor
comment: Relazione tra Prime Minister e Actor @it
comment: Relation between Prime Minister and Actor
type: ObjectProperty
domain: prime minister
sub property of: person
range: actor

mammal
type: Class
label: mammifère @fr

links to Lake
comment: Relation between Prime Minister and Lake
sub property of: place
range: lake
type: ObjectProperty
domain: prime minister
comment: Relazione tra Prime Minister e Lake @it

links to Non- Profit Organisation
range: non-profit organisation
sub property of: organisation
comment: Relation between Prime Minister and Non- Profit Organisation
comment: Relazione tra Prime Minister e Non- Profit Organisation @it
domain: prime minister
type: ObjectProperty

links to Single
range: single
sub property of: work
domain: prime minister
type: ObjectProperty
comment: Relazione tra Prime Minister e Single @it
comment: Relation between Prime Minister and Single

island
label: île @fr
label: νησί @el
type: Class

links to Historic Place
sub property of: place
comment: Relation between Prime Minister and Historic Place
comment: Relazione tra Prime Minister e Historic Place @it
range: historic place
type: ObjectProperty
domain: prime minister

event
type: ObjectProperty
label: évènement @fr

skyscraper
label: gratte-ciel @fr
type: Class

radio station
label: station de radio @fr
type: Class

Axiom
dbpedia infobox matching weight: 11.11
annotated property: relatedMatch
annotated target: regent
annotated source: links to Military Person

links to Shopping Mall
comment: Relazione tra Prime Minister e Shopping Mall @it
type: ObjectProperty
comment: Relation between Prime Minister and Shopping Mall
sub property of: place
range: shopping mall
domain: prime minister

bone
label: os @fr
label: Knochen @de
type: Class

member of parliament
type: Class
label: membre du Parlement @fr

Axiom
dbpedia infobox matching weight: 66.67
annotated property: relatedMatch
annotated target: before
annotated source: links to Scientist

conifer
type: Class
label: conifères @fr

airport
label: aéroport @fr
label: Flughafen @de
type: Class

links to Chemical Compound
comment: Relazione tra Prime Minister e Chemical Compound @it
sub property of: chemical compound
comment: Relation between Prime Minister and Chemical Compound
type: ObjectProperty
range: chemical compound
domain: prime minister

links to Cyclist
comment: Relazione tra Prime Minister e Cyclist @it
sub property of: person
type: ObjectProperty
domain: prime minister
range: cyclist
comment: Relation between Prime Minister and Cyclist

links to Broadcast
sub property of: organisation
range: broadcast
domain: prime minister
type: ObjectProperty
comment: Relazione tra Prime Minister e Broadcast @it
comment: Relation between Prime Minister and Broadcast