links to Site Of Special Scientific Interest
comment: Relation between Protected Area and Site Of Special Scientific Interest
domain: protected area
range: Site of Special Scientific Interest
comment: Relazione tra Protected Area e Site Of Special Scientific Interest @it
type: ObjectProperty
sub property of: place

television show
type: Class
label: émission de télévision @fr

disease
type: ObjectProperty
type: Class
label: maladie @fr

colour
type: ObjectProperty
label: χρώμα @el
label: couleur @fr
type: Class

automobile
type: Class

links to Automobile
range: automobile
sub property of: mean of transportation
domain: protected area
comment: Relazione tra Protected Area e Automobile @it
comment: Relation between Protected Area and Automobile
type: ObjectProperty

links to Drug
range: drug
domain: protected area
comment: Relation between Protected Area and Drug
sub property of: drug
comment: Relazione tra Protected Area e Drug @it
type: ObjectProperty

american football player
label: joueur de football américain @fr
type: Class

mean of transportation
label: moyen de transport @fr
type: ObjectProperty

links to Canadian Football Team
range: canadian football team
domain: protected area
type: ObjectProperty
sub property of: organização
comment: Relazione tra Protected Area e Canadian Football Team @it
comment: Relation between Protected Area and Canadian Football Team

Legal Case
label: cas juridique @fr
type: ObjectProperty

links to Airline
domain: protected area
comment: Relation between Protected Area and Airline
sub property of: organização
range: airline
type: ObjectProperty
comment: Relazione tra Protected Area e Airline @it

stadium
label: stade @fr
type: Class

links to Beverage
range: beverage
comment: Relation between Protected Area and Beverage
domain: protected area
comment: Relazione tra Protected Area e Beverage @it
sub property of: beverage
type: ObjectProperty

soccer league
type: Class
label: ligue de football @fr

astronaut
type: Class
label: Astronaut @de
label: astronaute @fr

links to Club Moss
comment: Relazione tra Protected Area e Club Moss @it
range: club moss
sub property of: species
comment: Relation between Protected Area and Club Moss
type: ObjectProperty
domain: protected area

links to Governor
comment: Relation between Protected Area and Governor
comment: Relazione tra Protected Area e Governor @it
sub property of: person
domain: protected area
type: ObjectProperty
range: governor

Site of Special Scientific Interest
type: Class
label: site d'intérêt scientifique particulier @fr

links to Locomotive
comment: Relation between Protected Area and Locomotive
comment: Relazione tra Protected Area e Locomotive @it
sub property of: mean of transportation
type: ObjectProperty
domain: protected area
range: locomotive

mayor
type: Class
label: maire @fr

amphibian
label: amphibien @fr
type: Class

pope
type: Class
label: pape @fr

species
type: ObjectProperty
label: espèce @fr

links to Park
type: NamedIndividual
related match: location
sub property of: place
domain: protected area
comment: Relazione tra Protected Area e Park @it
comment: Relation between Protected Area and Park
range: park
type: ObjectProperty

newspaper
label: journal @fr
type: Class

links to Stadium
comment: Relazione tra Protected Area e Stadium @it
range: stadium
type: ObjectProperty
comment: Relation between Protected Area and Stadium
domain: protected area
sub property of: place

game
label: jeu @fr
type: Class

protected area
type: Class
label: προστατευμένη περιοχή @el
label: aire protégée @fr

links to Weapon
comment: Relazione tra Protected Area e Weapon @it
comment: Relation between Protected Area and Weapon
type: ObjectProperty
domain: protected area
sub property of: device
range: weapon

road
type: Class
label: route @fr

ginkgo
type: Class

boxer
label: boxeur @fr
type: Class

judge
type: Class
label: juge @fr

World Heritage Site
type: Class
label: site du patrimoine mondial @fr

ProtectedArea.owl
imports: cpannotationschema.owl
has author: Andrea Giovanni Nuzzolese
type: Ontology
comment: ProtectedArea Encyclopedic Knowledge Pattern
has author: Valentina Presutti
has author: Aldo Gangemi
extracted from: dbpedia.org
extracted from: en.wikipedia.org
has intent: To represent the encyclopedic knowledge expressed by an object typed as ProtectedArea
imports: dbpediainfoboxmatchingweight.owl

station
type: Class

language
type: Class
label: langage @fr
type: ObjectProperty

links to Wine Region
domain: protected area
sub property of: place
comment: Relation between Protected Area and Wine Region
range: wine region
type: ObjectProperty
comment: Relazione tra Protected Area e Wine Region @it

links to British Royalty
type: ObjectProperty
comment: Relazione tra Protected Area e British Royalty @it
domain: protected area
range: British royalty
comment: Relation between Protected Area and British Royalty
sub property of: person

links to Musical
type: ObjectProperty
sub property of: work
range: musical
comment: Relation between Protected Area and Musical
domain: protected area
comment: Relazione tra Protected Area e Musical @it

links to Lighthouse
range: lighthouse
sub property of: place
domain: protected area
type: ObjectProperty
comment: Relazione tra Protected Area e Lighthouse @it
comment: Relation between Protected Area and Lighthouse

links to Architect
domain: protected area
sub property of: person
type: ObjectProperty
comment: Relazione tra Protected Area e Architect @it
comment: Relation between Protected Area and Architect
range: architect

links to American Football League
domain: protected area
sub property of: organização
type: ObjectProperty
comment: Relation between Protected Area and American Football League
comment: Relazione tra Protected Area e American Football League @it
range: american football league

lake
type: Class
label: lac @fr

links to Canadian Football League
comment: Relazione tra Protected Area e Canadian Football League @it
comment: Relation between Protected Area and Canadian Football League
domain: protected area
sub property of: organização
type: ObjectProperty
range: canadian football league

links to School
domain: protected area
comment: Relation between Protected Area and School
range: school
sub property of: organização
comment: Relazione tra Protected Area e School @it
type: ObjectProperty

arachnid
label: arachnides @fr
type: Class

links to Boxer
comment: Relazione tra Protected Area e Boxer @it
range: boxer
sub property of: person
type: ObjectProperty
domain: protected area
comment: Relation between Protected Area and Boxer

links to Military Person
comment: Relazione tra Protected Area e Military Person @it
comment: Relation between Protected Area and Military Person
sub property of: person
range: military person
domain: protected area
type: ObjectProperty

governor
type: Class
label: gouverneur @fr

links to Village
type: ObjectProperty
range: village
comment: Relazione tra Protected Area e Village @it
sub property of: place
domain: protected area
comment: Relation between Protected Area and Village
type: NamedIndividual
related match: nearestCity

links to Military Conflict
type: ObjectProperty
domain: protected area
sub property of: event
comment: Relazione tra Protected Area e Military Conflict @it
comment: Relation between Protected Area and Military Conflict
range: military conflict

work
label: obra @pt
label: travail @fr
type: ObjectProperty

school
type: Class
label: école @fr

ship
label: navire @fr
type: Class

museum
type: Class
label: musée @fr

fish
label: poisson @fr
type: Class

links to Television Show
type: ObjectProperty
sub property of: work
comment: Relazione tra Protected Area e Television Show @it
range: television show
domain: protected area
comment: Relation between Protected Area and Television Show

links to Mountain
related match: highestLocation
type: NamedIndividual
comment: Relazione tra Protected Area e Mountain @it
comment: Relation between Protected Area and Mountain
sub property of: place
type: ObjectProperty
range: mountain
domain: protected area

video game
type: Class
label: jeux vidéo @fr

links to Power Station
comment: Relazione tra Protected Area e Power Station @it
sub property of: infrastructure
range: power station
comment: Relation between Protected Area and Power Station
domain: protected area
type: ObjectProperty

trade union
label: syndicat professionnel @fr
type: Class

links to Soccer League
sub property of: organização
range: soccer league
comment: Relation between Protected Area and Soccer League
type: ObjectProperty
comment: Relazione tra Protected Area e Soccer League @it
domain: protected area

links to Actor
sub property of: person
comment: Relazione tra Protected Area e Actor @it
type: ObjectProperty
domain: protected area
comment: Relation between Protected Area and Actor
range: actor

currency
label: devise @fr
type: Class
type: ObjectProperty

prime minister
label: premier ministre @fr
type: Class

British royalty
label: royauté Britannique @fr
type: Class

race
label: course @fr
type: Class

historic place
label: site historique @fr
type: Class

hospital
label: hôpital @fr
type: Class

links to Saint
comment: Relazione tra Protected Area e Saint @it
domain: protected area
sub property of: person
type: ObjectProperty
comment: Relation between Protected Area and Saint
range: saint

monument
type: Class

links to Comedian
comment: Relation between Protected Area and Comedian
range: comedian
sub property of: person
type: ObjectProperty
comment: Relazione tra Protected Area e Comedian @it
domain: protected area

links to Station
comment: Relation between Protected Area and Station
domain: protected area
range: station
type: ObjectProperty
comment: Relazione tra Protected Area e Station @it
sub property of: place

links to Band
type: ObjectProperty
comment: Relazione tra Protected Area e Band @it
comment: Relation between Protected Area and Band
domain: protected area
range: Band
sub property of: organização

links to Magazine
domain: protected area
comment: Relazione tra Protected Area e Magazine @it
range: magazine
type: ObjectProperty
comment: Relation between Protected Area and Magazine
sub property of: work

links to Newspaper
comment: Relation between Protected Area and Newspaper
type: ObjectProperty
comment: Relazione tra Protected Area e Newspaper @it
domain: protected area
sub property of: work
range: newspaper

continent
label: ήπειρος @el
type: Class

links to Congressman
sub property of: person
domain: protected area
range: congressman
comment: Relazione tra Protected Area e Congressman @it
type: ObjectProperty
comment: Relation between Protected Area and Congressman

president
label: président @fr
type: Class

album
type: Class
label: Album @de

moss
type: Class
label: mousses @fr

links to Trade Union
sub property of: organização
domain: protected area
comment: Relazione tra Protected Area e Trade Union @it
range: trade union
comment: Relation between Protected Area and Trade Union
type: ObjectProperty

links to Astronaut
type: ObjectProperty
domain: protected area
range: astronaut
comment: Relation between Protected Area and Astronaut
comment: Relazione tra Protected Area e Astronaut @it
sub property of: person

person
label: Person @de
type: ObjectProperty
label: pessoa @pt
label: personne @fr

military unit
type: Class
label: unité militaire @fr

links to Aircraft
comment: Relazione tra Protected Area e Aircraft @it
domain: protected area
range: aircraft
type: ObjectProperty
sub property of: mean of transportation
comment: Relation between Protected Area and Aircraft

canadian football team
type: Class
label: équipe canadienne de football américain @fr

music genre
type: Class
label: género musical @pt
type: ObjectProperty
label: genre musical @fr

cycad
type: Class
label: cycadophytes @fr

writer
type: Class
label: écrivain @fr

links to Insect
type: NamedIndividual
related match: animal
comment: Relation between Protected Area and Insect
type: ObjectProperty
range: insect
domain: protected area
comment: Relazione tra Protected Area e Insect @it
sub property of: species

architect
label: architecte @fr
type: Class

ambassador
type: Class
label: ambassadeur @fr

crustacean
type: Class
label: crustacés @fr

links to Prime Minister
sub property of: person
comment: Relation between Protected Area and Prime Minister
range: prime minister
comment: Relazione tra Protected Area e Prime Minister @it
domain: protected area
type: ObjectProperty

links to American Football Player
comment: Relazione tra Protected Area e American Football Player @it
sub property of: person
type: ObjectProperty
range: american football player
domain: protected area
comment: Relation between Protected Area and American Football Player

links to Continent
comment: Relation between Protected Area and Continent
range: continent
domain: protected area
comment: Relazione tra Protected Area e Continent @it
sub property of: place
type: ObjectProperty

links to Historic Building
comment: Relation between Protected Area and Historic Building
type: ObjectProperty
comment: Relazione tra Protected Area e Historic Building @it
domain: protected area
sub property of: place
range: historic building

links to Bacteria
comment: Relazione tra Protected Area e Bacteria @it
range: bacteria
comment: Relation between Protected Area and Bacteria
sub property of: species
domain: protected area
type: ObjectProperty

links to Non- Profit Organisation
comment: Relazione tra Protected Area e Non- Profit Organisation @it
range: non-profit organisation
comment: Relation between Protected Area and Non- Profit Organisation
domain: protected area
sub property of: organização
type: ObjectProperty

links to Scientist
comment: Relazione tra Protected Area e Scientist @it
range: scientist
domain: protected area
sub property of: person
type: ObjectProperty
comment: Relation between Protected Area and Scientist

lighthouse
label: phare @fr
type: Class

aircraft
label: αεροσκάφος @el
type: Class
label: avion @fr

links to Monument
comment: Relazione tra Protected Area e Monument @it
comment: Relation between Protected Area and Monument
domain: protected area
sub property of: place
type: ObjectProperty
range: monument

links to Arachnid
comment: Relazione tra Protected Area e Arachnid @it
domain: protected area
type: ObjectProperty
sub property of: species
comment: Relation between Protected Area and Arachnid
range: arachnid

links to Bone
range: bone
sub property of: anatomical structure
comment: Relazione tra Protected Area e Bone @it
domain: protected area
type: ObjectProperty
comment: Relation between Protected Area and Bone

club moss
type: Class
label: lycopodiopsida @fr

links to Ginkgo
sub property of: species
comment: Relation between Protected Area and Ginkgo
range: ginkgo
type: ObjectProperty
domain: protected area
comment: Relazione tra Protected Area e Ginkgo @it

reptile
type: Class

legislature
label: pouvoir législatif @fr
type: Class

links to Currency
type: ObjectProperty
domain: protected area
comment: Relation between Protected Area and Currency
comment: Relazione tra Protected Area e Currency @it
sub property of: currency
range: currency

links to World Heritage Site
range: World Heritage Site
type: ObjectProperty
domain: protected area
comment: Relazione tra Protected Area e World Heritage Site @it
sub property of: place
comment: Relation between Protected Area and World Heritage Site

links to Conifer
sub property of: species
comment: Relation between Protected Area and Conifer
type: ObjectProperty
domain: protected area
range: conifer
comment: Relazione tra Protected Area e Conifer @it

cave
label: grotte @fr
type: Class

links to Legislature
sub property of: organização
type: ObjectProperty
comment: Relazione tra Protected Area e Legislature @it
domain: protected area
comment: Relation between Protected Area and Legislature
range: legislature

links to Valley
comment: Relation between Protected Area and Valley
range: valley
comment: Relazione tra Protected Area e Valley @it
type: ObjectProperty
sub property of: place
domain: protected area

airline
label: compagnie aérienne @fr
type: Class

monarch
label: monarque @fr
type: Class

congressman
type: Class
label: membre du Congrès @fr

golf player
label: golfeur @fr
type: Class

Gnetophytes
type: Class
label: gnétophytes @fr

activity
label: activité @fr
label: Aktivität @de
type: ObjectProperty

space mission
label: mission spatiale @fr
label: διαστημική αποστολή @el
type: Class

links to President
comment: Relation between Protected Area and President
sub property of: person
domain: protected area
type: ObjectProperty
comment: Relazione tra Protected Area e President @it
range: president

links to Sport
sub property of: activity
range: sport
comment: Relation between Protected Area and Sport
domain: protected area
comment: Relazione tra Protected Area e Sport @it
type: ObjectProperty

links to Pope
domain: protected area
type: ObjectProperty
sub property of: person
range: pope
comment: Relazione tra Protected Area e Pope @it
comment: Relation between Protected Area and Pope

insect
label: insecte @fr
type: Class

links to Member Of Parliament
sub property of: person
comment: Relation between Protected Area and Member Of Parliament
comment: Relazione tra Protected Area e Member Of Parliament @it
type: ObjectProperty
domain: protected area
range: member of parliament

film
label: ταινία @el
type: Class

american football team
label: équipe américaine de football américain @fr
type: Class

Supreme Court of the United States case
type: Class
label: cas juridique de la Cour suprême des États-Unis @fr

chemical compound
type: Class
type: ObjectProperty
label: produit chimique @fr

power station
type: Class

links to Gnetophytes
comment: Relation between Protected Area and Gnetophytes
type: ObjectProperty
sub property of: species
range: Gnetophytes
domain: protected area
comment: Relazione tra Protected Area e Gnetophytes @it

fern
type: Class
label: fougères @fr

fungus
label: fungi @fr
type: Class

musical artist
label: musicien @fr
type: Class
label: artista musical @pt

links to Music Festival
comment: Relazione tra Protected Area e Music Festival @it
type: ObjectProperty
comment: Relation between Protected Area and Music Festival
domain: protected area
sub property of: event
range: music festival

links to Book
comment: Relazione tra Protected Area e Book @it
type: ObjectProperty
range: book
comment: Relation between Protected Area and Book
sub property of: work
domain: protected area

links to Criminal
sub property of: person
comment: Relazione tra Protected Area e Criminal @it
domain: protected area
range: criminal
comment: Relation between Protected Area and Criminal
type: ObjectProperty

links to Judge
domain: protected area
range: judge
comment: Relation between Protected Area and Judge
type: ObjectProperty
sub property of: person
comment: Relazione tra Protected Area e Judge @it

links to Disease
range: disease
sub property of: disease
comment: Relazione tra Protected Area e Disease @it
comment: Relation between Protected Area and Disease
type: ObjectProperty
domain: protected area

links to Olympics
sub property of: event
range: olympics
comment: Relazione tra Protected Area e Olympics @it
comment: Relation between Protected Area and Olympics
type: ObjectProperty
domain: protected area

links to American Football Team
sub property of: organização
type: ObjectProperty
range: american football team
domain: protected area
comment: Relation between Protected Area and American Football Team
comment: Relazione tra Protected Area e American Football Team @it

park
type: Class
label: parc @fr

american football league
type: Class

links to Fungus
comment: Relation between Protected Area and Fungus
range: fungus
sub property of: species
comment: Relazione tra Protected Area e Fungus @it
type: ObjectProperty
domain: protected area

links to Video Game
comment: Relation between Protected Area and Video Game
type: ObjectProperty
sub property of: work
range: video game
domain: protected area
comment: Relazione tra Protected Area e Video Game @it

musical
label: musique @fr
type: Class

actor
label: acteur @fr
type: Class
label: Schauspieler @de

links to Green Alga
comment: Relation between Protected Area and Green Alga
type: ObjectProperty
sub property of: species
comment: Relazione tra Protected Area e Green Alga @it
domain: protected area
range: green alga

place
type: ObjectProperty
label: περιοχή @el
label: lieu @fr
label: lugar @pt

links to Office Holder
type: ObjectProperty
range: office holder
comment: Relation between Protected Area and Office Holder
domain: protected area
comment: Relazione tra Protected Area e Office Holder @it
sub property of: person

links to Crustacean
sub property of: species
type: ObjectProperty
comment: Relazione tra Protected Area e Crustacean @it
range: crustacean
comment: Relation between Protected Area and Crustacean
domain: protected area

links to Radio Station
comment: Relation between Protected Area and Radio Station
range: radio station
comment: Relazione tra Protected Area e Radio Station @it
domain: protected area
type: ObjectProperty
sub property of: organização

infrastructure
type: ObjectProperty

links to Christian Bishop
domain: protected area
comment: Relation between Protected Area and Christian Bishop
comment: Relazione tra Protected Area e Christian Bishop @it
type: ObjectProperty
range: Christian Bishop
sub property of: person

links to Album
sub property of: work
type: ObjectProperty
range: album
comment: Relation between Protected Area and Album
comment: Relazione tra Protected Area e Album @it
domain: protected area

links to Cave
domain: protected area
type: ObjectProperty
sub property of: place
comment: Relation between Protected Area and Cave
comment: Relazione tra Protected Area e Cave @it
range: cave

mountain
type: Class
label: montagne @fr
label: Βουνό @el

links to Space Mission
comment: Relazione tra Protected Area e Space Mission @it
type: ObjectProperty
domain: protected area
sub property of: event
comment: Relation between Protected Area and Space Mission
range: space mission

criminal
label: criminel @fr
type: Class

links to Protein
comment: Relazione tra Protected Area e Protein @it
range: protein
type: ObjectProperty
sub property of: protein
domain: protected area
comment: Relation between Protected Area and Protein

senator
label: sénateur @fr
type: Class

saint
type: Class

comedian
label: comédien @fr
type: Class

valley
type: Class
label: vallée @fr

links to Chemical Compound
comment: Relazione tra Protected Area e Chemical Compound @it
sub property of: chemical compound
domain: protected area
comment: Relation between Protected Area and Chemical Compound
type: ObjectProperty
range: chemical compound

links to Lake
range: lake
comment: Relazione tra Protected Area e Lake @it
type: ObjectProperty
sub property of: place
domain: protected area
comment: Relation between Protected Area and Lake

green alga
type: Class
label: algue verte @fr

Axiom
dbpedia infobox matching weight: 100.0
annotated target: animal
annotated property: relatedMatch
annotated source: links to Insect

book
label: llibre @ca
label: książka @pl
label: βιβλίο @el
label: livre @fr
type: Class

links to Ship
range: ship
comment: Relation between Protected Area and Ship
domain: protected area
comment: Relazione tra Protected Area e Ship @it
type: ObjectProperty
sub property of: mean of transportation

device
label: appareil @fr
type: ObjectProperty

shopping mall
label: centre commercial @fr
type: Class

links to Fern
type: ObjectProperty
range: fern
comment: Relation between Protected Area and Fern
sub property of: species
domain: protected area
comment: Relazione tra Protected Area e Fern @it

bacteria
label: bactérie @fr
type: Class

ski area
label: domaine skiable @fr
type: Class

non-profit organisation
type: Class
label: organisation à but non lucratif @fr

links to Race
domain: protected area
type: ObjectProperty
comment: Relation between Protected Area and Race
comment: Relazione tra Protected Area e Race @it
sub property of: event
range: race

links to Single
range: single
comment: Relation between Protected Area and Single
sub property of: work
domain: protected area
type: ObjectProperty
comment: Relazione tra Protected Area e Single @it

canadian football league
type: Class

mollusca
label: mollusque @fr
type: Class

links to Philosopher
type: ObjectProperty
comment: Relazione tra Protected Area e Philosopher @it
domain: protected area
range: philosopher
comment: Relation between Protected Area and Philosopher
sub property of: person

wine region
label: région viticole @fr
type: Class

weapon
label: arme @fr
type: Class

Axiom
dbpedia infobox matching weight: 100.0
annotated property: relatedMatch
annotated source: links to Mountain
annotated target: highestLocation

links to Supreme Court Of The United States Case
comment: Relation between Protected Area and Supreme Court Of The United States Case
type: ObjectProperty
domain: protected area
comment: Relazione tra Protected Area e Supreme Court Of The United States Case @it
sub property of: Legal Case
range: Supreme Court of the United States case

drug
type: Class
label: médicament @fr
type: ObjectProperty

magazine
type: Class
label: περιοδικό @el

links to Musical Artist
comment: Relazione tra Protected Area e Musical Artist @it
domain: protected area
sub property of: person
type: ObjectProperty
comment: Relation between Protected Area and Musical Artist
range: musical artist

canal
type: Class

military person
type: Class
label: militaire @fr

philosopher
label: philosophe @fr
type: Class

award
type: ObjectProperty
label: récompense @fr
type: Class

locomotive
type: Class

links to Senator
domain: protected area
type: ObjectProperty
comment: Relazione tra Protected Area e Senator @it
range: senator
sub property of: person
comment: Relation between Protected Area and Senator

anatomical structure
type: ObjectProperty
label: structure anatomique @fr

sport
type: Class

cricketer
label: joueur de cricket @fr
type: Class

single
type: Class

links to Television Episode
sub property of: work
domain: protected area
range: television episode
type: ObjectProperty
comment: Relation between Protected Area and Television Episode
comment: Relazione tra Protected Area e Television Episode @it

Band
label: banda @pt
label: Musikgruppe @de
type: Class
label: groupe de musique @fr

links to Writer
type: ObjectProperty
sub property of: person
domain: protected area
comment: Relazione tra Protected Area e Writer @it
range: writer
comment: Relation between Protected Area and Writer

university
type: Class
label: université @fr
label: πανεπιστήμιο @el

links to Cricketer
range: cricketer
sub property of: person
comment: Relazione tra Protected Area e Cricketer @it
domain: protected area
comment: Relation between Protected Area and Cricketer
type: ObjectProperty

Axiom
dbpedia infobox matching weight: 100.0
annotated source: links to Military Unit
annotated property: relatedMatch
annotated target: governingBody

protein
label: protéine @fr
type: Class
type: ObjectProperty

ethnic group
type: Class
type: ObjectProperty
label: groupe ethnique @fr

links to Grape
sub property of: species
type: ObjectProperty
comment: Relation between Protected Area and Grape
domain: protected area
comment: Relazione tra Protected Area e Grape @it
range: grape

links to Mayor
domain: protected area
range: mayor
type: ObjectProperty
comment: Relation between Protected Area and Mayor
comment: Relazione tra Protected Area e Mayor @it
sub property of: person

hotel
type: Class
label: hôtel @fr

music festival
type: Class
label: festival de musique @fr

links to Airport
comment: Relazione tra Protected Area e Airport @it
domain: protected area
type: ObjectProperty
sub property of: place
comment: Relation between Protected Area and Airport
range: airport

Axiom
dbpedia infobox matching weight: 100.0
annotated property: relatedMatch
annotated source: links to Park
annotated target: location

television episode
type: Class
label: épisode télévisé @fr

links to Amphibian
domain: protected area
comment: Relazione tra Protected Area e Amphibian @it
type: ObjectProperty
sub property of: species
range: amphibian
comment: Relation between Protected Area and Amphibian

links to Ice Hockey League
domain: protected area
sub property of: organização
range: ice hockey league
type: ObjectProperty
comment: Relazione tra Protected Area e Ice Hockey League @it
comment: Relation between Protected Area and Ice Hockey League

links to Monarch
type: ObjectProperty
sub property of: person
range: monarch
comment: Relazione tra Protected Area e Monarch @it
comment: Relation between Protected Area and Monarch
domain: protected area

village
label: χωριό @el
type: Class

ice hockey league
type: Class
label: ligue d'hockey sur glace @fr

links to Military Unit
sub property of: organização
type: ObjectProperty
comment: Relation between Protected Area and Military Unit
domain: protected area
comment: Relazione tra Protected Area e Military Unit @it
range: military unit
type: NamedIndividual
related match: governingBody

links to Hotel
comment: Relation between Protected Area and Hotel
type: ObjectProperty
sub property of: place
range: hotel
domain: protected area
comment: Relazione tra Protected Area e Hotel @it

historic building
label: bâtiment historique @fr
type: Class

links to Mollusca
comment: Relation between Protected Area and Mollusca
domain: protected area
comment: Relazione tra Protected Area e Mollusca @it
sub property of: species
type: ObjectProperty
range: mollusca

office holder
label: titulaire @fr
label: Amtsinhaber @de
type: Class

links to Language
sub property of: language
range: language
comment: Relation between Protected Area and Language
comment: Relazione tra Protected Area e Language @it
domain: protected area
type: ObjectProperty

military conflict
type: Class
label: conflit militaire @fr

website
type: ObjectProperty
type: Class
label: site web @fr
label: Ιστότοπος @el

grape
label: raisin @fr
type: Class

links to Cycad
type: ObjectProperty
sub property of: species
range: cycad
domain: protected area
comment: Relazione tra Protected Area e Cycad @it
comment: Relation between Protected Area and Cycad

links to Broadcast
range: broadcast
comment: Relazione tra Protected Area e Broadcast @it
sub property of: organização
comment: Relation between Protected Area and Broadcast
type: ObjectProperty
domain: protected area

links to Historic Place
comment: Relazione tra Protected Area e Historic Place @it
range: historic place
type: ObjectProperty
sub property of: place
comment: Relation between Protected Area and Historic Place
domain: protected area

Axiom
dbpedia infobox matching weight: 100.0
annotated property: relatedMatch
annotated target: nearestCity
annotated source: links to Village

links to Planet
domain: protected area
type: ObjectProperty
comment: Relazione tra Protected Area e Planet @it
sub property of: planet
range: planet
comment: Relation between Protected Area and Planet

links to Shopping Mall
sub property of: place
comment: Relation between Protected Area and Shopping Mall
comment: Relazione tra Protected Area e Shopping Mall @it
domain: protected area
type: ObjectProperty
range: shopping mall

links to Moss
comment: Relazione tra Protected Area e Moss @it
range: moss
type: ObjectProperty
domain: protected area
sub property of: species
comment: Relation between Protected Area and Moss

Christian Bishop
label: évêque chrétien @fr
type: Class

beverage
label: boisson @fr
type: Class
type: ObjectProperty

links to Colour
domain: protected area
type: ObjectProperty
comment: Relazione tra Protected Area e Colour @it
sub property of: colour
range: colour
comment: Relation between Protected Area and Colour

links to Fish
comment: Relazione tra Protected Area e Fish @it
comment: Relation between Protected Area and Fish
type: ObjectProperty
domain: protected area
sub property of: species
range: fish

planet
type: Class
label: planète @fr
type: ObjectProperty

links to Ski Area
range: ski area
domain: protected area
sub property of: place
comment: Relation between Protected Area and Ski Area
type: ObjectProperty
comment: Relazione tra Protected Area e Ski Area @it

scientist
label: scientifique @fr
label: Wissenschaftler @de
type: Class

links to Bridge
range: bridge
comment: Relazione tra Protected Area e Bridge @it
type: ObjectProperty
comment: Relation between Protected Area and Bridge
domain: protected area
sub property of: place

links to Reptile
domain: protected area
comment: Relation between Protected Area and Reptile
comment: Relazione tra Protected Area e Reptile @it
range: reptile
sub property of: species
type: ObjectProperty

links to Road
range: road
sub property of: infrastructure
comment: Relation between Protected Area and Road
comment: Relazione tra Protected Area e Road @it
domain: protected area
type: ObjectProperty

links to Museum
sub property of: place
comment: Relazione tra Protected Area e Museum @it
range: museum
type: ObjectProperty
domain: protected area
comment: Relation between Protected Area and Museum

olympics
type: Class
label: Jeux Olympiques @fr

organização
type: ObjectProperty
label: organisation
label: Organisation @de

bridge
type: Class
label: pont @fr

links to Canal
comment: Relazione tra Protected Area e Canal @it
domain: protected area
range: canal
comment: Relation between Protected Area and Canal
type: ObjectProperty
sub property of: place

links to Music Genre
range: music genre
comment: Relation between Protected Area and Music Genre
domain: protected area
comment: Relazione tra Protected Area e Music Genre @it
sub property of: music genre
type: ObjectProperty

links to Island
range: island
sub property of: place
type: ObjectProperty
comment: Relazione tra Protected Area e Island @it
domain: protected area
comment: Relation between Protected Area and Island

broadcast
label: Émission de télévision @fr
type: Class

links to Hospital
range: hospital
sub property of: place
domain: protected area
comment: Relazione tra Protected Area e Hospital @it
comment: Relation between Protected Area and Hospital
type: ObjectProperty

island
label: île @fr
label: νησί @el
type: Class

comics character
type: Class
label: personnage de bandes dessinées @fr

links to Game
comment: Relazione tra Protected Area e Game @it
comment: Relation between Protected Area and Game
range: game
sub property of: activity
domain: protected area
type: ObjectProperty

event
label: évènement @fr
type: ObjectProperty

skyscraper
type: Class
label: gratte-ciel @fr

radio station
type: Class
label: station de radio @fr

links to Award
range: award
type: ObjectProperty
comment: Relation between Protected Area and Award
domain: protected area
sub property of: award
comment: Relazione tra Protected Area e Award @it

links to Ambassador
sub property of: person
type: ObjectProperty
comment: Relation between Protected Area and Ambassador
domain: protected area
range: ambassador
comment: Relazione tra Protected Area e Ambassador @it

links to Ethnic Group
domain: protected area
comment: Relazione tra Protected Area e Ethnic Group @it
type: ObjectProperty
range: ethnic group
comment: Relation between Protected Area and Ethnic Group
sub property of: ethnic group

bone
label: os @fr
label: Knochen @de
type: Class

member of parliament
type: Class
label: membre du Parlement @fr

links to University
domain: protected area
range: university
comment: Relazione tra Protected Area e University @it
type: ObjectProperty
sub property of: organização
comment: Relation between Protected Area and University

links to Comics Character
range: comics character
domain: protected area
comment: Relation between Protected Area and Comics Character
comment: Relazione tra Protected Area e Comics Character @it
sub property of: person
type: ObjectProperty

links to Skyscraper
type: ObjectProperty
comment: Relation between Protected Area and Skyscraper
sub property of: place
range: skyscraper
domain: protected area
comment: Relazione tra Protected Area e Skyscraper @it

links to Website
range: website
sub property of: website
domain: protected area
comment: Relazione tra Protected Area e Website @it
comment: Relation between Protected Area and Website
type: ObjectProperty

links to Film
range: film
type: ObjectProperty
comment: Relazione tra Protected Area e Film @it
comment: Relation between Protected Area and Film
sub property of: work
domain: protected area

conifer
type: Class
label: conifères @fr

airport
label: aéroport @fr
label: Flughafen @de
type: Class

links to Golf Player
sub property of: person
range: golf player
type: ObjectProperty
domain: protected area
comment: Relation between Protected Area and Golf Player
comment: Relazione tra Protected Area e Golf Player @it