links to Boxer
range: boxer
sub property of: person
comment: Relation between Radio Station and Boxer
comment: Relazione tra Radio Station e Boxer @it
domain: radio station
type: ObjectProperty

links to Election
comment: Relazione tra Radio Station e Election @it
range: Election
domain: radio station
sub property of: event
comment: Relation between Radio Station and Election
type: ObjectProperty

television show
type: Class
label: émission de télévision @fr

disease
type: ObjectProperty
type: Class
label: maladie @fr

Axiom
dbpedia infobox matching weight: 1.25
annotated property: relatedMatch
annotated target: city
annotated source: links to University

links to Locomotive
domain: radio station
comment: Relation between Radio Station and Locomotive
sub property of: mean of transportation
type: ObjectProperty
range: locomotive
comment: Relazione tra Radio Station e Locomotive @it

automobile
type: Class

colour
type: Class
label: couleur @fr
label: χρώμα @el
type: ObjectProperty

links to Canal
comment: Relazione tra Radio Station e Canal @it
range: canal
type: ObjectProperty
comment: Relation between Radio Station and Canal
domain: radio station
sub property of: place

Election
type: Class
label: élection @fr

links to Mountain
range: mountain
domain: radio station
comment: Relation between Radio Station and Mountain
type: ObjectProperty
sub property of: place
comment: Relazione tra Radio Station e Mountain @it

links to Trade Union
comment: Relation between Radio Station and Trade Union
domain: radio station
comment: Relazione tra Radio Station e Trade Union @it
sub property of: organisation
type: ObjectProperty
range: trade union

links to Cyclist
range: cyclist
comment: Relazione tra Radio Station e Cyclist @it
comment: Relation between Radio Station and Cyclist
type: ObjectProperty
sub property of: person
domain: radio station

mean of transportation
label: moyen de transport @fr
type: ObjectProperty

american football player
label: joueur de football américain @fr
type: Class

links to Race
type: ObjectProperty
comment: Relation between Radio Station and Race
sub property of: event
comment: Relazione tra Radio Station e Race @it
range: race
domain: radio station

Legal Case
type: ObjectProperty
label: cas juridique @fr

Axiom
dbpedia infobox matching weight: 54.29
annotated target: language
annotated property: relatedMatch
annotated source: links to Language

stadium
type: Class
label: stade @fr

soccer league
type: Class
label: ligue de football @fr

astronaut
label: astronaute @fr
label: Astronaut @de
type: Class

links to President
sub property of: person
domain: radio station
range: president
type: ObjectProperty
comment: Relazione tra Radio Station e President @it
comment: Relation between Radio Station and President

links to Flowering Plant
domain: radio station
comment: Relation between Radio Station and Flowering Plant
type: ObjectProperty
comment: Relazione tra Radio Station e Flowering Plant @it
range: flowering plant
sub property of: species

links to Canadian Football League
comment: Relazione tra Radio Station e Canadian Football League @it
type: ObjectProperty
domain: radio station
range: canadian football league
sub property of: organisation
comment: Relation between Radio Station and Canadian Football League

links to Language
range: language
sub property of: language
related match: callsignMeaning
type: NamedIndividual
related match: format
comment: Relazione tra Radio Station e Language @it
type: ObjectProperty
related match: language
domain: radio station
comment: Relation between Radio Station and Language

links to Formula One Racer
range: Formula One racer
comment: Relation between Radio Station and Formula One Racer
domain: radio station
type: ObjectProperty
comment: Relazione tra Radio Station e Formula One Racer @it
sub property of: person

wrestler
type: Class
label: lutteur @fr

mayor
label: maire @fr
type: Class

pope
label: pape @fr
type: Class

species
type: ObjectProperty
label: espèce @fr

links to Newspaper
comment: Relation between Radio Station and Newspaper
domain: radio station
comment: Relazione tra Radio Station e Newspaper @it
range: newspaper
sub property of: work
type: ObjectProperty
related match: owner
type: NamedIndividual

links to Christian Bishop
comment: Relazione tra Radio Station e Christian Bishop @it
domain: radio station
comment: Relation between Radio Station and Christian Bishop
type: ObjectProperty
sub property of: person
range: Christian Bishop

Axiom
dbpedia infobox matching weight: 82.5
annotated property: relatedMatch
annotated target: owner
annotated source: links to University

newspaper
type: Class
label: journal @fr

Axiom
dbpedia infobox matching weight: 100.0
annotated source: links to Comedian
annotated property: relatedMatch
annotated target: format

protected area
label: aire protégée @fr
label: προστατευμένη περιοχή @el
type: Class

game
label: jeu @fr
type: Class

road
type: Class
label: route @fr

links to Space Mission
sub property of: event
comment: Relazione tra Radio Station e Space Mission @it
range: space mission
type: ObjectProperty
comment: Relation between Radio Station and Space Mission
domain: radio station

boxer
label: boxeur @fr
type: Class

judge
type: Class
label: juge @fr

links to British Royalty
sub property of: person
range: British royalty
comment: Relazione tra Radio Station e British Royalty @it
domain: radio station
type: ObjectProperty
comment: Relation between Radio Station and British Royalty

World Heritage Site
type: Class
label: site du patrimoine mondial @fr

links to Television Episode
range: television episode
comment: Relazione tra Radio Station e Television Episode @it
sub property of: work
comment: Relation between Radio Station and Television Episode
domain: radio station
type: ObjectProperty

Axiom
dbpedia infobox matching weight: 50.0
annotated target: owner
annotated property: relatedMatch
annotated source: links to Musical Artist

links to Sport
type: ObjectProperty
comment: Relazione tra Radio Station e Sport @it
domain: radio station
comment: Relation between Radio Station and Sport
range: sport
sub property of: activity

language
type: ObjectProperty
label: langage @fr
type: Class

station
type: Class

tennis league
type: Class
label: ligue de tennis @fr

links to Mollusca
range: mollusca
comment: Relation between Radio Station and Mollusca
domain: radio station
sub property of: species
comment: Relazione tra Radio Station e Mollusca @it
type: ObjectProperty

lake
label: lac @fr
type: Class

links to Continent
type: NamedIndividual
related match: area
sub property of: place
domain: radio station
comment: Relation between Radio Station and Continent
comment: Relazione tra Radio Station e Continent @it
type: ObjectProperty
range: continent

Axiom
dbpedia infobox matching weight: 2.86
annotated source: links to Language
annotated target: callsignMeaning
annotated property: relatedMatch

links to Power Station
range: power station
sub property of: infrastructure
type: ObjectProperty
domain: radio station
comment: Relazione tra Radio Station e Power Station @it
comment: Relation between Radio Station and Power Station

links to American Football League
type: ObjectProperty
range: american football league
domain: radio station
comment: Relazione tra Radio Station e American Football League @it
sub property of: organisation
comment: Relation between Radio Station and American Football League

links to Game
comment: Relation between Radio Station and Game
range: game
sub property of: activity
type: ObjectProperty
comment: Relazione tra Radio Station e Game @it
domain: radio station

links to Tennis League
comment: Relation between Radio Station and Tennis League
range: tennis league
domain: radio station
sub property of: organisation
type: ObjectProperty
comment: Relazione tra Radio Station e Tennis League @it

governor
type: Class
label: gouverneur @fr

links to Space Shuttle
sub property of: mean of transportation
range: space shuttle
comment: Relation between Radio Station and Space Shuttle
domain: radio station
comment: Relazione tra Radio Station e Space Shuttle @it
type: ObjectProperty

work
type: ObjectProperty
label: travail @fr
label: obra @pt

poker player
type: Class
label: joueur de poker @fr

river
label: rivière @fr
type: Class

Axiom
dbpedia infobox matching weight: 90.0
annotated property: relatedMatch
annotated target: area
annotated source: links to Island

lacrosse league
label: ligue de crosse @fr
type: Class

links to Military Conflict
range: military conflict
comment: Relazione tra Radio Station e Military Conflict @it
type: ObjectProperty
sub property of: event
comment: Relation between Radio Station and Military Conflict
domain: radio station

school
type: Class
label: école @fr

museum
type: Class
label: musée @fr

ship
label: navire @fr
type: Class

tennis player
type: Class
label: joueur de tennis @fr

video game
label: jeux vidéo @fr
type: Class

trade union
label: syndicat professionnel @fr
type: Class

currency
type: ObjectProperty
type: Class
label: devise @fr

British royalty
type: Class
label: royauté Britannique @fr

prime minister
label: premier ministre @fr
type: Class

links to Comics Character
type: ObjectProperty
domain: radio station
range: comics character
sub property of: person
comment: Relation between Radio Station and Comics Character
comment: Relazione tra Radio Station e Comics Character @it

links to Automobile
sub property of: mean of transportation
range: automobile
domain: radio station
type: ObjectProperty
comment: Relazione tra Radio Station e Automobile @it
comment: Relation between Radio Station and Automobile

historic place
label: site historique @fr
type: Class

race
label: course @fr
type: Class

links to Museum
comment: Relation between Radio Station and Museum
type: ObjectProperty
comment: Relazione tra Radio Station e Museum @it
domain: radio station
sub property of: place
range: museum

Axiom
dbpedia infobox matching weight: 100.0
annotated source: links to Mammal
annotated target: callsignMeaning
annotated property: relatedMatch

hospital
label: hôpital @fr
type: Class

links to Reptile
domain: radio station
type: ObjectProperty
sub property of: species
comment: Relazione tra Radio Station e Reptile @it
range: reptile
comment: Relation between Radio Station and Reptile

links to Video Game
type: ObjectProperty
range: video game
domain: radio station
comment: Relazione tra Radio Station e Video Game @it
comment: Relation between Radio Station and Video Game
sub property of: work

links to Bridge
range: bridge
domain: radio station
sub property of: place
comment: Relazione tra Radio Station e Bridge @it
type: ObjectProperty
comment: Relation between Radio Station and Bridge

links to Magazine
comment: Relation between Radio Station and Magazine
comment: Relazione tra Radio Station e Magazine @it
domain: radio station
sub property of: work
range: magazine
type: ObjectProperty

links to Film Festival
range: film festival
domain: radio station
type: ObjectProperty
sub property of: event
comment: Relazione tra Radio Station e Film Festival @it
comment: Relation between Radio Station and Film Festival

links to Rugby Player
type: ObjectProperty
range: rugby player
comment: Relazione tra Radio Station e Rugby Player @it
domain: radio station
sub property of: person
comment: Relation between Radio Station and Rugby Player

links to Judge
domain: radio station
range: judge
sub property of: person
comment: Relazione tra Radio Station e Judge @it
type: ObjectProperty
comment: Relation between Radio Station and Judge

continent
type: Class
label: ήπειρος @el

links to Hockey Team
related match: affiliations
type: NamedIndividual
range: hockey team
domain: radio station
sub property of: organisation
comment: Relation between Radio Station and Hockey Team
comment: Relazione tra Radio Station e Hockey Team @it
type: ObjectProperty

album
type: Class
label: Album @de

president
label: président @fr
type: Class

links to Band
sub property of: organisation
comment: Relazione tra Radio Station e Band @it
range: Band
type: ObjectProperty
domain: radio station
comment: Relation between Radio Station and Band

links to Mountain Range
comment: Relazione tra Radio Station e Mountain Range @it
range: mountain range
sub property of: place
comment: Relation between Radio Station and Mountain Range
type: ObjectProperty
domain: radio station

links to Drug
type: ObjectProperty
range: drug
domain: radio station
comment: Relazione tra Radio Station e Drug @it
sub property of: drug
comment: Relation between Radio Station and Drug

links to Ethnic Group
related match: format
type: NamedIndividual
comment: Relazione tra Radio Station e Ethnic Group @it
range: ethnic group
sub property of: ethnic group
domain: radio station
comment: Relation between Radio Station and Ethnic Group
type: ObjectProperty

person
label: personne @fr
type: ObjectProperty
label: pessoa @pt
label: Person @de

military unit
type: Class
label: unité militaire @fr

links to Road
comment: Relazione tra Radio Station e Road @it
type: ObjectProperty
sub property of: infrastructure
domain: radio station
range: road
comment: Relation between Radio Station and Road

soccer manager
type: Class
label: entraîneur de football @fr

basketball team
type: Class

links to Comics Creator
type: ObjectProperty
comment: Relazione tra Radio Station e Comics Creator @it
sub property of: person
domain: radio station
range: comics creator
comment: Relation between Radio Station and Comics Creator

canadian football team
label: équipe canadienne de football américain @fr
type: Class

links to Cricketer
range: cricketer
comment: Relation between Radio Station and Cricketer
sub property of: person
type: ObjectProperty
domain: radio station
comment: Relazione tra Radio Station e Cricketer @it

links to Basketball Team
range: basketball team
comment: Relation between Radio Station and Basketball Team
sub property of: organisation
type: ObjectProperty
comment: Relazione tra Radio Station e Basketball Team @it
domain: radio station
type: NamedIndividual
related match: affiliations

writer
type: Class
label: écrivain @fr

record label
type: Class
label: label discographique @fr

architect
type: Class
label: architecte @fr

model
type: Class
label: mannequin @fr

links to Architect
type: ObjectProperty
comment: Relazione tra Radio Station e Architect @it
domain: radio station
range: architect
comment: Relation between Radio Station and Architect
sub property of: person

links to Senator
sub property of: person
domain: radio station
range: senator
comment: Relazione tra Radio Station e Senator @it
comment: Relation between Radio Station and Senator
type: ObjectProperty

links to Mayor
comment: Relation between Radio Station and Mayor
type: ObjectProperty
sub property of: person
comment: Relazione tra Radio Station e Mayor @it
range: mayor
domain: radio station

links to Hospital
type: ObjectProperty
domain: radio station
range: hospital
comment: Relazione tra Radio Station e Hospital @it
sub property of: place
comment: Relation between Radio Station and Hospital

film festival
label: festival du film @fr
type: Class

links to Hotel
range: hotel
domain: radio station
sub property of: place
type: ObjectProperty
comment: Relation between Radio Station and Hotel
comment: Relazione tra Radio Station e Hotel @it

links to Beverage
domain: radio station
sub property of: beverage
comment: Relation between Radio Station and Beverage
range: beverage
type: ObjectProperty
comment: Relazione tra Radio Station e Beverage @it

links to College
type: ObjectProperty
comment: Relazione tra Radio Station e College @it
comment: Relation between Radio Station and College
range: college
sub property of: organisation
domain: radio station

comics creator
label: créateur de bandes dessinées @fr
type: Class

aircraft
label: αεροσκάφος @el
type: Class
label: avion @fr

Axiom
dbpedia infobox matching weight: 100.0
annotated target: affiliations
annotated property: relatedMatch
annotated source: links to Music Festival

hockey team
type: Class
label: équipe de hockey @fr

links to Rugby League
range: rugby league
comment: Relation between Radio Station and Rugby League
domain: radio station
comment: Relazione tra Radio Station e Rugby League @it
sub property of: organisation
type: ObjectProperty

soccer player
label: joueur de football @fr
type: Class

links to Island
comment: Relazione tra Radio Station e Island @it
type: ObjectProperty
related match: area
sub property of: place
domain: radio station
range: island
type: NamedIndividual
related match: city
comment: Relation between Radio Station and Island

links to Convention
range: convention
sub property of: event
comment: Relazione tra Radio Station e Convention @it
domain: radio station
type: ObjectProperty
comment: Relation between Radio Station and Convention

links to Supreme Court Of The United States Case
type: ObjectProperty
comment: Relation between Radio Station and Supreme Court Of The United States Case
comment: Relazione tra Radio Station e Supreme Court Of The United States Case @it
range: Supreme Court of the United States case
domain: radio station
sub property of: Legal Case

reptile
type: Class

legislature
type: Class
label: pouvoir législatif @fr

links to Mammal
type: NamedIndividual
related match: callsignMeaning
type: ObjectProperty
range: mammal
sub property of: species
comment: Relation between Radio Station and Mammal
domain: radio station
comment: Relazione tra Radio Station e Mammal @it

links to Nascar Driver
sub property of: person
comment: Relation between Radio Station and Nascar Driver
range: nascar driver
domain: radio station
type: ObjectProperty
comment: Relazione tra Radio Station e Nascar Driver @it

Axiom
dbpedia infobox matching weight: 100.0
annotated property: relatedMatch
annotated target: callsignMeaning
annotated source: links to Governor

airline
label: compagnie aérienne @fr
type: Class

congressman
type: Class
label: membre du Congrès @fr

links to Prime Minister
type: ObjectProperty
comment: Relation between Radio Station and Prime Minister
sub property of: person
range: prime minister
comment: Relazione tra Radio Station e Prime Minister @it
domain: radio station

golf player
label: golfeur @fr
type: Class

activity
label: activité @fr
label: Aktivität @de
type: ObjectProperty

nascar driver
type: Class
label: pilote de la nascar @fr

links to Anatomical Structure
sub property of: anatomical structure
type: ObjectProperty
range: anatomical structure
comment: Relation between Radio Station and Anatomical Structure
domain: radio station
comment: Relazione tra Radio Station e Anatomical Structure @it

journalist
type: Class
label: journaliste @fr

space mission
label: mission spatiale @fr
label: διαστημική αποστολή @el
type: Class

links to Planet
comment: Relazione tra Radio Station e Planet @it
range: planet
sub property of: planet
comment: Relation between Radio Station and Planet
type: ObjectProperty
domain: radio station

insect
label: insecte @fr
type: Class

film
label: ταινία @el
type: Class

Axiom
dbpedia infobox matching weight: 100.0
annotated source: links to Chemical Compound
annotated target: callsignMeaning
annotated property: relatedMatch

links to Musical
comment: Relazione tra Radio Station e Musical @it
type: ObjectProperty
comment: Relation between Radio Station and Musical
domain: radio station
range: musical
sub property of: work

american football team
label: équipe américaine de football américain @fr
type: Class

links to Historic Building
domain: radio station
comment: Relazione tra Radio Station e Historic Building @it
type: ObjectProperty
range: historic building
comment: Relation between Radio Station and Historic Building
sub property of: place

links to Bird
type: ObjectProperty
range: bird
sub property of: species
comment: Relation between Radio Station and Bird
domain: radio station
comment: Relazione tra Radio Station e Bird @it

Supreme Court of the United States case
label: cas juridique de la Cour suprême des États-Unis @fr
type: Class

chemical compound
type: Class
type: ObjectProperty
label: produit chimique @fr

bird
type: Class
label: oiseau @fr

power station
type: Class

Gaelic games player
type: Class
label: joueur de sports gaéliques @fr

links to Film
type: ObjectProperty
range: film
comment: Relazione tra Radio Station e Film @it
comment: Relation between Radio Station and Film
sub property of: work
domain: radio station

links to Village
range: village
type: NamedIndividual
comment: Relazione tra Radio Station e Village @it
sub property of: place
type: ObjectProperty
domain: radio station
related match: city
related match: area
comment: Relation between Radio Station and Village

Axiom
dbpedia infobox matching weight: 100.0
annotated property: relatedMatch
annotated source: links to Protected Area
annotated target: area

musical artist
label: musicien @fr
type: Class
label: artista musical @pt

links to American Football Player
type: ObjectProperty
comment: Relation between Radio Station and American Football Player
domain: radio station
sub property of: person
range: american football player
comment: Relazione tra Radio Station e American Football Player @it

links to Airline
comment: Relation between Radio Station and Airline
comment: Relazione tra Radio Station e Airline @it
domain: radio station
sub property of: organisation
range: airline
type: ObjectProperty

links to Golf Player
comment: Relazione tra Radio Station e Golf Player @it
domain: radio station
comment: Relation between Radio Station and Golf Player
sub property of: person
type: ObjectProperty
range: golf player

Axiom
dbpedia infobox matching weight: 11.25
annotated property: relatedMatch
annotated target: affiliations
annotated source: links to University

links to University
related match: city
related match: area
type: ObjectProperty
comment: Relation between Radio Station and University
sub property of: organisation
range: university
related match: owner
type: NamedIndividual
related match: affiliations
comment: Relazione tra Radio Station e University @it
domain: radio station

park
label: parc @fr
type: Class

links to Website
sub property of: website
type: ObjectProperty
comment: Relazione tra Radio Station e Website @it
range: website
domain: radio station
comment: Relation between Radio Station and Website

links to Basketball Player
range: basketball player
comment: Relation between Radio Station and Basketball Player
domain: radio station
comment: Relazione tra Radio Station e Basketball Player @it
type: ObjectProperty
sub property of: person

cardinal
type: Class

Axiom
dbpedia infobox matching weight: 100.0
annotated property: relatedMatch
annotated target: affiliations
annotated source: links to Basketball Team

rugby player
label: joueur de rugby @fr
type: Class

links to Music Festival
related match: affiliations
type: NamedIndividual
domain: radio station
comment: Relazione tra Radio Station e Music Festival @it
type: ObjectProperty
comment: Relation between Radio Station and Music Festival
sub property of: event
range: music festival

american football league
type: Class

links to Ice Hockey League
type: NamedIndividual
related match: affiliations
comment: Relation between Radio Station and Ice Hockey League
type: ObjectProperty
comment: Relazione tra Radio Station e Ice Hockey League @it
range: ice hockey league
sub property of: organisation
domain: radio station

musical
type: Class
label: musique @fr

links to Journalist
comment: Relazione tra Radio Station e Journalist @it
sub property of: person
comment: Relation between Radio Station and Journalist
type: ObjectProperty
domain: radio station
range: journalist

cyclist
type: Class
label: cycliste @fr

place
type: ObjectProperty
label: περιοχή @el
label: lieu @fr
label: lugar @pt

infrastructure
type: ObjectProperty

Axiom
dbpedia infobox matching weight: 100.0
annotated source: links to Book
annotated property: relatedMatch
annotated target: callsignMeaning

links to College Coach
domain: radio station
range: college coach
comment: Relation between Radio Station and College Coach
sub property of: person
comment: Relazione tra Radio Station e College Coach @it
type: ObjectProperty

links to Military Unit
type: ObjectProperty
domain: radio station
comment: Relazione tra Radio Station e Military Unit @it
comment: Relation between Radio Station and Military Unit
range: military unit
sub property of: organisation

links to Stadium
type: ObjectProperty
comment: Relazione tra Radio Station e Stadium @it
sub property of: place
comment: Relation between Radio Station and Stadium
domain: radio station
range: stadium

links to Protein
domain: radio station
range: protein
comment: Relazione tra Radio Station e Protein @it
sub property of: protein
comment: Relation between Radio Station and Protein
type: ObjectProperty

basketball league
type: Class
label: ligue de basketball @fr

Axiom
dbpedia infobox matching weight: 10.0
annotated target: city
annotated property: relatedMatch
annotated source: links to Island

mountain
type: Class
label: montagne @fr
label: Βουνό @el

criminal
label: criminel @fr
type: Class

links to Airport
comment: Relazione tra Radio Station e Airport @it
domain: radio station
range: airport
type: ObjectProperty
sub property of: place
comment: Relation between Radio Station and Airport

links to Soccer Club
range: soccer club
type: ObjectProperty
sub property of: organisation
comment: Relazione tra Radio Station e Soccer Club @it
comment: Relation between Radio Station and Soccer Club
domain: radio station
type: NamedIndividual
related match: owner

space shuttle
label: navette spatiale @fr
type: Class

links to Pope
domain: radio station
comment: Relazione tra Radio Station e Pope @it
range: pope
sub property of: person
comment: Relation between Radio Station and Pope
type: ObjectProperty

flowering plant
label: angiospermes @fr
type: Class

senator
label: sénateur @fr
type: Class

saint
type: Class

valley
label: vallée @fr
type: Class

comedian
label: comédien @fr
type: Class

links to Lacrosse League
domain: radio station
range: lacrosse league
comment: Relation between Radio Station and Lacrosse League
type: ObjectProperty
sub property of: organisation
comment: Relazione tra Radio Station e Lacrosse League @it

links to Basketball League
type: ObjectProperty
sub property of: organisation
comment: Relation between Radio Station and Basketball League
range: basketball league
domain: radio station
comment: Relazione tra Radio Station e Basketball League @it

RadioStation.owl
has intent: To represent the encyclopedic knowledge expressed by an object typed as RadioStation
imports: dbpediainfoboxmatchingweight.owl
comment: RadioStation Encyclopedic Knowledge Pattern
extracted from: dbpedia.org
has author: Valentina Presutti
imports: cpannotationschema.owl
extracted from: en.wikipedia.org
has author: Andrea Giovanni Nuzzolese
has author: Aldo Gangemi
type: Ontology

links to River
comment: Relazione tra Radio Station e River @it
sub property of: place
range: river
type: ObjectProperty
domain: radio station
comment: Relation between Radio Station and River

convention
label: congrès @fr
type: Class

links to Protected Area
range: protected area
comment: Relation between Radio Station and Protected Area
sub property of: place
type: ObjectProperty
domain: radio station
comment: Relazione tra Radio Station e Protected Area @it
related match: area
type: NamedIndividual

links to Canadian Football Team
type: ObjectProperty
comment: Relazione tra Radio Station e Canadian Football Team @it
range: canadian football team
domain: radio station
sub property of: organisation
comment: Relation between Radio Station and Canadian Football Team

book
type: Class
label: livre @fr
label: βιβλίο @el
label: llibre @ca
label: książka @pl

links to School
type: NamedIndividual
related match: owner
comment: Relation between Radio Station and School
domain: radio station
comment: Relazione tra Radio Station e School @it
range: school
sub property of: organisation
type: ObjectProperty

Axiom
dbpedia infobox matching weight: 100.0
annotated source: links to Hockey Team
annotated target: affiliations
annotated property: relatedMatch

device
label: appareil @fr
type: ObjectProperty

shopping mall
type: Class
label: centre commercial @fr

links to Non- Profit Organisation
sub property of: organisation
type: ObjectProperty
comment: Relation between Radio Station and Non- Profit Organisation
domain: radio station
comment: Relazione tra Radio Station e Non- Profit Organisation @it
range: non-profit organisation

links to Soccer League
sub property of: organisation
range: soccer league
comment: Relazione tra Radio Station e Soccer League @it
type: ObjectProperty
domain: radio station
comment: Relation between Radio Station and Soccer League

Axiom
dbpedia infobox matching weight: 100.0
annotated target: affiliations
annotated property: relatedMatch
annotated source: links to Ice Hockey League

Axiom
dbpedia infobox matching weight: 50.0
annotated source: links to Musical Artist
annotated property: relatedMatch
annotated target: format

ski area
label: domaine skiable @fr
type: Class

non-profit organisation
type: Class
label: organisation à but non lucratif @fr

links to Military Person
type: ObjectProperty
range: military person
comment: Relation between Radio Station and Military Person
domain: radio station
sub property of: person
comment: Relazione tra Radio Station e Military Person @it

canadian football league
type: Class

links to Eurovision Song Contest Entry
range: Eurovision song contest entry
comment: Relation between Radio Station and Eurovision Song Contest Entry
sub property of: work
type: ObjectProperty
domain: radio station
comment: Relazione tra Radio Station e Eurovision Song Contest Entry @it

rugby league
type: Class
label: ligue de rugby @fr

mollusca
type: Class
label: mollusque @fr

weapon
label: arme @fr
type: Class

links to Weapon
range: weapon
comment: Relazione tra Radio Station e Weapon @it
type: ObjectProperty
domain: radio station
comment: Relation between Radio Station and Weapon
sub property of: device

drug
type: Class
label: médicament @fr
type: ObjectProperty

links to Writer
comment: Relazione tra Radio Station e Writer @it
sub property of: person
type: ObjectProperty
range: writer
domain: radio station
comment: Relation between Radio Station and Writer

magazine
label: περιοδικό @el
type: Class

links to Poker Player
sub property of: person
comment: Relazione tra Radio Station e Poker Player @it
domain: radio station
type: ObjectProperty
comment: Relation between Radio Station and Poker Player
range: poker player

Axiom
dbpedia infobox matching weight: 5.0
annotated source: links to University
annotated property: relatedMatch
annotated target: area

Axiom
dbpedia infobox matching weight: 85.19
annotated property: relatedMatch
annotated target: city
annotated source: links to Village

canal
type: Class

links to Astronaut
range: astronaut
type: ObjectProperty
sub property of: person
domain: radio station
comment: Relation between Radio Station and Astronaut
comment: Relazione tra Radio Station e Astronaut @it

links to Chemical Compound
type: NamedIndividual
related match: callsignMeaning
domain: radio station
type: ObjectProperty
sub property of: chemical compound
range: chemical compound
comment: Relation between Radio Station and Chemical Compound
comment: Relazione tra Radio Station e Chemical Compound @it

links to Governor
range: governor
type: ObjectProperty
comment: Relazione tra Radio Station e Governor @it
sub property of: person
domain: radio station
comment: Relation between Radio Station and Governor
type: NamedIndividual
related match: callsignMeaning

military person
label: militaire @fr
type: Class

links to Park
type: ObjectProperty
domain: radio station
comment: Relazione tra Radio Station e Park @it
range: park
comment: Relation between Radio Station and Park
sub property of: place

philosopher
type: Class
label: philosophe @fr

award
type: Class
label: récompense @fr
type: ObjectProperty

locomotive
type: Class

college
type: Class

anatomical structure
label: structure anatomique @fr
type: ObjectProperty
type: Class

links to Baseball Player
sub property of: person
comment: Relation between Radio Station and Baseball Player
type: ObjectProperty
comment: Relazione tra Radio Station e Baseball Player @it
domain: radio station
range: baseball player

sport
type: Class

cricketer
label: joueur de cricket @fr
type: Class

single
type: Class

links to Golf League
type: ObjectProperty
sub property of: organisation
comment: Relation between Radio Station and Golf League
range: golf league
comment: Relazione tra Radio Station e Golf League @it
domain: radio station

links to Valley
comment: Relazione tra Radio Station e Valley @it
comment: Relation between Radio Station and Valley
domain: radio station
range: valley
type: ObjectProperty
sub property of: place

Band
label: groupe de musique @fr
type: Class
label: Musikgruppe @de
label: banda @pt

links to Ice Hockey Player
sub property of: person
type: ObjectProperty
comment: Relazione tra Radio Station e Ice Hockey Player @it
range: ice hockey player
domain: radio station
comment: Relation between Radio Station and Ice Hockey Player

university
label: πανεπιστήμιο @el
label: université @fr
type: Class

links to Comedian
comment: Relation between Radio Station and Comedian
range: comedian
type: ObjectProperty
sub property of: person
comment: Relazione tra Radio Station e Comedian @it
domain: radio station
related match: format
type: NamedIndividual

links to Ski Area
comment: Relation between Radio Station and Ski Area
domain: radio station
sub property of: place
comment: Relazione tra Radio Station e Ski Area @it
type: ObjectProperty
range: ski area

links to Station
comment: Relazione tra Radio Station e Station @it
domain: radio station
type: ObjectProperty
sub property of: place
comment: Relation between Radio Station and Station
range: station

protein
label: protéine @fr
type: Class
type: ObjectProperty

links to Single
type: ObjectProperty
range: single
sub property of: work
domain: radio station
comment: Relazione tra Radio Station e Single @it
comment: Relation between Radio Station and Single

ethnic group
type: Class
type: ObjectProperty
label: groupe ethnique @fr

links to Currency
domain: radio station
comment: Relation between Radio Station and Currency
comment: Relazione tra Radio Station e Currency @it
range: currency
type: ObjectProperty
sub property of: currency

links to Television Show
domain: radio station
range: television show
type: ObjectProperty
sub property of: work
comment: Relazione tra Radio Station e Television Show @it
comment: Relation between Radio Station and Television Show

Axiom
dbpedia infobox matching weight: 100.0
annotated target: owner
annotated property: relatedMatch
annotated source: links to Soccer Club

links to Soccer Player
domain: radio station
range: soccer player
sub property of: person
type: ObjectProperty
comment: Relazione tra Radio Station e Soccer Player @it
comment: Relation between Radio Station and Soccer Player

Axiom
dbpedia infobox matching weight: 100.0
annotated property: relatedMatch
annotated target: area
annotated source: links to Continent

hotel
label: hôtel @fr
type: Class

music festival
label: festival de musique @fr
type: Class

links to Album
type: NamedIndividual
related match: format
comment: Relazione tra Radio Station e Album @it
range: album
type: ObjectProperty
comment: Relation between Radio Station and Album
sub property of: work
domain: radio station

links to Congressman
sub property of: person
comment: Relation between Radio Station and Congressman
range: congressman
comment: Relazione tra Radio Station e Congressman @it
domain: radio station
type: ObjectProperty

college coach
type: Class
label: entraîneur universitaire @fr

television episode
type: Class
label: épisode télévisé @fr

village
label: χωριό @el
type: Class

ice hockey league
label: ligue d'hockey sur glace @fr
type: Class

links to Model
type: ObjectProperty
comment: Relazione tra Radio Station e Model @it
range: model
domain: radio station
sub property of: person
comment: Relation between Radio Station and Model

links to World Heritage Site
comment: Relazione tra Radio Station e World Heritage Site @it
domain: radio station
comment: Relation between Radio Station and World Heritage Site
range: World Heritage Site
type: ObjectProperty
sub property of: place

links to Lake
type: NamedIndividual
related match: area
type: ObjectProperty
sub property of: place
range: lake
comment: Relazione tra Radio Station e Lake @it
domain: radio station
comment: Relation between Radio Station and Lake

soccer club
type: Class
label: club de football @fr

links to Philosopher
type: ObjectProperty
comment: Relazione tra Radio Station e Philosopher @it
sub property of: person
comment: Relation between Radio Station and Philosopher
domain: radio station
range: philosopher

links to Olympics
range: olympics
comment: Relazione tra Radio Station e Olympics @it
type: ObjectProperty
sub property of: event
comment: Relation between Radio Station and Olympics
domain: radio station

historic building
type: Class
label: bâtiment historique @fr

links to Insect
range: insect
comment: Relazione tra Radio Station e Insect @it
type: ObjectProperty
domain: radio station
sub property of: species
comment: Relation between Radio Station and Insect

links to American Football Team
domain: radio station
comment: Relazione tra Radio Station e American Football Team @it
comment: Relation between Radio Station and American Football Team
type: ObjectProperty
sub property of: organisation
range: american football team
type: NamedIndividual
related match: affiliations

office holder
type: Class
label: Amtsinhaber @de
label: titulaire @fr

baseball player
label: joueur de baseball @fr
type: Class

military conflict
label: conflit militaire @fr
type: Class

links to Adult Actor
domain: radio station
range: adult actor
sub property of: person
comment: Relazione tra Radio Station e Adult Actor @it
comment: Relation between Radio Station and Adult Actor
type: ObjectProperty

links to Shopping Mall
range: shopping mall
comment: Relazione tra Radio Station e Shopping Mall @it
sub property of: place
comment: Relation between Radio Station and Shopping Mall
type: ObjectProperty
domain: radio station

Axiom
dbpedia infobox matching weight: 100.0
annotated source: links to American Football Team
annotated property: relatedMatch
annotated target: affiliations

website
type: ObjectProperty
type: Class
label: Ιστότοπος @el
label: site web @fr

Axiom
dbpedia infobox matching weight: 100.0
annotated property: relatedMatch
annotated target: owner
annotated source: links to Newspaper

basketball player
type: Class
label: joueur de basketball @fr

adult actor
label: erwachsener Schauspieler @de
type: Class
label: acteur adulte @fr

ice hockey player
type: Class
label: joueur de hockey sur glace @fr

links to Record Label
comment: Relazione tra Radio Station e Record Label @it
comment: Relation between Radio Station and Record Label
type: ObjectProperty
sub property of: organisation
domain: radio station
range: record label

links to Skyscraper
domain: radio station
comment: Relation between Radio Station and Skyscraper
comment: Relazione tra Radio Station e Skyscraper @it
type: ObjectProperty
range: skyscraper
sub property of: place

Christian Bishop
type: Class
label: évêque chrétien @fr

mountain range
label: chaîne de montagne @fr
type: Class

beverage
type: ObjectProperty
type: Class
label: boisson @fr

links to Book
sub property of: work
comment: Relazione tra Radio Station e Book @it
comment: Relation between Radio Station and Book
domain: radio station
range: book
type: ObjectProperty
type: NamedIndividual
related match: callsignMeaning

links to Ship
range: ship
comment: Relation between Radio Station and Ship
domain: radio station
comment: Relazione tra Radio Station e Ship @it
sub property of: mean of transportation
type: ObjectProperty

links to Saint
sub property of: person
comment: Relation between Radio Station and Saint
type: ObjectProperty
domain: radio station
range: saint
comment: Relazione tra Radio Station e Saint @it

Axiom
dbpedia infobox matching weight: 100.0
annotated target: format
annotated property: relatedMatch
annotated source: links to Ethnic Group

planet
type: Class
label: planète @fr
type: ObjectProperty

scientist
label: scientifique @fr
type: Class
label: Wissenschaftler @de

Axiom
dbpedia infobox matching weight: 42.86
annotated target: format
annotated property: relatedMatch
annotated source: links to Language

Axiom
dbpedia infobox matching weight: 100.0
annotated target: area
annotated property: relatedMatch
annotated source: links to Lake

links to Historic Place
range: historic place
domain: radio station
comment: Relazione tra Radio Station e Historic Place @it
type: ObjectProperty
sub property of: place
comment: Relation between Radio Station and Historic Place

links to Tennis Player
type: ObjectProperty
range: tennis player
comment: Relazione tra Radio Station e Tennis Player @it
comment: Relation between Radio Station and Tennis Player
sub property of: person
domain: radio station

golf league
label: ligue de golf @fr
type: Class

links to Colour
comment: Relation between Radio Station and Colour
type: ObjectProperty
domain: radio station
range: colour
sub property of: colour
comment: Relazione tra Radio Station e Colour @it

links to Baseball League
range: baseball league
sub property of: organisation
comment: Relation between Radio Station and Baseball League
comment: Relazione tra Radio Station e Baseball League @it
type: ObjectProperty
domain: radio station

links to Cardinal
domain: radio station
comment: Relazione tra Radio Station e Cardinal @it
type: ObjectProperty
sub property of: person
comment: Relation between Radio Station and Cardinal
range: cardinal

olympics
label: Jeux Olympiques @fr
type: Class

organisation
label: Organisation @de
label: organização @pt
type: ObjectProperty

links to Criminal
comment: Relazione tra Radio Station e Criminal @it
comment: Relation between Radio Station and Criminal
type: ObjectProperty
domain: radio station
sub property of: person
range: criminal

baseball league
type: Class
label: ligue de baseball @fr

links to Office Holder
type: ObjectProperty
domain: radio station
range: office holder
comment: Relazione tra Radio Station e Office Holder @it
sub property of: person
comment: Relation between Radio Station and Office Holder

bridge
label: pont @fr
type: Class

links to Scientist
comment: Relation between Radio Station and Scientist
type: ObjectProperty
range: scientist
sub property of: person
domain: radio station
comment: Relazione tra Radio Station e Scientist @it

links to Soccer Manager
comment: Relazione tra Radio Station e Soccer Manager @it
type: ObjectProperty
sub property of: person
range: soccer manager
comment: Relation between Radio Station and Soccer Manager
domain: radio station

links to Wrestler
domain: radio station
comment: Relazione tra Radio Station e Wrestler @it
comment: Relation between Radio Station and Wrestler
sub property of: person
type: ObjectProperty
range: wrestler

Axiom
dbpedia infobox matching weight: 100.0
annotated source: links to Album
annotated target: format
annotated property: relatedMatch

links to Legislature
type: ObjectProperty
range: legislature
sub property of: organisation
domain: radio station
comment: Relazione tra Radio Station e Legislature @it
comment: Relation between Radio Station and Legislature

mammal
type: Class
label: mammifère @fr

Eurovision song contest entry
type: Class
label: concours Eurovision de la chanson @fr

island
label: île @fr
label: νησί @el
type: Class

Axiom
dbpedia infobox matching weight: 100.0
annotated source: links to School
annotated target: owner
annotated property: relatedMatch

links to Member Of Parliament
sub property of: person
comment: Relazione tra Radio Station e Member Of Parliament @it
type: ObjectProperty
range: member of parliament
domain: radio station
comment: Relation between Radio Station and Member Of Parliament

Axiom
dbpedia infobox matching weight: 14.81
annotated property: relatedMatch
annotated source: links to Village
annotated target: area

comics character
type: Class
label: personnage de bandes dessinées @fr

event
type: ObjectProperty
label: évènement @fr

Formula One racer
label: pilote de formule 1 @fr
type: Class

skyscraper
label: gratte-ciel @fr
type: Class

links to Aircraft
type: ObjectProperty
comment: Relation between Radio Station and Aircraft
comment: Relazione tra Radio Station e Aircraft @it
range: aircraft
sub property of: mean of transportation
domain: radio station

links to Disease
comment: Relazione tra Radio Station e Disease @it
domain: radio station
type: ObjectProperty
comment: Relation between Radio Station and Disease
range: disease
sub property of: disease

radio station
label: station de radio @fr
type: Class

member of parliament
label: membre du Parlement @fr
type: Class

links to Gaelic Games Player
domain: radio station
comment: Relazione tra Radio Station e Gaelic Games Player @it
range: Gaelic games player
sub property of: person
comment: Relation between Radio Station and Gaelic Games Player
type: ObjectProperty

links to Musical Artist
type: NamedIndividual
domain: radio station
comment: Relazione tra Radio Station e Musical Artist @it
comment: Relation between Radio Station and Musical Artist
related match: owner
type: ObjectProperty
range: musical artist
sub property of: person
related match: format

links to Award
comment: Relazione tra Radio Station e Award @it
domain: radio station
type: ObjectProperty
sub property of: award
comment: Relation between Radio Station and Award
range: award

airport
type: Class
label: Flughafen @de
label: aéroport @fr