links to Newspaper
sub property of: work
domain: record label
type: ObjectProperty
comment: Relazione tra Record Label e Newspaper @it
range: newspaper
comment: Relation between Record Label and Newspaper

television show
type: Class
label: émission de télévision @fr

links to Flowering Plant
domain: record label
sub property of: species
type: ObjectProperty
comment: Relazione tra Record Label e Flowering Plant @it
range: flowering plant
comment: Relation between Record Label and Flowering Plant

links to Mountain Range
type: ObjectProperty
domain: record label
sub property of: place
range: mountain range
comment: Relation between Record Label and Mountain Range
comment: Relazione tra Record Label e Mountain Range @it

disease
type: ObjectProperty
type: Class
label: maladie @fr

links to Trade Union
domain: record label
range: trade union
sub property of: organização
comment: Relazione tra Record Label e Trade Union @it
type: ObjectProperty
comment: Relation between Record Label and Trade Union

colour
type: ObjectProperty
label: χρώμα @el
label: couleur @fr
type: Class

Election
label: élection @fr
type: Class

links to Skyscraper
type: ObjectProperty
sub property of: place
range: skyscraper
comment: Relazione tra Record Label e Skyscraper @it
domain: record label
comment: Relation between Record Label and Skyscraper

links to Non- Profit Organisation
sub property of: organização
comment: Relazione tra Record Label e Non- Profit Organisation @it
range: non-profit organisation
comment: Relation between Record Label and Non- Profit Organisation
type: ObjectProperty
domain: record label

links to Nascar Driver
domain: record label
range: nascar driver
comment: Relation between Record Label and Nascar Driver
type: ObjectProperty
sub property of: person
comment: Relazione tra Record Label e Nascar Driver @it

links to River
range: river
domain: record label
type: ObjectProperty
sub property of: place
comment: Relation between Record Label and River
comment: Relazione tra Record Label e River @it

links to Historic Building
range: historic building
sub property of: place
comment: Relation between Record Label and Historic Building
type: ObjectProperty
domain: record label
comment: Relazione tra Record Label e Historic Building @it

links to Ethnic Group
type: ObjectProperty
comment: Relazione tra Record Label e Ethnic Group @it
comment: Relation between Record Label and Ethnic Group
sub property of: ethnic group
range: ethnic group
domain: record label

links to American Football Team
comment: Relation between Record Label and American Football Team
type: ObjectProperty
sub property of: organização
range: american football team
domain: record label
comment: Relazione tra Record Label e American Football Team @it

american football player
label: joueur de football américain @fr
type: Class

links to Military Person
comment: Relation between Record Label and Military Person
domain: record label
type: ObjectProperty
sub property of: person
comment: Relazione tra Record Label e Military Person @it
range: military person

stadium
type: Class
label: stade @fr

links to Soccer Club
comment: Relation between Record Label and Soccer Club
type: ObjectProperty
range: soccer club
comment: Relazione tra Record Label e Soccer Club @it
sub property of: organização
domain: record label

links to Colour
comment: Relazione tra Record Label e Colour @it
range: colour
comment: Relation between Record Label and Colour
sub property of: colour
domain: record label
type: ObjectProperty

wrestler
type: Class
label: lutteur @fr

links to Governor
domain: record label
sub property of: person
comment: Relation between Record Label and Governor
type: ObjectProperty
range: governor
comment: Relazione tra Record Label e Governor @it

pope
type: Class
label: pape @fr

links to Sport
comment: Relazione tra Record Label e Sport @it
domain: record label
type: ObjectProperty
sub property of: activity
range: sport
comment: Relation between Record Label and Sport

links to Chemical Compound
comment: Relation between Record Label and Chemical Compound
type: ObjectProperty
sub property of: chemical compound
comment: Relazione tra Record Label e Chemical Compound @it
domain: record label
range: chemical compound

species
label: espèce @fr
type: ObjectProperty

links to Adult Actor
type: ObjectProperty
comment: Relazione tra Record Label e Adult Actor @it
range: adult actor
comment: Relation between Record Label and Adult Actor
domain: record label
sub property of: person

links to American Football Player
domain: record label
sub property of: person
comment: Relation between Record Label and American Football Player
comment: Relazione tra Record Label e American Football Player @it
range: american football player
type: ObjectProperty

links to Planet
range: planet
comment: Relation between Record Label and Planet
domain: record label
sub property of: planet
type: ObjectProperty
comment: Relazione tra Record Label e Planet @it

newspaper
type: Class
label: journal @fr

links to Soccer Player
sub property of: person
domain: record label
comment: Relazione tra Record Label e Soccer Player @it
type: ObjectProperty
comment: Relation between Record Label and Soccer Player
range: soccer player

game
type: Class
label: jeu @fr

road
type: Class
label: route @fr

links to Website
comment: Relation between Record Label and Website
domain: record label
range: website
type: ObjectProperty
comment: Relazione tra Record Label e Website @it
sub property of: website

links to Language
sub property of: language
comment: Relation between Record Label and Language
domain: record label
comment: Relazione tra Record Label e Language @it
range: language
type: ObjectProperty
type: NamedIndividual
related match: genre

boxer
type: Class
label: boxeur @fr

judge
label: juge @fr
type: Class

World Heritage Site
label: site du patrimoine mondial @fr
type: Class

links to Film Festival
domain: record label
comment: Relazione tra Record Label e Film Festival @it
sub property of: event
type: ObjectProperty
comment: Relation between Record Label and Film Festival
range: film festival

language
type: Class
label: langage @fr
type: ObjectProperty

lake
label: lac @fr
type: Class

links to Book
comment: Relazione tra Record Label e Book @it
comment: Relation between Record Label and Book
type: ObjectProperty
domain: record label
sub property of: work
range: book

links to Writer
type: NamedIndividual
related match: founder
type: ObjectProperty
domain: record label
comment: Relation between Record Label and Writer
comment: Relazione tra Record Label e Writer @it
sub property of: person
range: writer

governor
type: Class
label: gouverneur @fr

links to Gaelic Games Player
range: Gaelic games player
domain: record label
type: ObjectProperty
sub property of: person
comment: Relazione tra Record Label e Gaelic Games Player @it
comment: Relation between Record Label and Gaelic Games Player

work
type: ObjectProperty
label: travail @fr
label: obra @pt

river
label: rivière @fr
type: Class

links to Member Of Parliament
comment: Relation between Record Label and Member Of Parliament
comment: Relazione tra Record Label e Member Of Parliament @it
domain: record label
type: ObjectProperty
sub property of: person
range: member of parliament

fish
label: poisson @fr
type: Class

museum
type: Class
label: musée @fr

video game
type: Class
label: jeux vidéo @fr

trade union
label: syndicat professionnel @fr
type: Class

currency
type: ObjectProperty
type: Class
label: devise @fr

British royalty
type: Class
label: royauté Britannique @fr

historic place
type: Class
label: site historique @fr

links to Cricketer
comment: Relation between Record Label and Cricketer
sub property of: person
domain: record label
comment: Relazione tra Record Label e Cricketer @it
range: cricketer
type: ObjectProperty

links to Philosopher
comment: Relazione tra Record Label e Philosopher @it
comment: Relation between Record Label and Philosopher
domain: record label
type: ObjectProperty
sub property of: person
range: philosopher

links to Criminal
comment: Relation between Record Label and Criminal
type: ObjectProperty
comment: Relazione tra Record Label e Criminal @it
range: criminal
domain: record label
sub property of: person

links to Comics Creator
sub property of: person
comment: Relazione tra Record Label e Comics Creator @it
comment: Relation between Record Label and Comics Creator
type: ObjectProperty
range: comics creator
domain: record label
type: NamedIndividual
related match: founder

continent
label: ήπειρος @el
type: Class

links to Continent
type: ObjectProperty
sub property of: place
range: continent
comment: Relation between Record Label and Continent
comment: Relazione tra Record Label e Continent @it
domain: record label

links to Senator
range: senator
comment: Relazione tra Record Label e Senator @it
domain: record label
comment: Relation between Record Label and Senator
type: ObjectProperty
sub property of: person

links to Magazine
sub property of: work
range: magazine
type: ObjectProperty
comment: Relazione tra Record Label e Magazine @it
domain: record label
comment: Relation between Record Label and Magazine

president
type: Class
label: président @fr

person
label: Person @de
label: pessoa @pt
type: ObjectProperty
label: personne @fr

links to Airline
comment: Relation between Record Label and Airline
comment: Relazione tra Record Label e Airline @it
sub property of: organização
range: airline
type: ObjectProperty
domain: record label

links to Reptile
comment: Relazione tra Record Label e Reptile @it
range: reptile
type: ObjectProperty
sub property of: species
domain: record label
comment: Relation between Record Label and Reptile

links to Mountain
domain: record label
type: ObjectProperty
comment: Relation between Record Label and Mountain
sub property of: place
comment: Relazione tra Record Label e Mountain @it
range: mountain

links to Formula One Racer
comment: Relation between Record Label and Formula One Racer
domain: record label
range: Formula One racer
comment: Relazione tra Record Label e Formula One Racer @it
sub property of: person
type: ObjectProperty

links to Monarch
comment: Relazione tra Record Label e Monarch @it
type: ObjectProperty
domain: record label
comment: Relation between Record Label and Monarch
range: monarch
sub property of: person

writer
label: écrivain @fr
type: Class

record label
label: label discographique @fr
type: Class

model
label: mannequin @fr
type: Class

film festival
type: Class
label: festival du film @fr

links to Bird
comment: Relation between Record Label and Bird
sub property of: species
range: bird
domain: record label
comment: Relazione tra Record Label e Bird @it
type: ObjectProperty

links to World Heritage Site
sub property of: place
comment: Relazione tra Record Label e World Heritage Site @it
comment: Relation between Record Label and World Heritage Site
type: ObjectProperty
domain: record label
range: World Heritage Site

links to Judge
comment: Relation between Record Label and Judge
sub property of: person
domain: record label
type: ObjectProperty
comment: Relazione tra Record Label e Judge @it
range: judge

links to Mammal
comment: Relazione tra Record Label e Mammal @it
type: ObjectProperty
sub property of: species
range: mammal
comment: Relation between Record Label and Mammal
domain: record label

links to Congressman
domain: record label
range: congressman
comment: Relazione tra Record Label e Congressman @it
type: ObjectProperty
sub property of: person
comment: Relation between Record Label and Congressman

links to Basketball Player
sub property of: person
comment: Relation between Record Label and Basketball Player
comment: Relazione tra Record Label e Basketball Player @it
range: basketball player
domain: record label
type: ObjectProperty

links to Insect
range: insect
comment: Relation between Record Label and Insect
type: ObjectProperty
sub property of: species
domain: record label
comment: Relazione tra Record Label e Insect @it

comics creator
type: Class
label: créateur de bandes dessinées @fr

links to President
type: ObjectProperty
range: president
sub property of: person
comment: Relazione tra Record Label e President @it
domain: record label
comment: Relation between Record Label and President

soccer player
type: Class
label: joueur de football @fr

links to Baseball Player
sub property of: person
comment: Relation between Record Label and Baseball Player
range: baseball player
domain: record label
comment: Relazione tra Record Label e Baseball Player @it
type: ObjectProperty

reptile
type: Class

airline
label: compagnie aérienne @fr
type: Class

links to Television Episode
sub property of: work
comment: Relazione tra Record Label e Television Episode @it
type: ObjectProperty
range: television episode
domain: record label
comment: Relation between Record Label and Television Episode

monarch
label: monarque @fr
type: Class

congressman
label: membre du Congrès @fr
type: Class

links to Office Holder
type: ObjectProperty
domain: record label
sub property of: person
comment: Relation between Record Label and Office Holder
comment: Relazione tra Record Label e Office Holder @it
range: office holder

nascar driver
type: Class
label: pilote de la nascar @fr

activity
type: ObjectProperty
label: Aktivität @de
label: activité @fr

journalist
label: journaliste @fr
type: Class

links to Military Conflict
comment: Relation between Record Label and Military Conflict
comment: Relazione tra Record Label e Military Conflict @it
type: ObjectProperty
range: military conflict
domain: record label
sub property of: event

insect
label: insecte @fr
type: Class

film
type: Class
label: ταινία @el

american football team
type: Class
label: équipe américaine de football américain @fr

bird
type: Class
label: oiseau @fr

chemical compound
label: produit chimique @fr
type: ObjectProperty
type: Class

Gaelic games player
label: joueur de sports gaéliques @fr
type: Class

links to Model
comment: Relation between Record Label and Model
type: ObjectProperty
sub property of: person
domain: record label
range: model
comment: Relazione tra Record Label e Model @it

links to Lake
range: lake
type: ObjectProperty
comment: Relation between Record Label and Lake
comment: Relazione tra Record Label e Lake @it
domain: record label
sub property of: place

links to Town
sub property of: place
comment: Relazione tra Record Label e Town @it
domain: record label
type: ObjectProperty
comment: Relation between Record Label and Town
range: town
type: NamedIndividual
related match: location

links to Saint
sub property of: person
comment: Relation between Record Label and Saint
domain: record label
comment: Relazione tra Record Label e Saint @it
type: ObjectProperty
range: saint

links to Eurovision Song Contest Entry
type: ObjectProperty
comment: Relazione tra Record Label e Eurovision Song Contest Entry @it
sub property of: work
range: Eurovision song contest entry
domain: record label
comment: Relation between Record Label and Eurovision Song Contest Entry

Axiom
dbpedia infobox matching weight: 100.0
annotated property: relatedMatch
annotated target: founder
annotated source: links to Comics Creator

links to Currency
comment: Relazione tra Record Label e Currency @it
domain: record label
sub property of: currency
type: ObjectProperty
range: currency
comment: Relation between Record Label and Currency

links to National Collegiate Athletic Association Athlete
comment: Relazione tra Record Label e National Collegiate Athletic Association Athlete @it
domain: record label
sub property of: person
type: ObjectProperty
comment: Relation between Record Label and National Collegiate Athletic Association Athlete
range: national collegiate athletic association athlete

links to Comics Character
sub property of: person
type: ObjectProperty
comment: Relazione tra Record Label e Comics Character @it
domain: record label
range: comics character
comment: Relation between Record Label and Comics Character

musical
label: musique @fr
type: Class

place
type: ObjectProperty
label: περιοχή @el
label: lieu @fr
label: lugar @pt

national collegiate athletic association athlete
type: Class
label: athlète de la national collegiate athletic association @fr

links to Wrestler
range: wrestler
comment: Relazione tra Record Label e Wrestler @it
domain: record label
sub property of: person
type: ObjectProperty
comment: Relation between Record Label and Wrestler

links to Anatomical Structure
comment: Relazione tra Record Label e Anatomical Structure @it
range: anatomical structure
type: ObjectProperty
sub property of: anatomical structure
domain: record label
comment: Relation between Record Label and Anatomical Structure

links to Video Game
comment: Relazione tra Record Label e Video Game @it
type: ObjectProperty
range: video game
comment: Relation between Record Label and Video Game
sub property of: work
domain: record label

links to Radio Station
type: ObjectProperty
sub property of: organização
domain: record label
range: radio station
comment: Relation between Record Label and Radio Station
comment: Relazione tra Record Label e Radio Station @it

links to Scientist
sub property of: person
range: scientist
type: ObjectProperty
domain: record label
comment: Relazione tra Record Label e Scientist @it
comment: Relation between Record Label and Scientist

infrastructure
type: ObjectProperty

links to Village
comment: Relazione tra Record Label e Village @it
sub property of: place
type: ObjectProperty
range: village
domain: record label
comment: Relation between Record Label and Village

mountain
type: Class
label: montagne @fr
label: Βουνό @el

criminal
type: Class
label: criminel @fr

links to Protein
type: ObjectProperty
comment: Relation between Record Label and Protein
domain: record label
range: protein
comment: Relazione tra Record Label e Protein @it
sub property of: protein

links to British Royalty
domain: record label
type: ObjectProperty
range: British royalty
comment: Relation between Record Label and British Royalty
comment: Relazione tra Record Label e British Royalty @it
sub property of: person

Axiom
dbpedia infobox matching weight: 100.0
annotated source: links to Town
annotated property: relatedMatch
annotated target: location

flowering plant
label: angiospermes @fr
type: Class

saint
type: Class

senator
type: Class
label: sénateur @fr

comedian
type: Class
label: comédien @fr

convention
label: congrès @fr
type: Class

book
label: llibre @ca
label: książka @pl
label: βιβλίο @el
label: livre @fr
type: Class

shopping mall
type: Class
label: centre commercial @fr

links to Museum
comment: Relazione tra Record Label e Museum @it
comment: Relation between Record Label and Museum
sub property of: place
domain: record label
type: ObjectProperty
range: museum

non-profit organisation
type: Class
label: organisation à but non lucratif @fr

links to Road
sub property of: infrastructure
comment: Relation between Record Label and Road
comment: Relazione tra Record Label e Road @it
type: ObjectProperty
range: road
domain: record label

Axiom
dbpedia infobox matching weight: 100.0
annotated property: relatedMatch
annotated target: genre
annotated source: links to Language

links to Shopping Mall
sub property of: place
type: ObjectProperty
comment: Relation between Record Label and Shopping Mall
range: shopping mall
comment: Relazione tra Record Label e Shopping Mall @it
domain: record label

links to Musical
comment: Relation between Record Label and Musical
domain: record label
comment: Relazione tra Record Label e Musical @it
range: musical
type: ObjectProperty
sub property of: work

drug
type: ObjectProperty
label: médicament @fr
type: Class

links to Beverage
comment: Relation between Record Label and Beverage
type: ObjectProperty
range: beverage
sub property of: beverage
comment: Relazione tra Record Label e Beverage @it
domain: record label

links to Drug
range: drug
comment: Relation between Record Label and Drug
type: ObjectProperty
comment: Relazione tra Record Label e Drug @it
sub property of: drug
domain: record label

magazine
label: περιοδικό @el
type: Class

links to Fish
domain: record label
sub property of: species
comment: Relation between Record Label and Fish
comment: Relazione tra Record Label e Fish @it
range: fish
type: ObjectProperty

links to Conifer
domain: record label
comment: Relazione tra Record Label e Conifer @it
sub property of: species
type: ObjectProperty
range: conifer
comment: Relation between Record Label and Conifer

Axiom
dbpedia infobox matching weight: 100.0
annotated property: relatedMatch
annotated target: founder
annotated source: links to Writer

military person
type: Class
label: militaire @fr

philosopher
type: Class
label: philosophe @fr

award
type: ObjectProperty
label: récompense @fr
type: Class

links to Boxer
comment: Relazione tra Record Label e Boxer @it
domain: record label
range: boxer
comment: Relation between Record Label and Boxer
type: ObjectProperty
sub property of: person

college
type: Class

sport
type: Class

anatomical structure
label: structure anatomique @fr
type: ObjectProperty
type: Class

links to College
comment: Relation between Record Label and College
type: ObjectProperty
sub property of: organização
comment: Relazione tra Record Label e College @it
range: college
domain: record label

cricketer
label: joueur de cricket @fr
type: Class

Axiom
dbpedia infobox matching weight: 100.0
annotated target: country
annotated source: links to Island
annotated property: relatedMatch

town
label: ville @fr
type: Class

links to University
range: university
sub property of: organização
type: ObjectProperty
domain: record label
comment: Relation between Record Label and University
comment: Relazione tra Record Label e University @it

university
label: πανεπιστήμιο @el
label: université @fr
type: Class

protein
label: protéine @fr
type: Class
type: ObjectProperty

ethnic group
label: groupe ethnique @fr
type: ObjectProperty
type: Class

links to Game
range: game
comment: Relazione tra Record Label e Game @it
comment: Relation between Record Label and Game
sub property of: activity
domain: record label
type: ObjectProperty

music festival
label: festival de musique @fr
type: Class

college coach
label: entraîneur universitaire @fr
type: Class

television episode
type: Class
label: épisode télévisé @fr

village
label: χωριό @el
type: Class

links to Broadcast
sub property of: organização
type: ObjectProperty
domain: record label
comment: Relazione tra Record Label e Broadcast @it
range: broadcast
comment: Relation between Record Label and Broadcast

soccer club
label: club de football @fr
type: Class

historic building
type: Class
label: bâtiment historique @fr

office holder
type: Class
label: Amtsinhaber @de
label: titulaire @fr

links to Music Festival
sub property of: event
range: music festival
comment: Relazione tra Record Label e Music Festival @it
type: ObjectProperty
domain: record label
comment: Relation between Record Label and Music Festival

baseball player
label: joueur de baseball @fr
type: Class

military conflict
type: Class
label: conflit militaire @fr

website
label: site web @fr
label: Ιστότοπος @el
type: Class
type: ObjectProperty

basketball player
type: Class
label: joueur de basketball @fr

links to Stadium
domain: record label
range: stadium
type: ObjectProperty
comment: Relation between Record Label and Stadium
comment: Relazione tra Record Label e Stadium @it
sub property of: place

adult actor
label: erwachsener Schauspieler @de
type: Class
label: acteur adulte @fr

ice hockey player
type: Class
label: joueur de hockey sur glace @fr

mountain range
label: chaîne de montagne @fr
type: Class

beverage
type: ObjectProperty
type: Class
label: boisson @fr

links to Film
domain: record label
comment: Relation between Record Label and Film
comment: Relazione tra Record Label e Film @it
range: film
type: ObjectProperty
sub property of: work

links to Island
comment: Relazione tra Record Label e Island @it
sub property of: place
range: island
comment: Relation between Record Label and Island
domain: record label
type: ObjectProperty
type: NamedIndividual
related match: country

RecordLabel.owl
has author: Andrea Giovanni Nuzzolese
has author: Aldo Gangemi
imports: dbpediainfoboxmatchingweight.owl
extracted from: en.wikipedia.org
has author: Valentina Presutti
comment: RecordLabel Encyclopedic Knowledge Pattern
imports: cpannotationschema.owl
extracted from: dbpedia.org
type: Ontology
has intent: To represent the encyclopedic knowledge expressed by an object typed as RecordLabel

planet
type: ObjectProperty
label: planète @fr
type: Class

scientist
label: Wissenschaftler @de
type: Class
label: scientifique @fr

links to Ice Hockey Player
sub property of: person
range: ice hockey player
type: ObjectProperty
comment: Relation between Record Label and Ice Hockey Player
comment: Relazione tra Record Label e Ice Hockey Player @it
domain: record label

links to Disease
type: ObjectProperty
sub property of: disease
range: disease
comment: Relation between Record Label and Disease
comment: Relazione tra Record Label e Disease @it
domain: record label

links to Historic Place
range: historic place
comment: Relazione tra Record Label e Historic Place @it
domain: record label
sub property of: place
type: ObjectProperty
comment: Relation between Record Label and Historic Place

organização
type: ObjectProperty
label: organisation
label: Organisation @de

links to Pope
sub property of: person
comment: Relation between Record Label and Pope
type: ObjectProperty
domain: record label
comment: Relazione tra Record Label e Pope @it
range: pope

links to Convention
comment: Relation between Record Label and Convention
domain: record label
type: ObjectProperty
range: convention
sub property of: event
comment: Relazione tra Record Label e Convention @it

broadcast
type: Class
label: Émission de télévision @fr

links to Journalist
comment: Relation between Record Label and Journalist
comment: Relazione tra Record Label e Journalist @it
domain: record label
sub property of: person
type: ObjectProperty
range: journalist

mammal
type: Class
label: mammifère @fr

Eurovision song contest entry
type: Class
label: concours Eurovision de la chanson @fr

links to Television Show
type: ObjectProperty
range: television show
sub property of: work
comment: Relazione tra Record Label e Television Show @it
domain: record label
comment: Relation between Record Label and Television Show

links to College Coach
comment: Relazione tra Record Label e College Coach @it
type: ObjectProperty
domain: record label
range: college coach
sub property of: person
comment: Relation between Record Label and College Coach

links to Award
domain: record label
sub property of: award
range: award
type: ObjectProperty
comment: Relation between Record Label and Award
comment: Relazione tra Record Label e Award @it

island
type: Class
label: νησί @el
label: île @fr

comics character
type: Class
label: personnage de bandes dessinées @fr

links to Airport
comment: Relazione tra Record Label e Airport @it
range: airport
domain: record label
comment: Relation between Record Label and Airport
sub property of: place
type: ObjectProperty

event
label: évènement @fr
type: ObjectProperty

Formula One racer
type: Class
label: pilote de formule 1 @fr

skyscraper
label: gratte-ciel @fr
type: Class

radio station
label: station de radio @fr
type: Class

links to Election
comment: Relation between Record Label and Election
type: ObjectProperty
comment: Relazione tra Record Label e Election @it
range: Election
domain: record label
sub property of: event

member of parliament
label: membre du Parlement @fr
type: Class

links to Comedian
comment: Relation between Record Label and Comedian
comment: Relazione tra Record Label e Comedian @it
range: comedian
domain: record label
sub property of: person
type: ObjectProperty

conifer
label: conifères @fr
type: Class

airport
type: Class
label: Flughafen @de
label: aéroport @fr