Axiom
dbpedia infobox matching weight: 100.0
annotated target: ruProclubs
annotated source: links to Music Genre
annotated property: relatedMatch

Axiom
dbpedia infobox matching weight: 3.57
annotated property: relatedMatch
annotated target: ruProclubs
annotated source: links to University

links to Office Holder
comment: Relation between Rugby Player and Office Holder
domain: rugby player
sub property of: person
type: ObjectProperty
range: office holder
comment: Relazione tra Rugby Player e Office Holder @it

television show
type: Class
label: émission de télévision @fr

links to Soccer League
comment: Relazione tra Rugby Player e Soccer League @it
domain: rugby player
range: soccer league
comment: Relation between Rugby Player and Soccer League
sub property of: organização
type: ObjectProperty

disease
label: maladie @fr
type: Class
type: ObjectProperty

links to Figure Skater
type: ObjectProperty
comment: Relazione tra Rugby Player e Figure Skater @it
range: figure skater
domain: rugby player
sub property of: person
comment: Relation between Rugby Player and Figure Skater

links to British Royalty
sub property of: person
comment: Relazione tra Rugby Player e British Royalty @it
domain: rugby player
range: British royalty
comment: Relation between Rugby Player and British Royalty
type: ObjectProperty

links to Mountain Range
range: mountain range
domain: rugby player
comment: Relazione tra Rugby Player e Mountain Range @it
comment: Relation between Rugby Player and Mountain Range
sub property of: place
type: ObjectProperty

colour
type: Class
label: couleur @fr
label: χρώμα @el
type: ObjectProperty

links to Muscle
range: muscle
type: ObjectProperty
comment: Relation between Rugby Player and Muscle
sub property of: anatomical structure
comment: Relazione tra Rugby Player e Muscle @it
domain: rugby player

links to Gaelic Games Player
type: NamedIndividual
related match: after
domain: rugby player
range: Gaelic games player
comment: Relation between Rugby Player and Gaelic Games Player
comment: Relazione tra Rugby Player e Gaelic Games Player @it
type: ObjectProperty
related match: before
sub property of: person

Election
label: élection @fr
type: Class

Axiom
dbpedia infobox matching weight: 3.57
annotated property: relatedMatch
annotated target: ruAmateurclubs
annotated source: links to University

links to Airline
comment: Relazione tra Rugby Player e Airline @it
type: ObjectProperty
comment: Relation between Rugby Player and Airline
domain: rugby player
sub property of: organização
range: airline

mean of transportation
label: moyen de transport @fr
type: ObjectProperty

american football player
label: joueur de football américain @fr
type: Class

links to Historic Building
comment: Relation between Rugby Player and Historic Building
range: historic building
sub property of: place
domain: rugby player
comment: Relazione tra Rugby Player e Historic Building @it
type: ObjectProperty

soccer league
type: Class
label: ligue de football @fr

astronaut
type: Class
label: Astronaut @de
label: astronaute @fr

links to Road
comment: Relation between Rugby Player and Road
domain: rugby player
comment: Relazione tra Rugby Player e Road @it
type: ObjectProperty
sub property of: infrastructure
range: road

Axiom
dbpedia infobox matching weight: 100.0
annotated source: links to Band
annotated property: relatedMatch
annotated target: ruProvince

Axiom
dbpedia infobox matching weight: 100.0
annotated source: links to Award
annotated target: title
annotated property: relatedMatch

wrestler
label: lutteur @fr
type: Class

species
type: ObjectProperty
label: espèce @fr

links to World Heritage Site
range: World Heritage Site
comment: Relazione tra Rugby Player e World Heritage Site @it
domain: rugby player
type: ObjectProperty
sub property of: place
comment: Relation between Rugby Player and World Heritage Site

links to Chemical Compound
sub property of: chemical compound
comment: Relazione tra Rugby Player e Chemical Compound @it
comment: Relation between Rugby Player and Chemical Compound
type: ObjectProperty
range: chemical compound
domain: rugby player

links to American Football Player
type: ObjectProperty
range: american football player
domain: rugby player
comment: Relazione tra Rugby Player e American Football Player @it
sub property of: person
comment: Relation between Rugby Player and American Football Player

links to Mammal
sub property of: species
comment: Relazione tra Rugby Player e Mammal @it
range: mammal
comment: Relation between Rugby Player and Mammal
type: ObjectProperty
domain: rugby player

newspaper
label: journal @fr
type: Class

protected area
label: aire protégée @fr
label: προστατευμένη περιοχή @el
type: Class

road
type: Class
label: route @fr

links to Town
type: ObjectProperty
comment: Relazione tra Rugby Player e Town @it
domain: rugby player
comment: Relation between Rugby Player and Town
sub property of: place
range: town

boxer
type: Class
label: boxeur @fr

judge
type: Class
label: juge @fr

World Heritage Site
type: Class
label: site du patrimoine mondial @fr

links to Military Person
related match: before
type: NamedIndividual
sub property of: person
comment: Relazione tra Rugby Player e Military Person @it
comment: Relation between Rugby Player and Military Person
domain: rugby player
type: ObjectProperty
range: military person

Axiom
dbpedia infobox matching weight: 100.0
annotated source: links to Cricketer
annotated property: relatedMatch
annotated target: before

links to University
related match: ruProclubs
comment: Relazione tra Rugby Player e University @it
range: university
type: NamedIndividual
related match: ruAmateurclubs
related match: school
domain: rugby player
sub property of: organização
comment: Relation between Rugby Player and University
related match: university
type: ObjectProperty

links to Golf Player
range: golf player
type: ObjectProperty
comment: Relation between Rugby Player and Golf Player
comment: Relazione tra Rugby Player e Golf Player @it
sub property of: person
domain: rugby player

links to Poker Player
domain: rugby player
sub property of: person
comment: Relation between Rugby Player and Poker Player
range: poker player
comment: Relazione tra Rugby Player e Poker Player @it
type: ObjectProperty

Axiom
dbpedia infobox matching weight: 89.29
annotated source: links to University
annotated target: university
annotated property: relatedMatch

links to Radio Station
domain: rugby player
comment: Relation between Rugby Player and Radio Station
comment: Relazione tra Rugby Player e Radio Station @it
type: ObjectProperty
sub property of: organização
range: radio station

language
type: Class
label: langage @fr
type: ObjectProperty

tennis league
type: Class
label: ligue de tennis @fr

links to Song
comment: Relation between Rugby Player and Song
domain: rugby player
type: ObjectProperty
comment: Relazione tra Rugby Player e Song @it
sub property of: work
range: song

links to Album
sub property of: work
comment: Relation between Rugby Player and Album
domain: rugby player
range: album
type: ObjectProperty
comment: Relazione tra Rugby Player e Album @it

lake
type: Class
label: lac @fr

links to Badminton Player
comment: Relation between Rugby Player and Badminton Player
domain: rugby player
range: badminton player
comment: Relazione tra Rugby Player e Badminton Player @it
type: ObjectProperty
sub property of: person

links to Museum
domain: rugby player
range: museum
comment: Relazione tra Rugby Player e Museum @it
sub property of: place
comment: Relation between Rugby Player and Museum
type: ObjectProperty

links to Single
range: single
domain: rugby player
comment: Relation between Rugby Player and Single
comment: Relazione tra Rugby Player e Single @it
type: ObjectProperty
sub property of: work

governor
type: Class
label: gouverneur @fr

poker player
type: Class
label: joueur de poker @fr

work
type: ObjectProperty
label: travail @fr
label: obra @pt

river
label: rivière @fr
type: Class

Axiom
dbpedia infobox matching weight: 75.0
annotated target: ruProclubs
annotated source: links to Soccer Club
annotated property: relatedMatch

Axiom
dbpedia infobox matching weight: 50.0
annotated source: links to Gaelic Games Player
annotated property: relatedMatch
annotated target: before

ship
type: Class
label: navire @fr

museum
label: musée @fr
type: Class

tennis player
label: joueur de tennis @fr
type: Class

video game
label: jeux vidéo @fr
type: Class

trade union
label: syndicat professionnel @fr
type: Class

currency
label: devise @fr
type: Class
type: ObjectProperty

British royalty
type: Class
label: royauté Britannique @fr

prime minister
type: Class
label: premier ministre @fr

links to Comedian
domain: rugby player
range: comedian
sub property of: person
comment: Relation between Rugby Player and Comedian
type: ObjectProperty
comment: Relazione tra Rugby Player e Comedian @it

historic place
type: Class
label: site historique @fr

hospital
type: Class
label: hôpital @fr

links to Writer
comment: Relazione tra Rugby Player e Writer @it
type: ObjectProperty
range: writer
domain: rugby player
sub property of: person
comment: Relation between Rugby Player and Writer

continent
label: ήπειρος @el
type: Class

links to Park
comment: Relazione tra Rugby Player e Park @it
domain: rugby player
range: park
sub property of: place
comment: Relation between Rugby Player and Park
type: ObjectProperty

links to Award
type: NamedIndividual
related match: title
domain: rugby player
comment: Relazione tra Rugby Player e Award @it
comment: Relation between Rugby Player and Award
sub property of: award
range: award
type: ObjectProperty

Axiom
dbpedia infobox matching weight: 3.57
annotated property: relatedMatch
annotated target: school
annotated source: links to University

president
type: Class
label: président @fr

links to Plant
comment: Relazione tra Rugby Player e Plant @it
range: plant
comment: Relation between Rugby Player and Plant
sub property of: species
domain: rugby player
type: ObjectProperty

album
label: Album @de
type: Class

figure skater
type: Class
label: patineur artistique @fr

links to Rugby League
sub property of: organização
domain: rugby player
comment: Relation between Rugby Player and Rugby League
type: ObjectProperty
comment: Relazione tra Rugby Player e Rugby League @it
range: rugby league
related match: ruSevensnationalcomp
type: NamedIndividual

links to Criminal
comment: Relazione tra Rugby Player e Criminal @it
type: ObjectProperty
domain: rugby player
sub property of: person
comment: Relation between Rugby Player and Criminal
range: criminal

person
label: Person @de
label: pessoa @pt
type: ObjectProperty
label: personne @fr

military unit
label: unité militaire @fr
type: Class

links to Soccer Club
sub property of: organização
type: NamedIndividual
related match: ruProclubs
comment: Relazione tra Rugby Player e Soccer Club @it
domain: rugby player
range: soccer club
type: ObjectProperty
comment: Relation between Rugby Player and Soccer Club
related match: ruAmateurclubs

soccer manager
type: Class
label: entraîneur de football @fr

links to College
sub property of: organização
comment: Relazione tra Rugby Player e College @it
type: ObjectProperty
range: college
comment: Relation between Rugby Player and College
domain: rugby player
type: NamedIndividual
related match: university

canadian football team
label: équipe canadienne de football américain @fr
type: Class

music genre
type: Class
label: género musical @pt
type: ObjectProperty
label: genre musical @fr

writer
label: écrivain @fr
type: Class

model
type: Class
label: mannequin @fr

olympic result
label: résultat de Jeux Olympiques @fr
type: Class
type: ObjectProperty

links to Drug
range: drug
comment: Relazione tra Rugby Player e Drug @it
sub property of: drug
comment: Relation between Rugby Player and Drug
type: ObjectProperty
domain: rugby player

links to Saint
type: ObjectProperty
comment: Relazione tra Rugby Player e Saint @it
range: saint
domain: rugby player
sub property of: person
comment: Relation between Rugby Player and Saint

Axiom
dbpedia infobox matching weight: 25.0
annotated property: relatedMatch
annotated source: links to Soccer Club
annotated target: ruAmateurclubs

links to River
comment: Relation between Rugby Player and River
domain: rugby player
type: ObjectProperty
range: river
comment: Relazione tra Rugby Player e River @it
sub property of: place

links to Military Unit
related match: occupation
type: NamedIndividual
sub property of: organização
domain: rugby player
comment: Relazione tra Rugby Player e Military Unit @it
type: ObjectProperty
range: military unit
comment: Relation between Rugby Player and Military Unit

links to Adult Actor
sub property of: person
domain: rugby player
comment: Relation between Rugby Player and Adult Actor
comment: Relazione tra Rugby Player e Adult Actor @it
range: adult actor
type: ObjectProperty

links to Television Show
domain: rugby player
comment: Relazione tra Rugby Player e Television Show @it
type: ObjectProperty
comment: Relation between Rugby Player and Television Show
sub property of: work
range: television show

links to Continent
comment: Relation between Rugby Player and Continent
domain: rugby player
type: ObjectProperty
comment: Relazione tra Rugby Player e Continent @it
sub property of: place
range: continent

links to Governor
sub property of: person
domain: rugby player
comment: Relation between Rugby Player and Governor
range: governor
type: ObjectProperty
comment: Relazione tra Rugby Player e Governor @it

links to Trade Union
type: ObjectProperty
comment: Relation between Rugby Player and Trade Union
domain: rugby player
comment: Relazione tra Rugby Player e Trade Union @it
sub property of: organização
range: trade union

links to Baseball Player
domain: rugby player
range: baseball player
comment: Relazione tra Rugby Player e Baseball Player @it
type: ObjectProperty
comment: Relation between Rugby Player and Baseball Player
sub property of: person

links to Soccer Manager
comment: Relation between Rugby Player and Soccer Manager
type: ObjectProperty
range: soccer manager
comment: Relazione tra Rugby Player e Soccer Manager @it
sub property of: person
domain: rugby player

aircraft
label: αεροσκάφος @el
type: Class
label: avion @fr

soccer player
type: Class
label: joueur de football @fr

links to Canadian Football League
type: ObjectProperty
sub property of: organização
range: canadian football league
comment: Relazione tra Rugby Player e Canadian Football League @it
domain: rugby player
comment: Relation between Rugby Player and Canadian Football League

legislature
label: pouvoir législatif @fr
type: Class

links to Film
comment: Relazione tra Rugby Player e Film @it
sub property of: work
range: film
type: ObjectProperty
domain: rugby player
comment: Relation between Rugby Player and Film

airline
label: compagnie aérienne @fr
type: Class

golf player
label: golfeur @fr
type: Class

journalist
type: Class
label: journaliste @fr

film
label: ταινία @el
type: Class

links to President
range: president
sub property of: person
comment: Relation between Rugby Player and President
domain: rugby player
type: ObjectProperty
comment: Relazione tra Rugby Player e President @it

links to Election
domain: rugby player
range: Election
comment: Relazione tra Rugby Player e Election @it
comment: Relation between Rugby Player and Election
sub property of: event
type: ObjectProperty

american football team
type: Class
label: équipe américaine de football américain @fr

chemical compound
label: produit chimique @fr
type: ObjectProperty
type: Class

links to Historic Place
comment: Relazione tra Rugby Player e Historic Place @it
sub property of: place
range: historic place
domain: rugby player
type: ObjectProperty
comment: Relation between Rugby Player and Historic Place

Gaelic games player
label: joueur de sports gaéliques @fr
type: Class

musical artist
label: musicien @fr
type: Class
label: artista musical @pt

links to Currency
type: ObjectProperty
comment: Relation between Rugby Player and Currency
domain: rugby player
range: currency
comment: Relazione tra Rugby Player e Currency @it
sub property of: currency

links to Olympics
sub property of: event
comment: Relazione tra Rugby Player e Olympics @it
domain: rugby player
range: olympics
comment: Relation between Rugby Player and Olympics
type: ObjectProperty

park
label: parc @fr
type: Class

links to Comics Character
domain: rugby player
range: comics character
sub property of: person
type: ObjectProperty
comment: Relazione tra Rugby Player e Comics Character @it
comment: Relation between Rugby Player and Comics Character

rugby player
type: Class
label: joueur de rugby @fr

links to Hotel
comment: Relation between Rugby Player and Hotel
comment: Relazione tra Rugby Player e Hotel @it
sub property of: place
range: hotel
type: ObjectProperty
domain: rugby player

Axiom
dbpedia infobox matching weight: 100.0
annotated source: links to Military Person
annotated property: relatedMatch
annotated target: before

american football league
type: Class

cyclist
type: Class
label: cycliste @fr

place
label: lugar @pt
label: lieu @fr
label: περιοχή @el
type: ObjectProperty

links to Scientist
sub property of: person
domain: rugby player
type: ObjectProperty
comment: Relation between Rugby Player and Scientist
comment: Relazione tra Rugby Player e Scientist @it
range: scientist

infrastructure
type: ObjectProperty

Axiom
dbpedia infobox matching weight: 50.0
annotated property: relatedMatch
annotated source: links to Gaelic Games Player
annotated target: after

basketball league
type: Class
label: ligue de basketball @fr

mountain
type: Class
label: montagne @fr
label: Βουνό @el

criminal
label: criminel @fr
type: Class

links to Island
range: island
comment: Relation between Rugby Player and Island
comment: Relazione tra Rugby Player e Island @it
domain: rugby player
sub property of: place
type: ObjectProperty

links to Bridge
domain: rugby player
sub property of: place
range: bridge
type: ObjectProperty
comment: Relation between Rugby Player and Bridge
comment: Relazione tra Rugby Player e Bridge @it

saint
type: Class

comedian
label: comédien @fr
type: Class

links to Village
range: village
comment: Relazione tra Rugby Player e Village @it
type: ObjectProperty
sub property of: place
comment: Relation between Rugby Player and Village
domain: rugby player

links to Airport
type: ObjectProperty
domain: rugby player
range: airport
comment: Relation between Rugby Player and Airport
sub property of: place
comment: Relazione tra Rugby Player e Airport @it

links to Musical Artist
comment: Relation between Rugby Player and Musical Artist
domain: rugby player
range: musical artist
comment: Relazione tra Rugby Player e Musical Artist @it
sub property of: person
type: ObjectProperty

song
label: chanson @fr
type: Class

book
type: Class
label: livre @fr
label: βιβλίο @el
label: książka @pl
label: llibre @ca

links to Colour
sub property of: colour
comment: Relazione tra Rugby Player e Colour @it
domain: rugby player
comment: Relation between Rugby Player and Colour
type: ObjectProperty
range: colour

links to Tennis League
comment: Relation between Rugby Player and Tennis League
range: tennis league
comment: Relazione tra Rugby Player e Tennis League @it
domain: rugby player
type: ObjectProperty
sub property of: organização

links to Basketball Player
comment: Relation between Rugby Player and Basketball Player
type: ObjectProperty
range: basketball player
comment: Relazione tra Rugby Player e Basketball Player @it
domain: rugby player
sub property of: person

non-profit organisation
label: organisation à but non lucratif @fr
type: Class

links to Cricketer
type: ObjectProperty
sub property of: person
comment: Relazione tra Rugby Player e Cricketer @it
comment: Relation between Rugby Player and Cricketer
range: cricketer
domain: rugby player
type: NamedIndividual
related match: before

canadian football league
type: Class

rugby league
label: ligue de rugby @fr
type: Class

links to Protected Area
type: ObjectProperty
sub property of: place
range: protected area
comment: Relation between Rugby Player and Protected Area
domain: rugby player
comment: Relazione tra Rugby Player e Protected Area @it

links to Music Genre
type: NamedIndividual
related match: ruProclubs
range: music genre
comment: Relazione tra Rugby Player e Music Genre @it
comment: Relation between Rugby Player and Music Genre
domain: rugby player
type: ObjectProperty
sub property of: music genre

drug
type: Class
label: médicament @fr
type: ObjectProperty

links to Astronaut
type: ObjectProperty
sub property of: person
domain: rugby player
range: astronaut
comment: Relazione tra Rugby Player e Astronaut @it
comment: Relation between Rugby Player and Astronaut

links to Model
domain: rugby player
sub property of: person
comment: Relazione tra Rugby Player e Model @it
comment: Relation between Rugby Player and Model
range: model
type: ObjectProperty

magazine
type: Class
label: περιοδικό @el

links to Disease
domain: rugby player
comment: Relazione tra Rugby Player e Disease @it
sub property of: disease
type: ObjectProperty
comment: Relation between Rugby Player and Disease
range: disease

links to Ethnic Group
sub property of: ethnic group
type: ObjectProperty
comment: Relation between Rugby Player and Ethnic Group
range: ethnic group
comment: Relazione tra Rugby Player e Ethnic Group @it
domain: rugby player

military person
label: militaire @fr
type: Class

links to Band
sub property of: organização
range: Band
comment: Relazione tra Rugby Player e Band @it
comment: Relation between Rugby Player and Band
type: ObjectProperty
domain: rugby player
type: NamedIndividual
related match: ruProvince

links to Journalist
range: journalist
sub property of: person
comment: Relazione tra Rugby Player e Journalist @it
domain: rugby player
comment: Relation between Rugby Player and Journalist
type: ObjectProperty

award
type: Class
label: récompense @fr
type: ObjectProperty

links to Book
comment: Relation between Rugby Player and Book
range: book
sub property of: work
comment: Relazione tra Rugby Player e Book @it
type: ObjectProperty
domain: rugby player

college
type: Class

anatomical structure
type: ObjectProperty
label: structure anatomique @fr

links to Non- Profit Organisation
range: non-profit organisation
sub property of: organização
comment: Relation between Rugby Player and Non- Profit Organisation
comment: Relazione tra Rugby Player e Non- Profit Organisation @it
domain: rugby player
type: ObjectProperty

links to Basketball League
sub property of: organização
comment: Relazione tra Rugby Player e Basketball League @it
type: ObjectProperty
comment: Relation between Rugby Player and Basketball League
domain: rugby player
range: basketball league

cricketer
type: Class
label: joueur de cricket @fr

single
type: Class

Band
label: banda @pt
label: Musikgruppe @de
type: Class
label: groupe de musique @fr

town
type: Class
label: ville @fr

links to Hospital
sub property of: place
comment: Relazione tra Rugby Player e Hospital @it
range: hospital
domain: rugby player
type: ObjectProperty
comment: Relation between Rugby Player and Hospital
type: NamedIndividual
related match: university

links to Tennis Player
type: ObjectProperty
comment: Relazione tra Rugby Player e Tennis Player @it
comment: Relation between Rugby Player and Tennis Player
sub property of: person
range: tennis player
domain: rugby player

university
label: πανεπιστήμιο @el
label: université @fr
type: Class

RugbyPlayer.owl
extracted from: en.wikipedia.org
has intent: To represent the encyclopedic knowledge expressed by an object typed as RugbyPlayer
imports: cpannotationschema.owl
comment: RugbyPlayer Encyclopedic Knowledge Pattern
extracted from: dbpedia.org
has author: Aldo Gangemi
has author: Andrea Giovanni Nuzzolese
has author: Valentina Presutti
imports: dbpediainfoboxmatchingweight.owl
type: Ontology

links to Language
type: ObjectProperty
domain: rugby player
sub property of: language
comment: Relazione tra Rugby Player e Language @it
range: language
comment: Relation between Rugby Player and Language

links to Cyclist
comment: Relazione tra Rugby Player e Cyclist @it
range: cyclist
sub property of: person
domain: rugby player
comment: Relation between Rugby Player and Cyclist
type: ObjectProperty

ethnic group
type: Class
type: ObjectProperty
label: groupe ethnique @fr

Axiom
dbpedia infobox matching weight: 100.0
annotated property: relatedMatch
annotated target: university
annotated source: links to Hospital

links to Boxer
comment: Relation between Rugby Player and Boxer
comment: Relazione tra Rugby Player e Boxer @it
type: ObjectProperty
sub property of: person
range: boxer
domain: rugby player

links to Prime Minister
type: ObjectProperty
comment: Relazione tra Rugby Player e Prime Minister @it
domain: rugby player
range: prime minister
sub property of: person
comment: Relation between Rugby Player and Prime Minister

links to Video Game
domain: rugby player
comment: Relation between Rugby Player and Video Game
range: video game
type: ObjectProperty
sub property of: work
comment: Relazione tra Rugby Player e Video Game @it

hotel
type: Class
label: hôtel @fr

links to Bone
comment: Relazione tra Rugby Player e Bone @it
domain: rugby player
comment: Relation between Rugby Player and Bone
type: ObjectProperty
sub property of: anatomical structure
range: bone

college coach
type: Class
label: entraîneur universitaire @fr

muscle
type: Class

links to American Football League
type: ObjectProperty
sub property of: organização
comment: Relazione tra Rugby Player e American Football League @it
domain: rugby player
comment: Relation between Rugby Player and American Football League
range: american football league

links to Lake
comment: Relation between Rugby Player and Lake
range: lake
sub property of: place
domain: rugby player
type: ObjectProperty
comment: Relazione tra Rugby Player e Lake @it

village
label: χωριό @el
type: Class

links to Beverage
sub property of: beverage
range: beverage
type: ObjectProperty
domain: rugby player
comment: Relazione tra Rugby Player e Beverage @it
comment: Relation between Rugby Player and Beverage

soccer club
type: Class
label: club de football @fr

historic building
type: Class
label: bâtiment historique @fr

links to Olympic Result
sub property of: olympic result
comment: Relation between Rugby Player and Olympic Result
range: olympic result
domain: rugby player
comment: Relazione tra Rugby Player e Olympic Result @it
type: ObjectProperty

office holder
label: titulaire @fr
label: Amtsinhaber @de
type: Class

baseball player
type: Class
label: joueur de baseball @fr

Axiom
dbpedia infobox matching weight: 100.0
annotated target: university
annotated source: links to College
annotated property: relatedMatch

military conflict
label: conflit militaire @fr
type: Class

website
label: Ιστότοπος @el
label: site web @fr
type: Class
type: ObjectProperty

links to Broadcast
domain: rugby player
comment: Relation between Rugby Player and Broadcast
range: broadcast
sub property of: organização
type: ObjectProperty
comment: Relazione tra Rugby Player e Broadcast @it

links to Legislature
range: legislature
comment: Relazione tra Rugby Player e Legislature @it
sub property of: organização
comment: Relation between Rugby Player and Legislature
domain: rugby player
type: ObjectProperty

basketball player
type: Class
label: joueur de basketball @fr

adult actor
label: acteur adulte @fr
type: Class
label: erwachsener Schauspieler @de

links to American Football Team
comment: Relazione tra Rugby Player e American Football Team @it
range: american football team
type: ObjectProperty
sub property of: organização
comment: Relation between Rugby Player and American Football Team
domain: rugby player

links to Aircraft
range: aircraft
type: ObjectProperty
comment: Relazione tra Rugby Player e Aircraft @it
comment: Relation between Rugby Player and Aircraft
domain: rugby player
sub property of: mean of transportation

links to Magazine
sub property of: work
type: ObjectProperty
comment: Relation between Rugby Player and Magazine
range: magazine
domain: rugby player
comment: Relazione tra Rugby Player e Magazine @it

links to Member Of Parliament
comment: Relazione tra Rugby Player e Member Of Parliament @it
domain: rugby player
sub property of: person
comment: Relation between Rugby Player and Member Of Parliament
range: member of parliament
type: ObjectProperty

mountain range
label: chaîne de montagne @fr
type: Class

beverage
type: ObjectProperty
type: Class
label: boisson @fr

links to Soccer Player
comment: Relazione tra Rugby Player e Soccer Player @it
range: soccer player
type: ObjectProperty
domain: rugby player
sub property of: person
comment: Relation between Rugby Player and Soccer Player

links to Website
domain: rugby player
comment: Relation between Rugby Player and Website
comment: Relazione tra Rugby Player e Website @it
sub property of: website
type: ObjectProperty
range: website

Axiom
dbpedia infobox matching weight: 100.0
annotated property: relatedMatch
annotated source: links to Military Unit
annotated target: occupation

links to Mountain
range: mountain
comment: Relazione tra Rugby Player e Mountain @it
sub property of: place
type: ObjectProperty
domain: rugby player
comment: Relation between Rugby Player and Mountain

links to Canadian Football Team
type: ObjectProperty
domain: rugby player
comment: Relazione tra Rugby Player e Canadian Football Team @it
comment: Relation between Rugby Player and Canadian Football Team
range: canadian football team
sub property of: organização

links to Newspaper
range: newspaper
comment: Relazione tra Rugby Player e Newspaper @it
type: ObjectProperty
comment: Relation between Rugby Player and Newspaper
sub property of: work
domain: rugby player

scientist
label: Wissenschaftler @de
type: Class
label: scientifique @fr

badminton player
type: Class
label: joueur de badminton @fr

olympics
label: Jeux Olympiques @fr
type: Class

links to Wrestler
range: wrestler
comment: Relazione tra Rugby Player e Wrestler @it
comment: Relation between Rugby Player and Wrestler
type: ObjectProperty
domain: rugby player
sub property of: person

organização
type: ObjectProperty
label: organisation
label: Organisation @de

bridge
type: Class
label: pont @fr

links to Ship
type: ObjectProperty
range: ship
comment: Relation between Rugby Player and Ship
sub property of: mean of transportation
domain: rugby player
comment: Relazione tra Rugby Player e Ship @it

plant
type: Class
label: plante @fr

broadcast
type: Class
label: Émission de télévision @fr

links to Judge
comment: Relazione tra Rugby Player e Judge @it
sub property of: person
domain: rugby player
type: ObjectProperty
range: judge
comment: Relation between Rugby Player and Judge

Axiom
dbpedia infobox matching weight: 100.0
annotated source: links to Rugby League
annotated target: ruSevensnationalcomp
annotated property: relatedMatch

mammal
type: Class
label: mammifère @fr

island
label: île @fr
label: νησί @el
type: Class

comics character
type: Class
label: personnage de bandes dessinées @fr

event
type: ObjectProperty
label: évènement @fr

links to College Coach
domain: rugby player
sub property of: person
type: ObjectProperty
comment: Relation between Rugby Player and College Coach
range: college coach
comment: Relazione tra Rugby Player e College Coach @it

radio station
type: Class
label: station de radio @fr

bone
label: os @fr
label: Knochen @de
type: Class

member of parliament
label: membre du Parlement @fr
type: Class

links to Military Conflict
comment: Relation between Rugby Player and Military Conflict
domain: rugby player
sub property of: event
comment: Relazione tra Rugby Player e Military Conflict @it
range: military conflict
type: ObjectProperty

airport
label: aéroport @fr
label: Flughafen @de
type: Class