links to Website
range: website
domain: shopping mall
sub property of: website
type: ObjectProperty
comment: Relation between Shopping Mall and Website
comment: Relazione tra Shopping Mall e Website @it

links to Journalist
domain: shopping mall
type: ObjectProperty
comment: Relation between Shopping Mall and Journalist
range: journalist
sub property of: person
comment: Relazione tra Shopping Mall e Journalist @it

television show
type: Class
label: émission de télévision @fr

disease
type: ObjectProperty
type: Class
label: maladie @fr

links to Monument
range: monument
type: ObjectProperty
comment: Relation between Shopping Mall and Monument
comment: Relazione tra Shopping Mall e Monument @it
sub property of: place
domain: shopping mall

automobile
type: Class

colour
type: ObjectProperty
label: χρώμα @el
label: couleur @fr
type: Class

links to Trade Union
range: trade union
type: ObjectProperty
comment: Relation between Shopping Mall and Trade Union
comment: Relazione tra Shopping Mall e Trade Union @it
sub property of: organização
domain: shopping mall

links to Baseball Player
sub property of: person
comment: Relation between Shopping Mall and Baseball Player
type: ObjectProperty
range: baseball player
comment: Relazione tra Shopping Mall e Baseball Player @it
domain: shopping mall

links to Governor
sub property of: person
comment: Relazione tra Shopping Mall e Governor @it
type: ObjectProperty
range: governor
domain: shopping mall
comment: Relation between Shopping Mall and Governor

mean of transportation
label: moyen de transport @fr
type: ObjectProperty

american football player
label: joueur de football américain @fr
type: Class

links to Airline
comment: Relation between Shopping Mall and Airline
type: ObjectProperty
domain: shopping mall
comment: Relazione tra Shopping Mall e Airline @it
range: airline
sub property of: organização

links to Office Holder
domain: shopping mall
comment: Relation between Shopping Mall and Office Holder
sub property of: person
comment: Relazione tra Shopping Mall e Office Holder @it
range: office holder
type: ObjectProperty

stadium
type: Class
label: stade @fr

wrestler
label: lutteur @fr
type: Class

links to Bird
comment: Relazione tra Shopping Mall e Bird @it
type: ObjectProperty
sub property of: species
comment: Relation between Shopping Mall and Bird
range: bird
domain: shopping mall

mayor
type: Class
label: maire @fr

species
type: ObjectProperty
label: espèce @fr

newspaper
label: journal @fr
type: Class

protected area
type: Class
label: προστατευμένη περιοχή @el
label: aire protégée @fr

boxer
type: Class
label: boxeur @fr

World Heritage Site
type: Class
label: site du patrimoine mondial @fr

links to Flowering Plant
type: ObjectProperty
domain: shopping mall
comment: Relation between Shopping Mall and Flowering Plant
sub property of: species
comment: Relazione tra Shopping Mall e Flowering Plant @it
range: flowering plant

station
type: Class

language
type: Class
label: langage @fr
type: ObjectProperty

Axiom
dbpedia infobox matching weight: 100.0
annotated target: location
annotated property: relatedMatch
annotated source: links to Village

tennis league
label: ligue de tennis @fr
type: Class

lake
type: Class
label: lac @fr

links to Musical
sub property of: work
type: ObjectProperty
comment: Relation between Shopping Mall and Musical
domain: shopping mall
comment: Relazione tra Shopping Mall e Musical @it
range: musical

links to Criminal
range: criminal
domain: shopping mall
type: ObjectProperty
comment: Relazione tra Shopping Mall e Criminal @it
comment: Relation between Shopping Mall and Criminal
sub property of: person

links to Park
comment: Relazione tra Shopping Mall e Park @it
sub property of: place
domain: shopping mall
type: ObjectProperty
comment: Relation between Shopping Mall and Park
range: park

governor
type: Class
label: gouverneur @fr

links to Nascar Driver
type: ObjectProperty
sub property of: person
domain: shopping mall
range: nascar driver
comment: Relation between Shopping Mall and Nascar Driver
comment: Relazione tra Shopping Mall e Nascar Driver @it

work
type: ObjectProperty
label: travail @fr
label: obra @pt

river
label: rivière @fr
type: Class

links to Architect
range: architect
comment: Relation between Shopping Mall and Architect
type: ObjectProperty
sub property of: person
domain: shopping mall
comment: Relazione tra Shopping Mall e Architect @it

school
type: Class
label: école @fr

fish
type: Class
label: poisson @fr

museum
type: Class
label: musée @fr

ship
label: navire @fr
type: Class

tennis player
label: joueur de tennis @fr
type: Class

links to Christian Bishop
sub property of: person
range: Christian Bishop
comment: Relazione tra Shopping Mall e Christian Bishop @it
type: ObjectProperty
domain: shopping mall
comment: Relation between Shopping Mall and Christian Bishop

video game
label: jeux vidéo @fr
type: Class

links to Video Game
range: video game
type: ObjectProperty
sub property of: work
domain: shopping mall
comment: Relation between Shopping Mall and Video Game
comment: Relazione tra Shopping Mall e Video Game @it

trade union
label: syndicat professionnel @fr
type: Class

Axiom
dbpedia infobox matching weight: 100.0
annotated source: links to Writer
annotated property: relatedMatch
annotated target: source

currency
label: devise @fr
type: Class
type: ObjectProperty

British royalty
label: royauté Britannique @fr
type: Class

prime minister
label: premier ministre @fr
type: Class

historic place
type: Class
label: site historique @fr

hospital
label: hôpital @fr
type: Class

monument
type: Class

links to Currency
comment: Relazione tra Shopping Mall e Currency @it
type: ObjectProperty
comment: Relation between Shopping Mall and Currency
range: currency
domain: shopping mall
sub property of: currency

links to Wrestler
type: ObjectProperty
range: wrestler
sub property of: person
comment: Relazione tra Shopping Mall e Wrestler @it
comment: Relation between Shopping Mall and Wrestler
domain: shopping mall

links to Basketball Player
sub property of: person
comment: Relazione tra Shopping Mall e Basketball Player @it
domain: shopping mall
comment: Relation between Shopping Mall and Basketball Player
range: basketball player
type: ObjectProperty

links to Model
comment: Relazione tra Shopping Mall e Model @it
comment: Relation between Shopping Mall and Model
domain: shopping mall
sub property of: person
type: ObjectProperty
range: model

links to Album
domain: shopping mall
range: album
type: ObjectProperty
sub property of: work
comment: Relazione tra Shopping Mall e Album @it
comment: Relation between Shopping Mall and Album

links to Continent
sub property of: place
comment: Relazione tra Shopping Mall e Continent @it
range: continent
domain: shopping mall
comment: Relation between Shopping Mall and Continent
type: ObjectProperty

continent
type: Class
label: ήπειρος @el

links to Drug
domain: shopping mall
type: ObjectProperty
comment: Relazione tra Shopping Mall e Drug @it
comment: Relation between Shopping Mall and Drug
range: drug
sub property of: drug

links to Broadcast
domain: shopping mall
range: broadcast
sub property of: organização
comment: Relation between Shopping Mall and Broadcast
comment: Relazione tra Shopping Mall e Broadcast @it
type: ObjectProperty

president
label: président @fr
type: Class

album
type: Class
label: Album @de

figure skater
type: Class
label: patineur artistique @fr

links to Island
range: island
sub property of: place
comment: Relation between Shopping Mall and Island
comment: Relazione tra Shopping Mall e Island @it
domain: shopping mall
type: ObjectProperty

links to Language
type: ObjectProperty
comment: Relazione tra Shopping Mall e Language @it
sub property of: language
comment: Relation between Shopping Mall and Language
range: language
domain: shopping mall

links to Skyscraper
sub property of: place
comment: Relazione tra Shopping Mall e Skyscraper @it
comment: Relation between Shopping Mall and Skyscraper
domain: shopping mall
range: skyscraper
type: ObjectProperty

person
label: Person @de
type: ObjectProperty
label: pessoa @pt
label: personne @fr

military unit
type: Class
label: unité militaire @fr

ShoppingMall.owl
extracted from: en.wikipedia.org
has intent: To represent the encyclopedic knowledge expressed by an object typed as ShoppingMall
type: Ontology
has author: Andrea Giovanni Nuzzolese
has author: Aldo Gangemi
comment: ShoppingMall Encyclopedic Knowledge Pattern
imports: cpannotationschema.owl
imports: dbpediainfoboxmatchingweight.owl
extracted from: dbpedia.org
has author: Valentina Presutti

links to Film Festival
type: ObjectProperty
comment: Relazione tra Shopping Mall e Film Festival @it
comment: Relation between Shopping Mall and Film Festival
range: film festival
sub property of: event
domain: shopping mall

basketball team
type: Class

links to Ship
comment: Relation between Shopping Mall and Ship
comment: Relazione tra Shopping Mall e Ship @it
domain: shopping mall
sub property of: mean of transportation
type: ObjectProperty
range: ship

music genre
type: Class
label: género musical @pt
type: ObjectProperty
label: genre musical @fr

writer
label: écrivain @fr
type: Class

links to Stadium
comment: Relazione tra Shopping Mall e Stadium @it
domain: shopping mall
range: stadium
type: ObjectProperty
sub property of: place
comment: Relation between Shopping Mall and Stadium

architect
label: architecte @fr
type: Class

model
label: mannequin @fr
type: Class

film festival
label: festival du film @fr
type: Class

links to Monarch
comment: Relazione tra Shopping Mall e Monarch @it
domain: shopping mall
sub property of: person
comment: Relation between Shopping Mall and Monarch
range: monarch
type: ObjectProperty

links to Basketball Team
range: basketball team
comment: Relation between Shopping Mall and Basketball Team
sub property of: organização
type: ObjectProperty
comment: Relazione tra Shopping Mall e Basketball Team @it
domain: shopping mall

links to Film
range: film
comment: Relazione tra Shopping Mall e Film @it
type: ObjectProperty
domain: shopping mall
sub property of: work
comment: Relation between Shopping Mall and Film

hockey team
label: équipe de hockey @fr
type: Class

links to Ice Hockey Player
comment: Relazione tra Shopping Mall e Ice Hockey Player @it
range: ice hockey player
type: ObjectProperty
sub property of: person
comment: Relation between Shopping Mall and Ice Hockey Player
domain: shopping mall

links to Senator
comment: Relation between Shopping Mall and Senator
domain: shopping mall
range: senator
type: ObjectProperty
comment: Relazione tra Shopping Mall e Senator @it
sub property of: person

links to Philosopher
sub property of: person
range: philosopher
comment: Relazione tra Shopping Mall e Philosopher @it
domain: shopping mall
comment: Relation between Shopping Mall and Philosopher
type: ObjectProperty

legislature
label: pouvoir législatif @fr
type: Class

links to Congressman
comment: Relazione tra Shopping Mall e Congressman @it
type: ObjectProperty
sub property of: person
comment: Relation between Shopping Mall and Congressman
range: congressman
domain: shopping mall

links to Boxer
comment: Relazione tra Shopping Mall e Boxer @it
domain: shopping mall
range: boxer
sub property of: person
comment: Relation between Shopping Mall and Boxer
type: ObjectProperty

airline
label: compagnie aérienne @fr
type: Class

monarch
label: monarque @fr
type: Class

links to Television Show
range: television show
sub property of: work
domain: shopping mall
type: ObjectProperty
comment: Relation between Shopping Mall and Television Show
comment: Relazione tra Shopping Mall e Television Show @it

congressman
type: Class
label: membre du Congrès @fr

nascar driver
type: Class
label: pilote de la nascar @fr

activity
label: activité @fr
label: Aktivität @de
type: ObjectProperty

links to Mountain Range
type: ObjectProperty
sub property of: place
domain: shopping mall
range: mountain range
comment: Relation between Shopping Mall and Mountain Range
comment: Relazione tra Shopping Mall e Mountain Range @it

journalist
type: Class
label: journaliste @fr

links to Magazine
comment: Relazione tra Shopping Mall e Magazine @it
sub property of: work
comment: Relation between Shopping Mall and Magazine
range: magazine
type: ObjectProperty
domain: shopping mall

insect
type: Class
label: insecte @fr

film
label: ταινία @el
type: Class

links to Band
range: Band
comment: Relazione tra Shopping Mall e Band @it
domain: shopping mall
comment: Relation between Shopping Mall and Band
type: ObjectProperty
sub property of: organização

american football team
type: Class
label: équipe américaine de football américain @fr

links to Comics Character
comment: Relazione tra Shopping Mall e Comics Character @it
range: comics character
domain: shopping mall
type: ObjectProperty
sub property of: person
comment: Relation between Shopping Mall and Comics Character

bird
type: Class
label: oiseau @fr

chemical compound
label: produit chimique @fr
type: ObjectProperty
type: Class

links to Tennis League
type: ObjectProperty
sub property of: organização
range: tennis league
comment: Relation between Shopping Mall and Tennis League
domain: shopping mall
comment: Relazione tra Shopping Mall e Tennis League @it

links to River
range: river
comment: Relazione tra Shopping Mall e River @it
domain: shopping mall
sub property of: place
comment: Relation between Shopping Mall and River
type: ObjectProperty

links to Military Conflict
type: ObjectProperty
comment: Relation between Shopping Mall and Military Conflict
domain: shopping mall
comment: Relazione tra Shopping Mall e Military Conflict @it
sub property of: event
range: military conflict

musical artist
label: artista musical @pt
type: Class
label: musicien @fr

links to British Royalty
domain: shopping mall
range: British royalty
sub property of: person
type: ObjectProperty
comment: Relation between Shopping Mall and British Royalty
comment: Relazione tra Shopping Mall e British Royalty @it

links to Insect
domain: shopping mall
comment: Relation between Shopping Mall and Insect
range: insect
type: ObjectProperty
comment: Relazione tra Shopping Mall e Insect @it
sub property of: species

links to Canal
sub property of: place
comment: Relation between Shopping Mall and Canal
type: ObjectProperty
domain: shopping mall
range: canal
comment: Relazione tra Shopping Mall e Canal @it

park
type: Class
label: parc @fr

links to Basketball League
type: ObjectProperty
comment: Relazione tra Shopping Mall e Basketball League @it
sub property of: organização
comment: Relation between Shopping Mall and Basketball League
range: basketball league
domain: shopping mall

links to Tennis Player
domain: shopping mall
range: tennis player
comment: Relazione tra Shopping Mall e Tennis Player @it
sub property of: person
type: ObjectProperty
comment: Relation between Shopping Mall and Tennis Player

links to Legislature
sub property of: organização
comment: Relazione tra Shopping Mall e Legislature @it
comment: Relation between Shopping Mall and Legislature
range: legislature
domain: shopping mall
type: ObjectProperty

musical
type: Class
label: musique @fr

links to Lake
domain: shopping mall
type: ObjectProperty
sub property of: place
comment: Relation between Shopping Mall and Lake
range: lake
comment: Relazione tra Shopping Mall e Lake @it

actor
label: acteur @fr
type: Class
label: Schauspieler @de

links to Music Genre
domain: shopping mall
type: ObjectProperty
comment: Relation between Shopping Mall and Music Genre
comment: Relazione tra Shopping Mall e Music Genre @it
range: music genre
sub property of: music genre

place
label: lugar @pt
label: lieu @fr
label: περιοχή @el
type: ObjectProperty

links to Actor
comment: Relation between Shopping Mall and Actor
sub property of: person
domain: shopping mall
comment: Relazione tra Shopping Mall e Actor @it
type: ObjectProperty
range: actor

basketball league
label: ligue de basketball @fr
type: Class

mountain
label: Βουνό @el
label: montagne @fr
type: Class

links to Single
type: ObjectProperty
domain: shopping mall
sub property of: work
comment: Relazione tra Shopping Mall e Single @it
comment: Relation between Shopping Mall and Single
range: single

criminal
label: criminel @fr
type: Class

flowering plant
type: Class
label: angiospermes @fr

links to Museum
sub property of: place
comment: Relazione tra Shopping Mall e Museum @it
range: museum
type: ObjectProperty
domain: shopping mall
comment: Relation between Shopping Mall and Museum

links to Ice Hockey League
comment: Relation between Shopping Mall and Ice Hockey League
sub property of: organização
type: ObjectProperty
range: ice hockey league
comment: Relazione tra Shopping Mall e Ice Hockey League @it
domain: shopping mall

senator
type: Class
label: sénateur @fr

comedian
label: comédien @fr
type: Class

links to Ski Area
domain: shopping mall
comment: Relazione tra Shopping Mall e Ski Area @it
comment: Relation between Shopping Mall and Ski Area
sub property of: place
range: ski area
type: ObjectProperty

links to Ethnic Group
comment: Relazione tra Shopping Mall e Ethnic Group @it
range: ethnic group
comment: Relation between Shopping Mall and Ethnic Group
domain: shopping mall
sub property of: ethnic group
type: ObjectProperty

book
label: książka @pl
label: llibre @ca
label: βιβλίο @el
label: livre @fr
type: Class

device
type: ObjectProperty
label: appareil @fr

shopping mall
type: Class
label: centre commercial @fr

links to Prime Minister
comment: Relazione tra Shopping Mall e Prime Minister @it
type: ObjectProperty
range: prime minister
comment: Relation between Shopping Mall and Prime Minister
domain: shopping mall
sub property of: person

ski area
label: domaine skiable @fr
type: Class

links to Military Unit
range: military unit
domain: shopping mall
comment: Relation between Shopping Mall and Military Unit
sub property of: organização
type: ObjectProperty
comment: Relazione tra Shopping Mall e Military Unit @it

non-profit organisation
label: organisation à but non lucratif @fr
type: Class

links to Newspaper
range: newspaper
comment: Relazione tra Shopping Mall e Newspaper @it
domain: shopping mall
sub property of: work
comment: Relation between Shopping Mall and Newspaper
type: ObjectProperty

links to Mayor
sub property of: person
range: mayor
domain: shopping mall
comment: Relation between Shopping Mall and Mayor
type: ObjectProperty
comment: Relazione tra Shopping Mall e Mayor @it

links to Station
range: station
sub property of: place
comment: Relazione tra Shopping Mall e Station @it
comment: Relation between Shopping Mall and Station
type: ObjectProperty
domain: shopping mall

links to Figure Skater
type: ObjectProperty
comment: Relazione tra Shopping Mall e Figure Skater @it
domain: shopping mall
range: figure skater
comment: Relation between Shopping Mall and Figure Skater
sub property of: person

weapon
type: Class
label: arme @fr

links to Musical Artist
comment: Relation between Shopping Mall and Musical Artist
comment: Relazione tra Shopping Mall e Musical Artist @it
range: musical artist
sub property of: person
domain: shopping mall
type: ObjectProperty

drug
type: ObjectProperty
label: médicament @fr
type: Class

links to Hockey Team
sub property of: organização
comment: Relazione tra Shopping Mall e Hockey Team @it
type: ObjectProperty
range: hockey team
comment: Relation between Shopping Mall and Hockey Team
domain: shopping mall

links to Village
related match: location
type: NamedIndividual
comment: Relazione tra Shopping Mall e Village @it
sub property of: place
comment: Relation between Shopping Mall and Village
type: ObjectProperty
domain: shopping mall
range: village

links to Book
domain: shopping mall
comment: Relazione tra Shopping Mall e Book @it
range: book
type: ObjectProperty
comment: Relation between Shopping Mall and Book
sub property of: work

magazine
label: περιοδικό @el
type: Class

canal
type: Class

links to Hospital
range: hospital
comment: Relazione tra Shopping Mall e Hospital @it
sub property of: place
comment: Relation between Shopping Mall and Hospital
type: ObjectProperty
domain: shopping mall

military person
type: Class
label: militaire @fr

philosopher
label: philosophe @fr
type: Class

links to Writer
type: NamedIndividual
related match: source
comment: Relation between Shopping Mall and Writer
comment: Relazione tra Shopping Mall e Writer @it
sub property of: person
type: ObjectProperty
domain: shopping mall
range: writer

links to Town
sub property of: place
comment: Relation between Shopping Mall and Town
domain: shopping mall
range: town
comment: Relazione tra Shopping Mall e Town @it
type: ObjectProperty

locomotive
type: Class

sport
type: Class

restaurant
type: Class

links to Golf League
domain: shopping mall
comment: Relazione tra Shopping Mall e Golf League @it
type: ObjectProperty
range: golf league
comment: Relation between Shopping Mall and Golf League
sub property of: organização

single
type: Class

Band
label: groupe de musique @fr
type: Class
label: Musikgruppe @de
label: banda @pt

town
type: Class
label: ville @fr

links to Bridge
sub property of: place
range: bridge
domain: shopping mall
comment: Relazione tra Shopping Mall e Bridge @it
type: ObjectProperty
comment: Relation between Shopping Mall and Bridge

university
label: πανεπιστήμιο @el
label: université @fr
type: Class

links to Olympics
comment: Relazione tra Shopping Mall e Olympics @it
domain: shopping mall
type: ObjectProperty
sub property of: event
range: olympics
comment: Relation between Shopping Mall and Olympics

ethnic group
type: Class
type: ObjectProperty
label: groupe ethnique @fr

links to Historic Building
sub property of: place
type: ObjectProperty
range: historic building
comment: Relation between Shopping Mall and Historic Building
domain: shopping mall
comment: Relazione tra Shopping Mall e Historic Building @it

links to World Heritage Site
sub property of: place
range: World Heritage Site
comment: Relazione tra Shopping Mall e World Heritage Site @it
comment: Relation between Shopping Mall and World Heritage Site
type: ObjectProperty
domain: shopping mall

hotel
label: hôtel @fr
type: Class

links to Restaurant
comment: Relation between Shopping Mall and Restaurant
range: restaurant
domain: shopping mall
type: ObjectProperty
sub property of: place
comment: Relazione tra Shopping Mall e Restaurant @it

television episode
type: Class
label: épisode télévisé @fr

links to Sport
range: sport
sub property of: activity
type: ObjectProperty
comment: Relation between Shopping Mall and Sport
domain: shopping mall
comment: Relazione tra Shopping Mall e Sport @it

village
type: Class
label: χωριό @el

ice hockey league
label: ligue d'hockey sur glace @fr
type: Class

links to Disease
range: disease
comment: Relazione tra Shopping Mall e Disease @it
comment: Relation between Shopping Mall and Disease
domain: shopping mall
sub property of: disease
type: ObjectProperty

soccer club
type: Class
label: club de football @fr

links to Mountain
domain: shopping mall
sub property of: place
comment: Relazione tra Shopping Mall e Mountain @it
comment: Relation between Shopping Mall and Mountain
type: ObjectProperty
range: mountain

historic building
type: Class
label: bâtiment historique @fr

office holder
label: titulaire @fr
type: Class
label: Amtsinhaber @de

baseball player
label: joueur de baseball @fr
type: Class

military conflict
label: conflit militaire @fr
type: Class

website
type: ObjectProperty
type: Class
label: site web @fr
label: Ιστότοπος @el

links to Locomotive
range: locomotive
comment: Relazione tra Shopping Mall e Locomotive @it
domain: shopping mall
comment: Relation between Shopping Mall and Locomotive
sub property of: mean of transportation
type: ObjectProperty

basketball player
label: joueur de basketball @fr
type: Class

links to Radio Station
comment: Relation between Shopping Mall and Radio Station
type: ObjectProperty
sub property of: organização
range: radio station
comment: Relazione tra Shopping Mall e Radio Station @it
domain: shopping mall

links to Comedian
type: ObjectProperty
sub property of: person
comment: Relation between Shopping Mall and Comedian
domain: shopping mall
comment: Relazione tra Shopping Mall e Comedian @it
range: comedian

ice hockey player
type: Class
label: joueur de hockey sur glace @fr

mountain range
type: Class
label: chaîne de montagne @fr

Christian Bishop
label: évêque chrétien @fr
type: Class

beverage
label: boisson @fr
type: Class
type: ObjectProperty

links to Hotel
comment: Relazione tra Shopping Mall e Hotel @it
sub property of: place
comment: Relation between Shopping Mall and Hotel
domain: shopping mall
type: ObjectProperty
range: hotel

links to Airport
domain: shopping mall
comment: Relazione tra Shopping Mall e Airport @it
type: ObjectProperty
comment: Relation between Shopping Mall and Airport
range: airport
sub property of: place

links to Military Person
sub property of: person
domain: shopping mall
comment: Relazione tra Shopping Mall e Military Person @it
range: military person
comment: Relation between Shopping Mall and Military Person
type: ObjectProperty

links to Historic Place
range: historic place
comment: Relation between Shopping Mall and Historic Place
comment: Relazione tra Shopping Mall e Historic Place @it
sub property of: place
type: ObjectProperty
domain: shopping mall

planet
type: Class
label: planète @fr
type: ObjectProperty

links to Non- Profit Organisation
comment: Relazione tra Shopping Mall e Non- Profit Organisation @it
domain: shopping mall
type: ObjectProperty
range: non-profit organisation
comment: Relation between Shopping Mall and Non- Profit Organisation
sub property of: organização

links to Automobile
comment: Relazione tra Shopping Mall e Automobile @it
comment: Relation between Shopping Mall and Automobile
domain: shopping mall
type: ObjectProperty
sub property of: mean of transportation
range: automobile

golf league
type: Class
label: ligue de golf @fr

olympics
type: Class
label: Jeux Olympiques @fr

links to President
comment: Relazione tra Shopping Mall e President @it
sub property of: person
type: ObjectProperty
comment: Relation between Shopping Mall and President
range: president
domain: shopping mall

links to Member Of Parliament
sub property of: person
type: ObjectProperty
comment: Relation between Shopping Mall and Member Of Parliament
range: member of parliament
domain: shopping mall
comment: Relazione tra Shopping Mall e Member Of Parliament @it

organização
type: ObjectProperty
label: organisation
label: Organisation @de

links to Mammal
domain: shopping mall
comment: Relazione tra Shopping Mall e Mammal @it
type: ObjectProperty
sub property of: species
comment: Relation between Shopping Mall and Mammal
range: mammal

links to Beverage
range: beverage
type: ObjectProperty
sub property of: beverage
domain: shopping mall
comment: Relazione tra Shopping Mall e Beverage @it
comment: Relation between Shopping Mall and Beverage

bridge
label: pont @fr
type: Class

links to American Football Player
comment: Relazione tra Shopping Mall e American Football Player @it
comment: Relation between Shopping Mall and American Football Player
type: ObjectProperty
range: american football player
domain: shopping mall
sub property of: person

broadcast
label: Émission de télévision @fr
type: Class

links to Weapon
range: weapon
comment: Relation between Shopping Mall and Weapon
domain: shopping mall
type: ObjectProperty
sub property of: device
comment: Relazione tra Shopping Mall e Weapon @it

links to Soccer Club
type: ObjectProperty
sub property of: organização
range: soccer club
comment: Relazione tra Shopping Mall e Soccer Club @it
domain: shopping mall
comment: Relation between Shopping Mall and Soccer Club

links to Colour
range: colour
sub property of: colour
type: ObjectProperty
comment: Relation between Shopping Mall and Colour
comment: Relazione tra Shopping Mall e Colour @it
domain: shopping mall

mammal
label: mammifère @fr
type: Class

island
type: Class
label: νησί @el
label: île @fr

links to Protected Area
sub property of: place
range: protected area
domain: shopping mall
comment: Relazione tra Shopping Mall e Protected Area @it
comment: Relation between Shopping Mall and Protected Area
type: ObjectProperty

links to University
domain: shopping mall
comment: Relazione tra Shopping Mall e University @it
sub property of: organização
comment: Relation between Shopping Mall and University
type: ObjectProperty
range: university

links to Planet
comment: Relation between Shopping Mall and Planet
comment: Relazione tra Shopping Mall e Planet @it
sub property of: planet
type: ObjectProperty
domain: shopping mall
range: planet

comics character
type: Class
label: personnage de bandes dessinées @fr

links to Fish
type: ObjectProperty
domain: shopping mall
comment: Relation between Shopping Mall and Fish
comment: Relazione tra Shopping Mall e Fish @it
sub property of: species
range: fish

links to School
domain: shopping mall
comment: Relazione tra Shopping Mall e School @it
range: school
sub property of: organização
type: ObjectProperty
comment: Relation between Shopping Mall and School

event
type: ObjectProperty
label: évènement @fr

skyscraper
type: Class
label: gratte-ciel @fr

links to Conifer
range: conifer
type: ObjectProperty
domain: shopping mall
comment: Relation between Shopping Mall and Conifer
comment: Relazione tra Shopping Mall e Conifer @it
sub property of: species

links to Television Episode
comment: Relazione tra Shopping Mall e Television Episode @it
sub property of: work
comment: Relation between Shopping Mall and Television Episode
domain: shopping mall
type: ObjectProperty
range: television episode

radio station
label: station de radio @fr
type: Class

links to American Football Team
type: ObjectProperty
sub property of: organização
comment: Relation between Shopping Mall and American Football Team
range: american football team
domain: shopping mall
comment: Relazione tra Shopping Mall e American Football Team @it

member of parliament
label: membre du Parlement @fr
type: Class

links to Chemical Compound
domain: shopping mall
comment: Relation between Shopping Mall and Chemical Compound
sub property of: chemical compound
type: ObjectProperty
range: chemical compound
comment: Relazione tra Shopping Mall e Chemical Compound @it

conifer
label: conifères @fr
type: Class

airport
label: aéroport @fr
label: Flughafen @de
type: Class