Axiom
dbpedia infobox matching weight: 100.0
annotated source: links to Stadium
annotated target: location
annotated property: relatedMatch

links to Historic Building
sub property of: place
domain: skyscraper
range: historic building
type: ObjectProperty
comment: Relazione tra Skyscraper e Historic Building @it
comment: Relation between Skyscraper and Historic Building
related match: before
type: NamedIndividual

television show
label: émission de télévision @fr
type: Class

links to Legislature
comment: Relation between Skyscraper and Legislature
sub property of: organisation
type: ObjectProperty
comment: Relazione tra Skyscraper e Legislature @it
range: legislature
domain: skyscraper

disease
type: ObjectProperty
type: Class
label: maladie @fr

links to Olympics
range: olympics
sub property of: event
domain: skyscraper
comment: Relation between Skyscraper and Olympics
comment: Relazione tra Skyscraper e Olympics @it
type: ObjectProperty

links to Musical Artist
comment: Relation between Skyscraper and Musical Artist
comment: Relazione tra Skyscraper e Musical Artist @it
range: musical artist
domain: skyscraper
sub property of: person
type: ObjectProperty

colour
type: Class
label: couleur @fr
label: χρώμα @el
type: ObjectProperty

automobile
type: Class

Election
label: élection @fr
type: Class

links to Radio Station
range: radio station
sub property of: organisation
type: ObjectProperty
domain: skyscraper
comment: Relation between Skyscraper and Radio Station
comment: Relazione tra Skyscraper e Radio Station @it

links to Governor
type: ObjectProperty
comment: Relazione tra Skyscraper e Governor @it
range: governor
domain: skyscraper
comment: Relation between Skyscraper and Governor
sub property of: person

american football player
label: joueur de football américain @fr
type: Class

mean of transportation
type: ObjectProperty
label: moyen de transport @fr

links to Judge
domain: skyscraper
sub property of: person
range: judge
comment: Relazione tra Skyscraper e Judge @it
comment: Relation between Skyscraper and Judge
type: ObjectProperty

links to Music Genre
sub property of: music genre
type: ObjectProperty
comment: Relazione tra Skyscraper e Music Genre @it
range: music genre
comment: Relation between Skyscraper and Music Genre
domain: skyscraper

Legal Case
label: cas juridique @fr
type: ObjectProperty

links to Beverage
comment: Relazione tra Skyscraper e Beverage @it
domain: skyscraper
range: beverage
comment: Relation between Skyscraper and Beverage
type: ObjectProperty
sub property of: beverage

links to Protected Area
comment: Relation between Skyscraper and Protected Area
range: protected area
type: ObjectProperty
sub property of: place
domain: skyscraper
comment: Relazione tra Skyscraper e Protected Area @it

stadium
type: Class
label: stade @fr

links to Soccer Club
sub property of: organisation
comment: Relation between Skyscraper and Soccer Club
range: soccer club
domain: skyscraper
comment: Relazione tra Skyscraper e Soccer Club @it
type: ObjectProperty

links to Lighthouse
domain: skyscraper
range: lighthouse
comment: Relation between Skyscraper and Lighthouse
sub property of: place
type: ObjectProperty
comment: Relazione tra Skyscraper e Lighthouse @it

links to Member Of Parliament
sub property of: person
type: ObjectProperty
range: member of parliament
domain: skyscraper
comment: Relazione tra Skyscraper e Member Of Parliament @it
comment: Relation between Skyscraper and Member Of Parliament

links to Power Station
sub property of: infrastructure
comment: Relation between Skyscraper and Power Station
domain: skyscraper
comment: Relazione tra Skyscraper e Power Station @it
type: ObjectProperty
range: power station

Axiom
dbpedia infobox matching weight: 27.59
annotated property: relatedMatch
annotated target: after
annotated source: links to Historic Place

links to Continent
comment: Relazione tra Skyscraper e Continent @it
sub property of: place
domain: skyscraper
type: ObjectProperty
comment: Relation between Skyscraper and Continent
range: continent

wrestler
label: lutteur @fr
type: Class

links to Museum
comment: Relazione tra Skyscraper e Museum @it
sub property of: place
range: museum
type: ObjectProperty
domain: skyscraper
comment: Relation between Skyscraper and Museum

mayor
label: maire @fr
type: Class

amphibian
label: amphibien @fr
type: Class

species
label: espèce @fr
type: ObjectProperty

links to Office Holder
comment: Relazione tra Skyscraper e Office Holder @it
domain: skyscraper
type: ObjectProperty
range: office holder
comment: Relation between Skyscraper and Office Holder
sub property of: person

links to Flowering Plant
type: ObjectProperty
domain: skyscraper
sub property of: species
range: flowering plant
comment: Relation between Skyscraper and Flowering Plant
comment: Relazione tra Skyscraper e Flowering Plant @it

newspaper
type: Class
label: journal @fr

links to Mayor
range: mayor
domain: skyscraper
comment: Relation between Skyscraper and Mayor
type: ObjectProperty
sub property of: person
comment: Relazione tra Skyscraper e Mayor @it

game
type: Class
label: jeu @fr

protected area
type: Class
label: προστατευμένη περιοχή @el
label: aire protégée @fr

road
type: Class
label: route @fr

judge
label: juge @fr
type: Class

World Heritage Site
label: site du patrimoine mondial @fr
type: Class

links to Record Label
comment: Relazione tra Skyscraper e Record Label @it
range: record label
domain: skyscraper
type: ObjectProperty
comment: Relation between Skyscraper and Record Label
sub property of: organisation

Axiom
dbpedia infobox matching weight: 66.67
annotated source: links to Hotel
annotated property: relatedMatch
annotated target: after

station
type: Class

language
type: Class
label: langage @fr
type: ObjectProperty

links to River
sub property of: place
range: river
comment: Relation between Skyscraper and River
domain: skyscraper
comment: Relazione tra Skyscraper e River @it
type: ObjectProperty

links to Trade Union
comment: Relazione tra Skyscraper e Trade Union @it
range: trade union
sub property of: organisation
domain: skyscraper
comment: Relation between Skyscraper and Trade Union
type: ObjectProperty

links to Automobile
domain: skyscraper
comment: Relazione tra Skyscraper e Automobile @it
range: automobile
type: ObjectProperty
comment: Relation between Skyscraper and Automobile
sub property of: mean of transportation

lake
type: Class
label: lac @fr

links to Station
comment: Relazione tra Skyscraper e Station @it
type: NamedIndividual
domain: skyscraper
related match: before
type: ObjectProperty
sub property of: place
comment: Relation between Skyscraper and Station
range: station
related match: after

Axiom
dbpedia infobox matching weight: 72.41
annotated property: relatedMatch
annotated target: before
annotated source: links to Historic Place

governor
type: Class
label: gouverneur @fr

links to Military Unit
range: military unit
domain: skyscraper
comment: Relazione tra Skyscraper e Military Unit @it
sub property of: organisation
type: ObjectProperty
comment: Relation between Skyscraper and Military Unit

work
type: ObjectProperty
label: travail @fr
label: obra @pt

river
label: rivière @fr
type: Class

links to Video Game
domain: skyscraper
comment: Relation between Skyscraper and Video Game
type: ObjectProperty
comment: Relazione tra Skyscraper e Video Game @it
range: video game
sub property of: work

school
label: école @fr
type: Class

ship
type: Class
label: navire @fr

museum
type: Class
label: musée @fr

tennis player
label: joueur de tennis @fr
type: Class

Axiom
dbpedia infobox matching weight: 100.0
annotated target: location
annotated property: relatedMatch
annotated source: links to Road

video game
type: Class
label: jeux vidéo @fr

trade union
label: syndicat professionnel @fr
type: Class

links to Embryology
comment: Relazione tra Skyscraper e Embryology @it
range: embryology
domain: skyscraper
sub property of: anatomical structure
type: ObjectProperty
comment: Relation between Skyscraper and Embryology

currency
label: devise @fr
type: Class
type: ObjectProperty

prime minister
label: premier ministre @fr
type: Class

British royalty
label: royauté Britannique @fr
type: Class

historic place
type: Class
label: site historique @fr

hospital
label: hôpital @fr
type: Class

links to Senator
type: ObjectProperty
range: senator
sub property of: person
comment: Relazione tra Skyscraper e Senator @it
domain: skyscraper
comment: Relation between Skyscraper and Senator

Axiom
dbpedia infobox matching weight: 50.0
annotated property: relatedMatch
annotated target: after
annotated source: links to Station

continent
label: ήπειρος @el
type: Class

links to Military Person
type: ObjectProperty
comment: Relation between Skyscraper and Military Person
comment: Relazione tra Skyscraper e Military Person @it
domain: skyscraper
sub property of: person
range: military person

president
label: président @fr
type: Class

album
type: Class
label: Album @de

Axiom
dbpedia infobox matching weight: 33.33
annotated target: before
annotated property: relatedMatch
annotated source: links to Hotel

links to Road
type: NamedIndividual
related match: location
range: road
domain: skyscraper
type: ObjectProperty
sub property of: infrastructure
comment: Relazione tra Skyscraper e Road @it
comment: Relation between Skyscraper and Road

person
label: Person @de
type: ObjectProperty
label: pessoa @pt
label: personne @fr

military unit
label: unité militaire @fr
type: Class

links to Colour
domain: skyscraper
comment: Relazione tra Skyscraper e Colour @it
type: ObjectProperty
sub property of: colour
comment: Relation between Skyscraper and Colour
range: colour

links to Bridge
range: bridge
type: ObjectProperty
sub property of: place
comment: Relazione tra Skyscraper e Bridge @it
comment: Relation between Skyscraper and Bridge
domain: skyscraper

Axiom
dbpedia infobox matching weight: 100.0
annotated property: relatedMatch
annotated source: links to University
annotated target: before

links to Actor
type: ObjectProperty
domain: skyscraper
sub property of: person
comment: Relazione tra Skyscraper e Actor @it
range: actor
comment: Relation between Skyscraper and Actor

basketball team
type: Class

Axiom
dbpedia infobox matching weight: 50.0
annotated target: before
annotated property: relatedMatch
annotated source: links to World Heritage Site

canadian football team
type: Class
label: équipe canadienne de football américain @fr

links to Single
comment: Relation between Skyscraper and Single
comment: Relazione tra Skyscraper e Single @it
type: ObjectProperty
range: single
sub property of: work
domain: skyscraper

music genre
type: Class
label: género musical @pt
type: ObjectProperty
label: genre musical @fr

links to Golf Player
range: golf player
sub property of: person
type: ObjectProperty
comment: Relation between Skyscraper and Golf Player
domain: skyscraper
comment: Relazione tra Skyscraper e Golf Player @it

writer
type: Class
label: écrivain @fr

record label
type: Class
label: label discographique @fr

architect
label: architecte @fr
type: Class

links to Saint
type: ObjectProperty
comment: Relazione tra Skyscraper e Saint @it
range: saint
sub property of: person
comment: Relation between Skyscraper and Saint
domain: skyscraper

ambassador
label: ambassadeur @fr
type: Class

links to Mountain
comment: Relazione tra Skyscraper e Mountain @it
range: mountain
type: ObjectProperty
domain: skyscraper
comment: Relation between Skyscraper and Mountain
sub property of: place

links to Lake
comment: Relazione tra Skyscraper e Lake @it
domain: skyscraper
sub property of: place
range: lake
type: ObjectProperty
comment: Relation between Skyscraper and Lake

film festival
type: Class
label: festival du film @fr

Axiom
dbpedia infobox matching weight: 100.0
annotated source: links to Park
annotated property: relatedMatch
annotated target: location

Axiom
dbpedia infobox matching weight: 100.0
annotated source: links to Historic Building
annotated target: before
annotated property: relatedMatch

links to Planet
sub property of: planet
comment: Relazione tra Skyscraper e Planet @it
comment: Relation between Skyscraper and Planet
domain: skyscraper
type: ObjectProperty
range: planet

links to Comics Creator
type: ObjectProperty
comment: Relazione tra Skyscraper e Comics Creator @it
domain: skyscraper
comment: Relation between Skyscraper and Comics Creator
range: comics creator
sub property of: person

links to Broadcast
type: ObjectProperty
comment: Relation between Skyscraper and Broadcast
sub property of: organisation
domain: skyscraper
comment: Relazione tra Skyscraper e Broadcast @it
range: broadcast

Skyscraper.owl
extracted from: dbpedia.org
type: Ontology
has intent: To represent the encyclopedic knowledge expressed by an object typed as Skyscraper
imports: cpannotationschema.owl
comment: Skyscraper Encyclopedic Knowledge Pattern
has author: Valentina Presutti
imports: dbpediainfoboxmatchingweight.owl
has author: Andrea Giovanni Nuzzolese
extracted from: en.wikipedia.org
has author: Aldo Gangemi

links to Musical
comment: Relation between Skyscraper and Musical
type: ObjectProperty
sub property of: work
comment: Relazione tra Skyscraper e Musical @it
domain: skyscraper
range: musical

lighthouse
label: phare @fr
type: Class

comics creator
label: créateur de bandes dessinées @fr
type: Class

aircraft
label: avion @fr
type: Class
label: αεροσκάφος @el

links to Congressman
comment: Relazione tra Skyscraper e Congressman @it
domain: skyscraper
type: ObjectProperty
sub property of: person
comment: Relation between Skyscraper and Congressman
range: congressman

links to Film
type: ObjectProperty
domain: skyscraper
sub property of: work
comment: Relazione tra Skyscraper e Film @it
range: film
comment: Relation between Skyscraper and Film

links to Shopping Mall
range: shopping mall
comment: Relazione tra Skyscraper e Shopping Mall @it
sub property of: place
comment: Relation between Skyscraper and Shopping Mall
domain: skyscraper
type: ObjectProperty

hockey team
label: équipe de hockey @fr
type: Class

links to University
comment: Relation between Skyscraper and University
range: university
domain: skyscraper
sub property of: organisation
comment: Relazione tra Skyscraper e University @it
type: ObjectProperty
related match: before
type: NamedIndividual

Axiom
dbpedia infobox matching weight: 50.0
annotated source: links to World Heritage Site
annotated property: relatedMatch
annotated target: after

links to Chemical Compound
range: chemical compound
sub property of: chemical compound
comment: Relation between Skyscraper and Chemical Compound
type: ObjectProperty
domain: skyscraper
comment: Relazione tra Skyscraper e Chemical Compound @it

links to Supreme Court Of The United States Case
comment: Relazione tra Skyscraper e Supreme Court Of The United States Case @it
sub property of: Legal Case
range: Supreme Court of the United States case
type: ObjectProperty
domain: skyscraper
comment: Relation between Skyscraper and Supreme Court Of The United States Case

reptile
type: Class

legislature
label: pouvoir législatif @fr
type: Class

links to Television Episode
comment: Relazione tra Skyscraper e Television Episode @it
comment: Relation between Skyscraper and Television Episode
type: ObjectProperty
domain: skyscraper
range: television episode
sub property of: work

links to World Heritage Site
range: World Heritage Site
comment: Relation between Skyscraper and World Heritage Site
domain: skyscraper
related match: before
type: ObjectProperty
related match: after
comment: Relazione tra Skyscraper e World Heritage Site @it
type: NamedIndividual
sub property of: place

airline
type: Class
label: compagnie aérienne @fr

links to Band
domain: skyscraper
comment: Relazione tra Skyscraper e Band @it
type: ObjectProperty
range: Band
comment: Relation between Skyscraper and Band
sub property of: organisation

monarch
type: Class
label: monarque @fr

links to Nascar Driver
sub property of: person
type: ObjectProperty
comment: Relazione tra Skyscraper e Nascar Driver @it
comment: Relation between Skyscraper and Nascar Driver
domain: skyscraper
range: nascar driver

congressman
type: Class
label: membre du Congrès @fr

golf player
type: Class
label: golfeur @fr

nascar driver
label: pilote de la nascar @fr
type: Class

activity
type: ObjectProperty
label: Aktivität @de
label: activité @fr

links to Village
comment: Relazione tra Skyscraper e Village @it
type: ObjectProperty
range: village
domain: skyscraper
sub property of: place
comment: Relation between Skyscraper and Village

space mission
label: mission spatiale @fr
label: διαστημική αποστολή @el
type: Class

journalist
label: journaliste @fr
type: Class

insect
type: Class
label: insecte @fr

film
label: ταινία @el
type: Class

links to Comedian
comment: Relazione tra Skyscraper e Comedian @it
range: comedian
domain: skyscraper
sub property of: person
comment: Relation between Skyscraper and Comedian
type: ObjectProperty

Axiom
dbpedia infobox matching weight: 50.0
annotated property: relatedMatch
annotated target: before
annotated source: links to Station

american football team
type: Class
label: équipe américaine de football américain @fr

links to Language
domain: skyscraper
range: language
type: ObjectProperty
comment: Relation between Skyscraper and Language
sub property of: language
comment: Relazione tra Skyscraper e Language @it

Axiom
dbpedia infobox matching weight: 100.0
annotated target: architect
annotated property: relatedMatch
annotated source: links to Architect

Supreme Court of the United States case
type: Class
label: cas juridique de la Cour suprême des États-Unis @fr

bird
type: Class
label: oiseau @fr

chemical compound
label: produit chimique @fr
type: ObjectProperty
type: Class

power station
type: Class

links to Hotel
comment: Relazione tra Skyscraper e Hotel @it
related match: after
type: ObjectProperty
comment: Relation between Skyscraper and Hotel
sub property of: place
range: hotel
related match: before
domain: skyscraper
type: NamedIndividual

links to Wrestler
comment: Relation between Skyscraper and Wrestler
comment: Relazione tra Skyscraper e Wrestler @it
range: wrestler
sub property of: person
type: ObjectProperty
domain: skyscraper

links to Scientist
domain: skyscraper
comment: Relation between Skyscraper and Scientist
comment: Relazione tra Skyscraper e Scientist @it
type: ObjectProperty
sub property of: person
range: scientist

links to Basketball League
domain: skyscraper
sub property of: organisation
type: ObjectProperty
comment: Relation between Skyscraper and Basketball League
comment: Relazione tra Skyscraper e Basketball League @it
range: basketball league

links to Ambassador
comment: Relazione tra Skyscraper e Ambassador @it
domain: skyscraper
sub property of: person
comment: Relation between Skyscraper and Ambassador
type: ObjectProperty
range: ambassador

links to Game
range: game
sub property of: activity
comment: Relazione tra Skyscraper e Game @it
domain: skyscraper
comment: Relation between Skyscraper and Game
type: ObjectProperty

links to Stadium
related match: location
type: NamedIndividual
comment: Relazione tra Skyscraper e Stadium @it
type: ObjectProperty
domain: skyscraper
range: stadium
comment: Relation between Skyscraper and Stadium
sub property of: place

fungus
label: fungi @fr
type: Class

musical artist
label: artista musical @pt
type: Class
label: musicien @fr

links to Mammal
domain: skyscraper
range: mammal
comment: Relation between Skyscraper and Mammal
type: ObjectProperty
comment: Relazione tra Skyscraper e Mammal @it
sub property of: species

links to Weapon
type: ObjectProperty
range: weapon
domain: skyscraper
comment: Relazione tra Skyscraper e Weapon @it
sub property of: device
comment: Relation between Skyscraper and Weapon

links to Space Mission
comment: Relation between Skyscraper and Space Mission
range: space mission
type: ObjectProperty
domain: skyscraper
sub property of: event
comment: Relazione tra Skyscraper e Space Mission @it

links to Tennis Player
type: ObjectProperty
comment: Relazione tra Skyscraper e Tennis Player @it
domain: skyscraper
comment: Relation between Skyscraper and Tennis Player
range: tennis player
sub property of: person

park
type: Class
label: parc @fr

links to Film Festival
comment: Relazione tra Skyscraper e Film Festival @it
domain: skyscraper
type: ObjectProperty
range: film festival
comment: Relation between Skyscraper and Film Festival
sub property of: event

links to Sport
sub property of: activity
type: ObjectProperty
comment: Relation between Skyscraper and Sport
comment: Relazione tra Skyscraper e Sport @it
range: sport
domain: skyscraper

american football league
type: Class

links to Drug
sub property of: drug
domain: skyscraper
range: drug
comment: Relation between Skyscraper and Drug
comment: Relazione tra Skyscraper e Drug @it
type: ObjectProperty

musical
label: musique @fr
type: Class

actor
label: acteur @fr
type: Class
label: Schauspieler @de

place
type: ObjectProperty
label: περιοχή @el
label: lieu @fr
label: lugar @pt

links to Hospital
comment: Relazione tra Skyscraper e Hospital @it
domain: skyscraper
range: hospital
sub property of: place
type: ObjectProperty
comment: Relation between Skyscraper and Hospital

infrastructure
type: ObjectProperty

links to Insect
range: insect
sub property of: species
comment: Relazione tra Skyscraper e Insect @it
type: ObjectProperty
comment: Relation between Skyscraper and Insect
domain: skyscraper

basketball league
type: Class
label: ligue de basketball @fr

mountain
type: Class
label: montagne @fr
label: Βουνό @el

links to Philosopher
range: philosopher
comment: Relation between Skyscraper and Philosopher
domain: skyscraper
comment: Relazione tra Skyscraper e Philosopher @it
type: ObjectProperty
sub property of: person

criminal
label: criminel @fr
type: Class

flowering plant
label: angiospermes @fr
type: Class

links to Valley
comment: Relazione tra Skyscraper e Valley @it
comment: Relation between Skyscraper and Valley
type: ObjectProperty
domain: skyscraper
range: valley
sub property of: place

senator
type: Class
label: sénateur @fr

saint
type: Class

comedian
label: comédien @fr
type: Class

valley
type: Class
label: vallée @fr

links to Town
range: town
comment: Relation between Skyscraper and Town
comment: Relazione tra Skyscraper e Town @it
sub property of: place
domain: skyscraper
type: ObjectProperty

links to Canadian Football Team
comment: Relazione tra Skyscraper e Canadian Football Team @it
range: canadian football team
domain: skyscraper
sub property of: organisation
comment: Relation between Skyscraper and Canadian Football Team
type: ObjectProperty

green alga
label: algue verte @fr
type: Class

links to American Football League
comment: Relazione tra Skyscraper e American Football League @it
sub property of: organisation
type: ObjectProperty
range: american football league
comment: Relation between Skyscraper and American Football League
domain: skyscraper

convention
label: congrès @fr
type: Class

book
label: llibre @ca
label: książka @pl
label: βιβλίο @el
label: livre @fr
type: Class

device
label: appareil @fr
type: ObjectProperty

shopping mall
type: Class
label: centre commercial @fr

links to Election
comment: Relation between Skyscraper and Election
range: Election
sub property of: event
comment: Relazione tra Skyscraper e Election @it
domain: skyscraper
type: ObjectProperty

links to Criminal
range: criminal
comment: Relazione tra Skyscraper e Criminal @it
sub property of: person
domain: skyscraper
comment: Relation between Skyscraper and Criminal
type: ObjectProperty

links to Amphibian
comment: Relazione tra Skyscraper e Amphibian @it
type: ObjectProperty
comment: Relation between Skyscraper and Amphibian
range: amphibian
domain: skyscraper
sub property of: species

links to Ice Hockey Player
sub property of: person
comment: Relation between Skyscraper and Ice Hockey Player
comment: Relazione tra Skyscraper e Ice Hockey Player @it
range: ice hockey player
domain: skyscraper
type: ObjectProperty

non-profit organisation
type: Class
label: organisation à but non lucratif @fr

links to Canal
comment: Relation between Skyscraper and Canal
comment: Relazione tra Skyscraper e Canal @it
type: ObjectProperty
domain: skyscraper
range: canal
sub property of: place

mollusca
label: mollusque @fr
type: Class

links to Island
range: island
comment: Relation between Skyscraper and Island
comment: Relazione tra Skyscraper e Island @it
type: ObjectProperty
sub property of: place
domain: skyscraper

weapon
label: arme @fr
type: Class

links to Architect
type: NamedIndividual
related match: architect
domain: skyscraper
comment: Relazione tra Skyscraper e Architect @it
sub property of: person
comment: Relation between Skyscraper and Architect
range: architect
type: ObjectProperty

drug
type: Class
label: médicament @fr
type: ObjectProperty

links to Military Conflict
sub property of: event
type: ObjectProperty
range: military conflict
domain: skyscraper
comment: Relazione tra Skyscraper e Military Conflict @it
comment: Relation between Skyscraper and Military Conflict

magazine
type: Class
label: περιοδικό @el

canal
type: Class

military person
label: militaire @fr
type: Class

links to Writer
sub property of: person
comment: Relazione tra Skyscraper e Writer @it
range: writer
comment: Relation between Skyscraper and Writer
type: ObjectProperty
domain: skyscraper

philosopher
type: Class
label: philosophe @fr

award
type: ObjectProperty
label: récompense @fr
type: Class

links to Album
type: ObjectProperty
domain: skyscraper
comment: Relazione tra Skyscraper e Album @it
range: album
sub property of: work
comment: Relation between Skyscraper and Album

links to Hockey Team
range: hockey team
domain: skyscraper
sub property of: organisation
comment: Relazione tra Skyscraper e Hockey Team @it
type: ObjectProperty
comment: Relation between Skyscraper and Hockey Team

links to Television Show
comment: Relation between Skyscraper and Television Show
domain: skyscraper
sub property of: work
type: ObjectProperty
range: television show
comment: Relazione tra Skyscraper e Television Show @it

anatomical structure
label: structure anatomique @fr
type: ObjectProperty

sport
type: Class

links to Cricketer
domain: skyscraper
range: cricketer
comment: Relazione tra Skyscraper e Cricketer @it
type: ObjectProperty
comment: Relation between Skyscraper and Cricketer
sub property of: person

restaurant
type: Class

cricketer
label: joueur de cricket @fr
type: Class

single
type: Class

links to Ship
type: ObjectProperty
range: ship
comment: Relazione tra Skyscraper e Ship @it
comment: Relation between Skyscraper and Ship
domain: skyscraper
sub property of: mean of transportation

links to Non- Profit Organisation
comment: Relazione tra Skyscraper e Non- Profit Organisation @it
domain: skyscraper
range: non-profit organisation
sub property of: organisation
type: ObjectProperty
comment: Relation between Skyscraper and Non- Profit Organisation

Band
label: groupe de musique @fr
type: Class
label: Musikgruppe @de
label: banda @pt

town
label: ville @fr
type: Class

links to American Football Team
sub property of: organisation
domain: skyscraper
comment: Relation between Skyscraper and American Football Team
type: ObjectProperty
comment: Relazione tra Skyscraper e American Football Team @it
range: american football team

links to Currency
comment: Relation between Skyscraper and Currency
comment: Relazione tra Skyscraper e Currency @it
domain: skyscraper
type: ObjectProperty
sub property of: currency
range: currency

links to Reptile
comment: Relazione tra Skyscraper e Reptile @it
type: ObjectProperty
sub property of: species
range: reptile
domain: skyscraper
comment: Relation between Skyscraper and Reptile

university
label: πανεπιστήμιο @el
label: université @fr
type: Class

ethnic group
label: groupe ethnique @fr
type: ObjectProperty
type: Class

links to President
range: president
type: ObjectProperty
comment: Relation between Skyscraper and President
sub property of: person
comment: Relazione tra Skyscraper e President @it
domain: skyscraper

embryology
type: Class
label: embryologie @fr

hotel
type: Class
label: hôtel @fr

links to Ethnic Group
comment: Relazione tra Skyscraper e Ethnic Group @it
domain: skyscraper
sub property of: ethnic group
range: ethnic group
comment: Relation between Skyscraper and Ethnic Group
type: ObjectProperty

links to Disease
comment: Relazione tra Skyscraper e Disease @it
domain: skyscraper
sub property of: disease
comment: Relation between Skyscraper and Disease
type: ObjectProperty
range: disease

links to American Football Player
comment: Relazione tra Skyscraper e American Football Player @it
sub property of: person
domain: skyscraper
comment: Relation between Skyscraper and American Football Player
range: american football player
type: ObjectProperty

links to Award
range: award
sub property of: award
comment: Relation between Skyscraper and Award
comment: Relazione tra Skyscraper e Award @it
domain: skyscraper
type: ObjectProperty

television episode
label: épisode télévisé @fr
type: Class

village
type: Class
label: χωριό @el

links to Basketball Team
comment: Relation between Skyscraper and Basketball Team
sub property of: organisation
domain: skyscraper
comment: Relazione tra Skyscraper e Basketball Team @it
type: ObjectProperty
range: basketball team

ice hockey league
label: ligue d'hockey sur glace @fr
type: Class

links to Green Alga
range: green alga
comment: Relation between Skyscraper and Green Alga
comment: Relazione tra Skyscraper e Green Alga @it
sub property of: species
domain: skyscraper
type: ObjectProperty

links to Prime Minister
range: prime minister
comment: Relazione tra Skyscraper e Prime Minister @it
comment: Relation between Skyscraper and Prime Minister
sub property of: person
domain: skyscraper
type: ObjectProperty

links to Mountain Range
comment: Relation between Skyscraper and Mountain Range
type: ObjectProperty
domain: skyscraper
sub property of: place
comment: Relazione tra Skyscraper e Mountain Range @it
range: mountain range

soccer club
label: club de football @fr
type: Class

links to Baseball League
domain: skyscraper
sub property of: organisation
comment: Relazione tra Skyscraper e Baseball League @it
range: baseball league
type: ObjectProperty
comment: Relation between Skyscraper and Baseball League

links to Fungus
comment: Relazione tra Skyscraper e Fungus @it
domain: skyscraper
range: fungus
comment: Relation between Skyscraper and Fungus
type: ObjectProperty
sub property of: species

historic building
label: bâtiment historique @fr
type: Class

links to Airport
sub property of: place
range: airport
domain: skyscraper
comment: Relation between Skyscraper and Airport
type: ObjectProperty
comment: Relazione tra Skyscraper e Airport @it

baseball player
type: Class
label: joueur de baseball @fr

office holder
type: Class
label: Amtsinhaber @de
label: titulaire @fr

military conflict
type: Class
label: conflit militaire @fr

website
label: Ιστότοπος @el
label: site web @fr
type: Class
type: ObjectProperty

links to Monarch
type: ObjectProperty
range: monarch
comment: Relation between Skyscraper and Monarch
domain: skyscraper
comment: Relazione tra Skyscraper e Monarch @it
sub property of: person

basketball player
type: Class
label: joueur de basketball @fr

links to Restaurant
sub property of: place
comment: Relation between Skyscraper and Restaurant
comment: Relazione tra Skyscraper e Restaurant @it
domain: skyscraper
range: restaurant
type: ObjectProperty

links to Comics Character
type: ObjectProperty
comment: Relation between Skyscraper and Comics Character
domain: skyscraper
range: comics character
comment: Relazione tra Skyscraper e Comics Character @it
sub property of: person

ice hockey player
label: joueur de hockey sur glace @fr
type: Class

mountain range
type: Class
label: chaîne de montagne @fr

beverage
label: boisson @fr
type: Class
type: ObjectProperty

links to Journalist
type: ObjectProperty
comment: Relation between Skyscraper and Journalist
domain: skyscraper
range: journalist
sub property of: person
comment: Relazione tra Skyscraper e Journalist @it

planet
type: Class
label: planète @fr
type: ObjectProperty

scientist
label: scientifique @fr
type: Class
label: Wissenschaftler @de

links to Historic Place
comment: Relazione tra Skyscraper e Historic Place @it
domain: skyscraper
type: ObjectProperty
type: NamedIndividual
range: historic place
sub property of: place
related match: before
related match: after
comment: Relation between Skyscraper and Historic Place

links to Basketball Player
domain: skyscraper
sub property of: person
range: basketball player
comment: Relazione tra Skyscraper e Basketball Player @it
type: ObjectProperty
comment: Relation between Skyscraper and Basketball Player

olympics
type: Class
label: Jeux Olympiques @fr

links to Ice Hockey League
comment: Relation between Skyscraper and Ice Hockey League
domain: skyscraper
range: ice hockey league
type: ObjectProperty
comment: Relazione tra Skyscraper e Ice Hockey League @it
sub property of: organisation

organisation
label: Organisation @de
label: organização @pt
type: ObjectProperty

baseball league
label: ligue de baseball @fr
type: Class

bridge
label: pont @fr
type: Class

broadcast
type: Class
label: Émission de télévision @fr

mammal
label: mammifère @fr
type: Class

links to Bird
comment: Relation between Skyscraper and Bird
type: ObjectProperty
domain: skyscraper
comment: Relazione tra Skyscraper e Bird @it
range: bird
sub property of: species

links to British Royalty
range: British royalty
comment: Relazione tra Skyscraper e British Royalty @it
sub property of: person
comment: Relation between Skyscraper and British Royalty
domain: skyscraper
type: ObjectProperty

links to Magazine
domain: skyscraper
sub property of: work
type: ObjectProperty
comment: Relazione tra Skyscraper e Magazine @it
range: magazine
comment: Relation between Skyscraper and Magazine

links to School
comment: Relazione tra Skyscraper e School @it
sub property of: organisation
range: school
domain: skyscraper
type: ObjectProperty
comment: Relation between Skyscraper and School

links to Aircraft
comment: Relation between Skyscraper and Aircraft
domain: skyscraper
sub property of: mean of transportation
type: ObjectProperty
range: aircraft
comment: Relazione tra Skyscraper e Aircraft @it

links to Park
sub property of: place
domain: skyscraper
range: park
comment: Relazione tra Skyscraper e Park @it
comment: Relation between Skyscraper and Park
type: ObjectProperty
type: NamedIndividual
related match: location

links to Mollusca
domain: skyscraper
range: mollusca
comment: Relation between Skyscraper and Mollusca
type: ObjectProperty
comment: Relazione tra Skyscraper e Mollusca @it
sub property of: species

island
type: Class
label: νησί @el
label: île @fr

comics character
type: Class
label: personnage de bandes dessinées @fr

links to Website
domain: skyscraper
type: ObjectProperty
sub property of: website
comment: Relazione tra Skyscraper e Website @it
comment: Relation between Skyscraper and Website
range: website

event
label: évènement @fr
type: ObjectProperty

skyscraper
label: gratte-ciel @fr
type: Class

links to Airline
type: ObjectProperty
comment: Relation between Skyscraper and Airline
domain: skyscraper
range: airline
sub property of: organisation
comment: Relazione tra Skyscraper e Airline @it

links to Conifer
type: ObjectProperty
sub property of: species
domain: skyscraper
range: conifer
comment: Relation between Skyscraper and Conifer
comment: Relazione tra Skyscraper e Conifer @it

radio station
type: Class
label: station de radio @fr

links to Newspaper
comment: Relazione tra Skyscraper e Newspaper @it
sub property of: work
type: ObjectProperty
domain: skyscraper
range: newspaper
comment: Relation between Skyscraper and Newspaper

links to Convention
domain: skyscraper
comment: Relazione tra Skyscraper e Convention @it
range: convention
comment: Relation between Skyscraper and Convention
sub property of: event
type: ObjectProperty

member of parliament
type: Class
label: membre du Parlement @fr

links to Book
comment: Relazione tra Skyscraper e Book @it
domain: skyscraper
comment: Relation between Skyscraper and Book
range: book
sub property of: work
type: ObjectProperty

conifer
type: Class
label: conifères @fr

airport
type: Class
label: Flughafen @de
label: aéroport @fr

links to Baseball Player
sub property of: person
range: baseball player
type: ObjectProperty
comment: Relation between Skyscraper and Baseball Player
domain: skyscraper
comment: Relazione tra Skyscraper e Baseball Player @it