Axiom
dbpedia infobox matching weight: 100.0
annotated property: relatedMatch
annotated target: name
annotated source: links to Musical Artist

links to Musical
comment: Relation between Soccer Club and Musical
type: ObjectProperty
sub property of: work
domain: soccer club
comment: Relazione tra Soccer Club e Musical @it
range: musical

television show
label: émission de télévision @fr
type: Class

disease
label: maladie @fr
type: Class
type: ObjectProperty

Axiom
dbpedia infobox matching weight: 100.0
annotated property: relatedMatch
annotated target: name
annotated source: links to Comics Creator

links to Aircraft
domain: soccer club
comment: Relazione tra Soccer Club e Aircraft @it
range: aircraft
comment: Relation between Soccer Club and Aircraft
sub property of: mean of transportation
type: ObjectProperty

links to Park
related match: ground
type: NamedIndividual
comment: Relazione tra Soccer Club e Park @it
type: ObjectProperty
domain: soccer club
comment: Relation between Soccer Club and Park
sub property of: place
range: park

links to Governor
related match: chairman
type: ObjectProperty
type: NamedIndividual
comment: Relation between Soccer Club and Governor
related match: name
comment: Relazione tra Soccer Club e Governor @it
range: governor
domain: soccer club
sub property of: person

automobile
type: Class

colour
type: Class
label: couleur @fr
label: χρώμα @el
type: ObjectProperty

Election
type: Class
label: élection @fr

Axiom
dbpedia infobox matching weight: 100.0
annotated target: name
annotated source: links to Ice Hockey Player
annotated property: relatedMatch

mean of transportation
label: moyen de transport @fr
type: ObjectProperty

american football player
type: Class
label: joueur de football américain @fr

links to Poker Player
domain: soccer club
comment: Relation between Soccer Club and Poker Player
comment: Relazione tra Soccer Club e Poker Player @it
type: ObjectProperty
range: poker player
sub property of: person

Axiom
dbpedia infobox matching weight: 100.0
annotated property: relatedMatch
annotated target: name
annotated source: links to Cyclist

soccer league
label: ligue de football @fr
type: Class

astronaut
label: astronaute @fr
label: Astronaut @de
type: Class

Axiom
dbpedia infobox matching weight: 100.0
annotated property: relatedMatch
annotated source: links to Journalist
annotated target: name

links to Website
range: website
comment: Relazione tra Soccer Club e Website @it
domain: soccer club
sub property of: website
type: ObjectProperty
comment: Relation between Soccer Club and Website

Axiom
dbpedia infobox matching weight: 100.0
annotated target: name
annotated property: relatedMatch
annotated source: links to Band

links to Congressman
type: ObjectProperty
range: congressman
domain: soccer club
sub property of: person
comment: Relazione tra Soccer Club e Congressman @it
comment: Relation between Soccer Club and Congressman
related match: name
type: NamedIndividual

wrestler
label: lutteur @fr
type: Class

mayor
label: maire @fr
type: Class

amphibian
type: Class
label: amphibien @fr

pope
type: Class
label: pape @fr

species
label: espèce @fr
type: ObjectProperty

links to Broadcast
comment: Relazione tra Soccer Club e Broadcast @it
range: broadcast
comment: Relation between Soccer Club and Broadcast
domain: soccer club
sub property of: organização
type: ObjectProperty
related match: shirtsponsors
type: NamedIndividual

links to Beverage
related match: shirtsponsors
type: NamedIndividual
comment: Relazione tra Soccer Club e Beverage @it
sub property of: beverage
type: ObjectProperty
comment: Relation between Soccer Club and Beverage
range: beverage
domain: soccer club

Axiom
dbpedia infobox matching weight: 100.0
annotated property: relatedMatch
annotated target: ground
annotated source: links to Park

links to Criminal
comment: Relation between Soccer Club and Criminal
comment: Relazione tra Soccer Club e Criminal @it
range: criminal
sub property of: person
domain: soccer club
type: ObjectProperty
related match: name
type: NamedIndividual

links to American Football Player
type: NamedIndividual
related match: name
sub property of: person
type: ObjectProperty
comment: Relazione tra Soccer Club e American Football Player @it
range: american football player
domain: soccer club
comment: Relation between Soccer Club and American Football Player

links to Monarch
type: ObjectProperty
sub property of: person
comment: Relazione tra Soccer Club e Monarch @it
range: monarch
comment: Relation between Soccer Club and Monarch
domain: soccer club

newspaper
label: journal @fr
type: Class

links to Bird
sub property of: species
domain: soccer club
comment: Relazione tra Soccer Club e Bird @it
comment: Relation between Soccer Club and Bird
range: bird
type: ObjectProperty
type: NamedIndividual

protected area
type: Class
label: προστατευμένη περιοχή @el
label: aire protégée @fr

game
label: jeu @fr
type: Class

road
type: Class
label: route @fr

Axiom
dbpedia infobox matching weight: 100.0
annotated source: links to Badminton Player
annotated target: name
annotated property: relatedMatch

boxer
type: Class
label: boxeur @fr

judge
label: juge @fr
type: Class

Axiom
dbpedia infobox matching weight: 100.0
annotated target: name
annotated source: links to Ethnic Group
annotated property: relatedMatch

World Heritage Site
type: Class
label: site du patrimoine mondial @fr

links to Automobile
type: ObjectProperty
sub property of: mean of transportation
comment: Relation between Soccer Club and Automobile
domain: soccer club
comment: Relazione tra Soccer Club e Automobile @it
range: automobile

links to Single
comment: Relation between Soccer Club and Single
type: ObjectProperty
range: single
domain: soccer club
comment: Relazione tra Soccer Club e Single @it
sub property of: work
type: NamedIndividual
related match: name

Axiom
dbpedia infobox matching weight: 100.0
annotated target: ground
annotated source: links to School
annotated property: relatedMatch

links to Comics Character
comment: Relazione tra Soccer Club e Comics Character @it
domain: soccer club
comment: Relation between Soccer Club and Comics Character
sub property of: person
range: comics character
type: ObjectProperty

links to Road
type: NamedIndividual
related match: ground
comment: Relation between Soccer Club and Road
sub property of: infrastructure
domain: soccer club
range: road
type: ObjectProperty
comment: Relazione tra Soccer Club e Road @it

links to Ethnic Group
related match: name
type: NamedIndividual
comment: Relazione tra Soccer Club e Ethnic Group @it
comment: Relation between Soccer Club and Ethnic Group
range: ethnic group
domain: soccer club
sub property of: ethnic group
type: ObjectProperty

language
type: ObjectProperty
label: langage @fr
type: Class

station
type: Class

links to Weapon
type: ObjectProperty
domain: soccer club
sub property of: device
range: weapon
comment: Relazione tra Soccer Club e Weapon @it
comment: Relation between Soccer Club and Weapon

links to Comics Creator
related match: name
type: NamedIndividual
domain: soccer club
range: comics creator
type: ObjectProperty
comment: Relation between Soccer Club and Comics Creator
comment: Relazione tra Soccer Club e Comics Creator @it
sub property of: person

links to Lacrosse League
domain: soccer club
range: lacrosse league
type: ObjectProperty
comment: Relation between Soccer Club and Lacrosse League
comment: Relazione tra Soccer Club e Lacrosse League @it
sub property of: organização

tennis league
type: Class
label: ligue de tennis @fr

links to Hockey Team
range: hockey team
domain: soccer club
type: ObjectProperty
comment: Relazione tra Soccer Club e Hockey Team @it
comment: Relation between Soccer Club and Hockey Team
sub property of: organização

links to Station
type: ObjectProperty
comment: Relation between Soccer Club and Station
comment: Relazione tra Soccer Club e Station @it
sub property of: place
domain: soccer club
range: station

Axiom
dbpedia infobox matching weight: 100.0
annotated property: relatedMatch
annotated target: shirtsponsors
annotated source: links to Beverage

links to Member Of Parliament
comment: Relation between Soccer Club and Member Of Parliament
range: member of parliament
comment: Relazione tra Soccer Club e Member Of Parliament @it
domain: soccer club
type: ObjectProperty
sub property of: person
type: NamedIndividual
related match: name

links to Baseball League
comment: Relation between Soccer Club and Baseball League
sub property of: organização
comment: Relazione tra Soccer Club e Baseball League @it
domain: soccer club
range: baseball league
type: ObjectProperty

lake
type: Class
label: lac @fr

links to Philosopher
comment: Relazione tra Soccer Club e Philosopher @it
range: philosopher
comment: Relation between Soccer Club and Philosopher
type: ObjectProperty
domain: soccer club
sub property of: person
related match: name
type: NamedIndividual

Axiom
dbpedia infobox matching weight: 50.0
annotated property: relatedMatch
annotated source: links to Governor
annotated target: chairman

arachnid
type: Class
label: arachnides @fr

links to Military Unit
range: military unit
comment: Relazione tra Soccer Club e Military Unit @it
type: ObjectProperty
sub property of: organização
domain: soccer club
comment: Relation between Soccer Club and Military Unit

governor
label: gouverneur @fr
type: Class

Axiom
dbpedia infobox matching weight: 100.0
annotated source: links to University
annotated target: ground
annotated property: relatedMatch

Axiom
dbpedia infobox matching weight: 8.33
annotated property: relatedMatch
annotated target: name
annotated source: links to Town

work
type: ObjectProperty
label: travail @fr
label: obra @pt

poker player
type: Class
label: joueur de poker @fr

river
type: Class
label: rivière @fr

links to Hospital
comment: Relazione tra Soccer Club e Hospital @it
sub property of: place
domain: soccer club
comment: Relation between Soccer Club and Hospital
type: ObjectProperty
range: hospital

Axiom
dbpedia infobox matching weight: 100.0
annotated target: name
annotated source: links to Prime Minister
annotated property: relatedMatch

Axiom
dbpedia infobox matching weight: 75.0
annotated property: relatedMatch
annotated target: name
annotated source: links to Golf Player

lacrosse league
label: ligue de crosse @fr
type: Class

school
label: école @fr
type: Class

museum
label: musée @fr
type: Class

ship
label: navire @fr
type: Class

fish
type: Class
label: poisson @fr

tennis player
type: Class
label: joueur de tennis @fr

Axiom
dbpedia infobox matching weight: 100.0
annotated target: name
annotated property: relatedMatch
annotated source: links to Cricketer

Axiom
dbpedia infobox matching weight: 100.0
annotated target: ground
annotated property: relatedMatch
annotated source: links to Village

video game
type: Class
label: jeux vidéo @fr

trade union
type: Class
label: syndicat professionnel @fr

links to Television Episode
domain: soccer club
sub property of: work
comment: Relation between Soccer Club and Television Episode
range: television episode
comment: Relazione tra Soccer Club e Television Episode @it
type: ObjectProperty

links to Saint
comment: Relazione tra Soccer Club e Saint @it
range: saint
type: ObjectProperty
comment: Relation between Soccer Club and Saint
domain: soccer club
sub property of: person

currency
type: ObjectProperty
label: devise @fr
type: Class

prime minister
label: premier ministre @fr
type: Class

British royalty
type: Class
label: royauté Britannique @fr

historic place
label: site historique @fr
type: Class

race
label: course @fr
type: Class

hospital
label: hôpital @fr
type: Class

links to Album
comment: Relazione tra Soccer Club e Album @it
domain: soccer club
comment: Relation between Soccer Club and Album
range: album
sub property of: work
type: ObjectProperty

links to Ice Hockey Player
sub property of: person
type: ObjectProperty
domain: soccer club
range: ice hockey player
comment: Relation between Soccer Club and Ice Hockey Player
comment: Relazione tra Soccer Club e Ice Hockey Player @it
type: NamedIndividual
related match: name

Axiom
dbpedia infobox matching weight: 100.0
annotated target: name
annotated property: relatedMatch
annotated source: links to Military Person

links to Astronaut
sub property of: person
type: ObjectProperty
comment: Relazione tra Soccer Club e Astronaut @it
domain: soccer club
comment: Relation between Soccer Club and Astronaut
range: astronaut
related match: name
type: NamedIndividual

links to Lighthouse
comment: Relazione tra Soccer Club e Lighthouse @it
comment: Relation between Soccer Club and Lighthouse
sub property of: place
range: lighthouse
domain: soccer club
type: ObjectProperty

links to Wrestler
comment: Relation between Soccer Club and Wrestler
domain: soccer club
range: wrestler
comment: Relazione tra Soccer Club e Wrestler @it
sub property of: person
type: ObjectProperty

continent
type: Class
label: ήπειρος @el

links to Formula One Racer
domain: soccer club
comment: Relazione tra Soccer Club e Formula One Racer @it
comment: Relation between Soccer Club and Formula One Racer
range: Formula One racer
sub property of: person
type: ObjectProperty

links to Book
type: ObjectProperty
comment: Relazione tra Soccer Club e Book @it
domain: soccer club
comment: Relation between Soccer Club and Book
range: book
sub property of: work

Axiom
dbpedia infobox matching weight: 50.0
annotated source: links to Tennis Player
annotated property: relatedMatch
annotated target: name

Axiom
dbpedia infobox matching weight: 20.0
annotated property: relatedMatch
annotated source: links to Office Holder
annotated target: chairman

album
label: Album @de
type: Class

president
label: président @fr
type: Class

figure skater
label: patineur artistique @fr
type: Class

links to Amphibian
comment: Relazione tra Soccer Club e Amphibian @it
comment: Relation between Soccer Club and Amphibian
sub property of: species
range: amphibian
domain: soccer club
type: ObjectProperty

links to Olympics
sub property of: event
comment: Relazione tra Soccer Club e Olympics @it
range: olympics
type: ObjectProperty
comment: Relation between Soccer Club and Olympics
domain: soccer club

cricket league
type: Class
label: ligue de cricket @fr

moss
type: Class
label: mousses @fr

links to Language
range: language
comment: Relazione tra Soccer Club e Language @it
comment: Relation between Soccer Club and Language
domain: soccer club
type: ObjectProperty
sub property of: language

links to Locomotive
range: locomotive
comment: Relazione tra Soccer Club e Locomotive @it
comment: Relation between Soccer Club and Locomotive
domain: soccer club
sub property of: mean of transportation
type: ObjectProperty

links to Basketball Player
related match: name
type: NamedIndividual
comment: Relazione tra Soccer Club e Basketball Player @it
range: basketball player
sub property of: person
comment: Relation between Soccer Club and Basketball Player
domain: soccer club
type: ObjectProperty

person
label: personne @fr
label: pessoa @pt
type: ObjectProperty
label: Person @de

military unit
label: unité militaire @fr
type: Class

links to Rugby League
sub property of: organização
comment: Relazione tra Soccer Club e Rugby League @it
type: ObjectProperty
range: rugby league
domain: soccer club
comment: Relation between Soccer Club and Rugby League

links to Senator
sub property of: person
domain: soccer club
comment: Relazione tra Soccer Club e Senator @it
type: ObjectProperty
comment: Relation between Soccer Club and Senator
range: senator

basketball team
type: Class

links to University
related match: ground
type: NamedIndividual
comment: Relation between Soccer Club and University
comment: Relazione tra Soccer Club e University @it
type: ObjectProperty
range: university
domain: soccer club
sub property of: organização

Axiom
dbpedia infobox matching weight: 100.0
annotated target: name
annotated property: relatedMatch
annotated source: links to National Collegiate Athletic Association Athlete

links to National Collegiate Athletic Association Athlete
type: ObjectProperty
domain: soccer club
comment: Relation between Soccer Club and National Collegiate Athletic Association Athlete
range: national collegiate athletic association athlete
comment: Relazione tra Soccer Club e National Collegiate Athletic Association Athlete @it
sub property of: person
type: NamedIndividual
related match: name

canadian football team
type: Class
label: équipe canadienne de football américain @fr

music genre
label: genre musical @fr
type: ObjectProperty
label: género musical @pt
type: Class

links to Judge
comment: Relazione tra Soccer Club e Judge @it
type: ObjectProperty
domain: soccer club
comment: Relation between Soccer Club and Judge
sub property of: person
range: judge
related match: name
type: NamedIndividual

writer
label: écrivain @fr
type: Class

record label
type: Class
label: label discographique @fr

links to Rugby Player
related match: name
type: NamedIndividual
type: ObjectProperty
comment: Relazione tra Soccer Club e Rugby Player @it
domain: soccer club
comment: Relation between Soccer Club and Rugby Player
sub property of: person
range: rugby player

architect
label: architecte @fr
type: Class

links to Arachnid
comment: Relazione tra Soccer Club e Arachnid @it
type: ObjectProperty
comment: Relation between Soccer Club and Arachnid
domain: soccer club
sub property of: species
range: arachnid

Axiom
dbpedia infobox matching weight: 100.0
annotated property: relatedMatch
annotated source: links to River
annotated target: ground

Axiom
dbpedia infobox matching weight: 100.0
annotated source: links to Scientist
annotated property: relatedMatch
annotated target: name

olympic result
type: ObjectProperty
type: Class
label: résultat de Jeux Olympiques @fr

SoccerClub.owl
has author: Aldo Gangemi
type: Ontology
extracted from: dbpedia.org
has author: Valentina Presutti
has author: Andrea Giovanni Nuzzolese
has intent: To represent the encyclopedic knowledge expressed by an object typed as SoccerClub
imports: dbpediainfoboxmatchingweight.owl
extracted from: en.wikipedia.org
comment: SoccerClub Encyclopedic Knowledge Pattern
imports: cpannotationschema.owl

links to Basketball Team
comment: Relazione tra Soccer Club e Basketball Team @it
range: basketball team
domain: soccer club
comment: Relation between Soccer Club and Basketball Team
type: ObjectProperty
sub property of: organização

links to Village
related match: ground
type: NamedIndividual
domain: soccer club
type: ObjectProperty
sub property of: place
range: village
comment: Relation between Soccer Club and Village
comment: Relazione tra Soccer Club e Village @it

links to Film
range: film
domain: soccer club
sub property of: work
type: ObjectProperty
comment: Relation between Soccer Club and Film
comment: Relazione tra Soccer Club e Film @it

links to Video Game
domain: soccer club
type: ObjectProperty
range: video game
comment: Relation between Soccer Club and Video Game
sub property of: work
comment: Relazione tra Soccer Club e Video Game @it
related match: name
type: NamedIndividual

links to Fish
related match: nickname
type: NamedIndividual
comment: Relation between Soccer Club and Fish
comment: Relazione tra Soccer Club e Fish @it
type: ObjectProperty
range: fish
sub property of: species
domain: soccer club

Axiom
dbpedia infobox matching weight: 100.0
annotated source: links to Criminal
annotated target: name
annotated property: relatedMatch

links to Architect
domain: soccer club
comment: Relazione tra Soccer Club e Architect @it
range: architect
comment: Relation between Soccer Club and Architect
type: ObjectProperty
sub property of: person

links to Pope
comment: Relazione tra Soccer Club e Pope @it
type: ObjectProperty
sub property of: person
range: pope
domain: soccer club
comment: Relation between Soccer Club and Pope

lighthouse
type: Class
label: phare @fr

Axiom
dbpedia infobox matching weight: 100.0
annotated target: name
annotated property: relatedMatch
annotated source: links to Figure Skater

comics creator
label: créateur de bandes dessinées @fr
type: Class

aircraft
label: αεροσκάφος @el
type: Class
label: avion @fr

hockey team
type: Class
label: équipe de hockey @fr

Axiom
dbpedia infobox matching weight: 100.0
annotated target: name
annotated property: relatedMatch
annotated source: links to Gaelic Games Player

reptile
type: Class

legislature
label: pouvoir législatif @fr
type: Class

links to Trade Union
comment: Relation between Soccer Club and Trade Union
sub property of: organização
domain: soccer club
comment: Relazione tra Soccer Club e Trade Union @it
range: trade union
type: ObjectProperty

links to Soccer League
type: ObjectProperty
related match: league
sub property of: organização
related match: position
comment: Relation between Soccer Club and Soccer League
range: soccer league
domain: soccer club
comment: Relazione tra Soccer Club e Soccer League @it
type: NamedIndividual

airline
type: Class
label: compagnie aérienne @fr

links to Anatomical Structure
domain: soccer club
type: ObjectProperty
range: anatomical structure
comment: Relazione tra Soccer Club e Anatomical Structure @it
sub property of: anatomical structure
comment: Relation between Soccer Club and Anatomical Structure

Axiom
dbpedia infobox matching weight: 100.0
annotated property: relatedMatch
annotated source: links to Road
annotated target: ground

monarch
label: monarque @fr
type: Class

links to President
domain: soccer club
sub property of: person
comment: Relation between Soccer Club and President
range: president
type: ObjectProperty
comment: Relazione tra Soccer Club e President @it
type: NamedIndividual
related match: name

congressman
type: Class
label: membre du Congrès @fr

golf player
label: golfeur @fr
type: Class

Axiom
dbpedia infobox matching weight: 100.0
annotated target: name
annotated property: relatedMatch
annotated source: links to Mountain

activity
label: activité @fr
label: Aktivität @de
type: ObjectProperty

nascar driver
label: pilote de la nascar @fr
type: Class

journalist
type: Class
label: journaliste @fr

links to Volleyball League
domain: soccer club
range: volleyball league
type: ObjectProperty
comment: Relation between Soccer Club and Volleyball League
comment: Relazione tra Soccer Club e Volleyball League @it
sub property of: organização

insect
label: insecte @fr
type: Class

links to Badminton Player
comment: Relazione tra Soccer Club e Badminton Player @it
sub property of: person
comment: Relation between Soccer Club and Badminton Player
range: badminton player
type: ObjectProperty
domain: soccer club
related match: name
type: NamedIndividual

film
type: Class
label: ταινία @el

american football team
label: équipe américaine de football américain @fr
type: Class

links to Tennis Player
comment: Relazione tra Soccer Club e Tennis Player @it
domain: soccer club
related match: name
range: tennis player
type: ObjectProperty
related match: before
comment: Relation between Soccer Club and Tennis Player
type: NamedIndividual
sub property of: person

links to Protected Area
comment: Relation between Soccer Club and Protected Area
domain: soccer club
comment: Relazione tra Soccer Club e Protected Area @it
range: protected area
sub property of: place
type: ObjectProperty

links to Office Holder
domain: soccer club
related match: manager
related match: name
sub property of: person
type: ObjectProperty
related match: chairman
comment: Relazione tra Soccer Club e Office Holder @it
range: office holder
type: NamedIndividual
comment: Relation between Soccer Club and Office Holder

Axiom
dbpedia infobox matching weight: 20.0
annotated property: relatedMatch
annotated source: links to Office Holder
annotated target: manager

bird
label: oiseau @fr
type: Class

chemical compound
type: Class
type: ObjectProperty
label: produit chimique @fr

Gaelic games player
type: Class
label: joueur de sports gaéliques @fr

power station
type: Class

links to Cardinal
type: ObjectProperty
domain: soccer club
comment: Relation between Soccer Club and Cardinal
comment: Relazione tra Soccer Club e Cardinal @it
range: cardinal
sub property of: person

musical artist
label: artista musical @pt
type: Class
label: musicien @fr

Axiom
dbpedia infobox matching weight: 100.0
annotated property: relatedMatch
annotated source: links to Judge
annotated target: name

Axiom
dbpedia infobox matching weight: 100.0
annotated target: name
annotated source: links to Video Game
annotated property: relatedMatch

links to Lake
comment: Relation between Soccer Club and Lake
sub property of: place
domain: soccer club
type: ObjectProperty
comment: Relazione tra Soccer Club e Lake @it
range: lake

Axiom
dbpedia infobox matching weight: 5.56
annotated target: position
annotated property: relatedMatch
annotated source: links to Soccer League

Axiom
dbpedia infobox matching weight: 100.0
annotated source: links to College Coach
annotated property: relatedMatch
annotated target: name

links to Race
range: race
type: ObjectProperty
comment: Relation between Soccer Club and Race
comment: Relazione tra Soccer Club e Race @it
domain: soccer club
sub property of: event

links to Hotel
sub property of: place
type: ObjectProperty
domain: soccer club
comment: Relazione tra Soccer Club e Hotel @it
comment: Relation between Soccer Club and Hotel
range: hotel

park
type: Class
label: parc @fr

cardinal
type: Class

rugby player
type: Class
label: joueur de rugby @fr

links to Museum
domain: soccer club
sub property of: place
comment: Relazione tra Soccer Club e Museum @it
range: museum
comment: Relation between Soccer Club and Museum
type: ObjectProperty

american football league
type: Class

links to Flowering Plant
sub property of: species
domain: soccer club
type: ObjectProperty
comment: Relation between Soccer Club and Flowering Plant
range: flowering plant
comment: Relazione tra Soccer Club e Flowering Plant @it

links to Non- Profit Organisation
comment: Relation between Soccer Club and Non- Profit Organisation
type: ObjectProperty
domain: soccer club
range: non-profit organisation
sub property of: organização
comment: Relazione tra Soccer Club e Non- Profit Organisation @it

musical
type: Class
label: musique @fr

links to Airport
range: airport
comment: Relation between Soccer Club and Airport
comment: Relazione tra Soccer Club e Airport @it
type: ObjectProperty
sub property of: place
domain: soccer club

links to Nascar Driver
sub property of: person
comment: Relation between Soccer Club and Nascar Driver
type: ObjectProperty
range: nascar driver
comment: Relazione tra Soccer Club e Nascar Driver @it
domain: soccer club

cyclist
label: cycliste @fr
type: Class

place
label: lugar @pt
label: lieu @fr
label: περιοχή @el
type: ObjectProperty

links to Ice Hockey League
sub property of: organização
comment: Relazione tra Soccer Club e Ice Hockey League @it
range: ice hockey league
comment: Relation between Soccer Club and Ice Hockey League
type: ObjectProperty
domain: soccer club

links to Cricket League
range: cricket league
comment: Relazione tra Soccer Club e Cricket League @it
sub property of: organização
domain: soccer club
comment: Relation between Soccer Club and Cricket League
type: ObjectProperty

links to Ship
comment: Relation between Soccer Club and Ship
type: ObjectProperty
range: ship
domain: soccer club
sub property of: mean of transportation
comment: Relazione tra Soccer Club e Ship @it

national collegiate athletic association athlete
label: athlète de la national collegiate athletic association @fr
type: Class

links to Figure Skater
comment: Relation between Soccer Club and Figure Skater
range: figure skater
sub property of: person
comment: Relazione tra Soccer Club e Figure Skater @it
type: ObjectProperty
domain: soccer club
related match: name
type: NamedIndividual

links to Airline
range: airline
sub property of: organização
domain: soccer club
comment: Relation between Soccer Club and Airline
comment: Relazione tra Soccer Club e Airline @it
type: ObjectProperty

Axiom
dbpedia infobox matching weight: 100.0
annotated property: relatedMatch
annotated target: name
annotated source: links to Baseball Player

links to Bridge
domain: soccer club
range: bridge
comment: Relation between Soccer Club and Bridge
comment: Relazione tra Soccer Club e Bridge @it
sub property of: place
type: ObjectProperty

infrastructure
type: ObjectProperty

links to Historic Building
comment: Relazione tra Soccer Club e Historic Building @it
type: ObjectProperty
sub property of: place
domain: soccer club
range: historic building
comment: Relation between Soccer Club and Historic Building

links to Currency
comment: Relazione tra Soccer Club e Currency @it
domain: soccer club
sub property of: currency
comment: Relation between Soccer Club and Currency
range: currency
type: ObjectProperty

basketball league
label: ligue de basketball @fr
type: Class

mountain
label: Βουνό @el
label: montagne @fr
type: Class

criminal
type: Class
label: criminel @fr

links to Game
comment: Relation between Soccer Club and Game
comment: Relazione tra Soccer Club e Game @it
range: game
domain: soccer club
sub property of: activity
type: ObjectProperty

links to Military Person
related match: name
type: NamedIndividual
comment: Relation between Soccer Club and Military Person
comment: Relazione tra Soccer Club e Military Person @it
type: ObjectProperty
domain: soccer club
range: military person
sub property of: person

flowering plant
label: angiospermes @fr
type: Class

links to Mountain
type: ObjectProperty
sub property of: place
comment: Relazione tra Soccer Club e Mountain @it
range: mountain
comment: Relation between Soccer Club and Mountain
domain: soccer club
related match: name
type: NamedIndividual

senator
label: sénateur @fr
type: Class

saint
type: Class

links to Island
related match: ground
type: NamedIndividual
comment: Relation between Soccer Club and Island
type: ObjectProperty
range: island
sub property of: place
comment: Relazione tra Soccer Club e Island @it
domain: soccer club

comedian
type: Class
label: comédien @fr

book
type: Class
label: livre @fr
label: βιβλίο @el
label: llibre @ca
label: książka @pl

links to Colour
comment: Relation between Soccer Club and Colour
range: colour
type: ObjectProperty
comment: Relazione tra Soccer Club e Colour @it
sub property of: colour
domain: soccer club

links to Gaelic Games Player
related match: name
type: NamedIndividual
range: Gaelic games player
sub property of: person
comment: Relazione tra Soccer Club e Gaelic Games Player @it
comment: Relation between Soccer Club and Gaelic Games Player
domain: soccer club
type: ObjectProperty

device
type: ObjectProperty
label: appareil @fr

links to Award
type: ObjectProperty
comment: Relazione tra Soccer Club e Award @it
comment: Relation between Soccer Club and Award
domain: soccer club
range: award
sub property of: award

shopping mall
type: Class
label: centre commercial @fr

ski area
type: Class
label: domaine skiable @fr

non-profit organisation
label: organisation à but non lucratif @fr
type: Class

Axiom
dbpedia infobox matching weight: 100.0
annotated property: relatedMatch
annotated source: links to Boxer
annotated target: name

canadian football league
type: Class

links to Magazine
sub property of: work
type: ObjectProperty
domain: soccer club
comment: Relazione tra Soccer Club e Magazine @it
comment: Relation between Soccer Club and Magazine
range: magazine

links to Scientist
comment: Relazione tra Soccer Club e Scientist @it
sub property of: person
domain: soccer club
type: ObjectProperty
range: scientist
comment: Relation between Soccer Club and Scientist
type: NamedIndividual
related match: name

rugby league
label: ligue de rugby @fr
type: Class

links to Continent
sub property of: place
comment: Relazione tra Soccer Club e Continent @it
comment: Relation between Soccer Club and Continent
type: ObjectProperty
domain: soccer club
range: continent

links to Golf Player
related match: name
domain: soccer club
comment: Relazione tra Soccer Club e Golf Player @it
type: ObjectProperty
related match: after
sub property of: person
range: golf player
comment: Relation between Soccer Club and Golf Player
type: NamedIndividual

links to Cricketer
type: NamedIndividual
related match: name
domain: soccer club
comment: Relation between Soccer Club and Cricketer
sub property of: person
type: ObjectProperty
range: cricketer
comment: Relazione tra Soccer Club e Cricketer @it

links to Christian Bishop
type: ObjectProperty
domain: soccer club
comment: Relazione tra Soccer Club e Christian Bishop @it
range: Christian Bishop
sub property of: person
comment: Relation between Soccer Club and Christian Bishop

links to Historic Place
domain: soccer club
range: historic place
comment: Relation between Soccer Club and Historic Place
type: ObjectProperty
comment: Relazione tra Soccer Club e Historic Place @it
sub property of: place

weapon
type: Class
label: arme @fr

links to Canal
comment: Relazione tra Soccer Club e Canal @it
type: ObjectProperty
range: canal
comment: Relation between Soccer Club and Canal
sub property of: place
domain: soccer club

drug
type: Class
label: médicament @fr
type: ObjectProperty

links to American Football Team
type: ObjectProperty
domain: soccer club
sub property of: organização
comment: Relazione tra Soccer Club e American Football Team @it
range: american football team
comment: Relation between Soccer Club and American Football Team

links to Reptile
type: ObjectProperty
range: reptile
sub property of: species
domain: soccer club
comment: Relation between Soccer Club and Reptile
comment: Relazione tra Soccer Club e Reptile @it

links to Ski Area
domain: soccer club
range: ski area
comment: Relazione tra Soccer Club e Ski Area @it
comment: Relation between Soccer Club and Ski Area
type: ObjectProperty
sub property of: place

magazine
label: περιοδικό @el
type: Class

links to British Royalty
range: British royalty
domain: soccer club
sub property of: person
type: ObjectProperty
comment: Relazione tra Soccer Club e British Royalty @it
comment: Relation between Soccer Club and British Royalty

links to River
related match: ground
type: NamedIndividual
range: river
sub property of: place
comment: Relation between Soccer Club and River
domain: soccer club
comment: Relazione tra Soccer Club e River @it
type: ObjectProperty

links to Skyscraper
range: skyscraper
sub property of: place
type: ObjectProperty
comment: Relation between Soccer Club and Skyscraper
comment: Relazione tra Soccer Club e Skyscraper @it
domain: soccer club

Axiom
dbpedia infobox matching weight: 91.67
annotated property: relatedMatch
annotated target: ground
annotated source: links to Town

canal
type: Class

military person
label: militaire @fr
type: Class

philosopher
label: philosophe @fr
type: Class

award
type: ObjectProperty
label: récompense @fr
type: Class

locomotive
type: Class

college
type: Class

anatomical structure
type: Class
type: ObjectProperty
label: structure anatomique @fr

Axiom
dbpedia infobox matching weight: 94.44
annotated target: league
annotated property: relatedMatch
annotated source: links to Soccer League

cricketer
label: joueur de cricket @fr
type: Class

links to Music Festival
comment: Relation between Soccer Club and Music Festival
sub property of: event
range: music festival
domain: soccer club
comment: Relazione tra Soccer Club e Music Festival @it
type: ObjectProperty

single
type: Class

Band
label: banda @pt
label: Musikgruppe @de
type: Class
label: groupe de musique @fr

links to Band
comment: Relazione tra Soccer Club e Band @it
range: Band
type: ObjectProperty
comment: Relation between Soccer Club and Band
sub property of: organização
domain: soccer club
type: NamedIndividual
related match: name

links to Writer
related match: name
type: NamedIndividual
comment: Relation between Soccer Club and Writer
range: writer
sub property of: person
type: ObjectProperty
comment: Relazione tra Soccer Club e Writer @it
domain: soccer club

Axiom
dbpedia infobox matching weight: 25.0
annotated target: after
annotated property: relatedMatch
annotated source: links to Golf Player

town
type: Class
label: ville @fr

links to Planet
domain: soccer club
comment: Relazione tra Soccer Club e Planet @it
type: ObjectProperty
sub property of: planet
range: planet
comment: Relation between Soccer Club and Planet

university
type: Class
label: université @fr
label: πανεπιστήμιο @el

Axiom
dbpedia infobox matching weight: 100.0
annotated source: links to World Heritage Site
annotated target: ground
annotated property: relatedMatch

ethnic group
type: Class
type: ObjectProperty
label: groupe ethnique @fr

links to Boxer
type: ObjectProperty
domain: soccer club
sub property of: person
comment: Relazione tra Soccer Club e Boxer @it
comment: Relation between Soccer Club and Boxer
range: boxer
related match: name
type: NamedIndividual

links to Military Conflict
range: military conflict
sub property of: event
type: ObjectProperty
comment: Relation between Soccer Club and Military Conflict
domain: soccer club
comment: Relazione tra Soccer Club e Military Conflict @it

links to Journalist
sub property of: person
type: ObjectProperty
comment: Relazione tra Soccer Club e Journalist @it
range: journalist
domain: soccer club
comment: Relation between Soccer Club and Journalist
type: NamedIndividual
related match: name

links to Town
type: NamedIndividual
sub property of: place
type: ObjectProperty
comment: Relation between Soccer Club and Town
range: town
domain: soccer club
related match: ground
related match: name
comment: Relazione tra Soccer Club e Town @it

links to Olympic Result
type: ObjectProperty
comment: Relazione tra Soccer Club e Olympic Result @it
sub property of: olympic result
domain: soccer club
range: olympic result
comment: Relation between Soccer Club and Olympic Result

links to Mountain Range
comment: Relazione tra Soccer Club e Mountain Range @it
domain: soccer club
sub property of: place
comment: Relation between Soccer Club and Mountain Range
type: ObjectProperty
range: mountain range

Axiom
dbpedia infobox matching weight: 100.0
annotated property: relatedMatch
annotated target: nickname
annotated source: links to Fish

hotel
type: Class
label: hôtel @fr

music festival
type: Class
label: festival de musique @fr

links to Mayor
comment: Relazione tra Soccer Club e Mayor @it
range: mayor
comment: Relation between Soccer Club and Mayor
type: ObjectProperty
domain: soccer club
sub property of: person

volleyball league
type: Class
label: ligue de volleyball @fr

college coach
type: Class
label: entraîneur universitaire @fr

television episode
label: épisode télévisé @fr
type: Class

Axiom
dbpedia infobox matching weight: 100.0
annotated target: name
annotated property: relatedMatch
annotated source: links to Philosopher

village
type: Class
label: χωριό @el

links to Music Genre
domain: soccer club
comment: Relation between Soccer Club and Music Genre
sub property of: music genre
range: music genre
type: ObjectProperty
comment: Relazione tra Soccer Club e Music Genre @it

ice hockey league
label: ligue d'hockey sur glace @fr
type: Class

links to Radio Station
type: ObjectProperty
comment: Relazione tra Soccer Club e Radio Station @it
range: radio station
sub property of: organização
domain: soccer club
comment: Relation between Soccer Club and Radio Station

Axiom
dbpedia infobox matching weight: 100.0
annotated property: relatedMatch
annotated target: name
annotated source: links to President

soccer club
label: club de football @fr
type: Class

links to Canadian Football League
sub property of: organização
domain: soccer club
comment: Relazione tra Soccer Club e Canadian Football League @it
comment: Relation between Soccer Club and Canadian Football League
range: canadian football league
type: ObjectProperty

historic building
label: bâtiment historique @fr
type: Class

Axiom
dbpedia infobox matching weight: 100.0
annotated target: name
annotated property: relatedMatch
annotated source: links to Astronaut

office holder
label: titulaire @fr
type: Class
label: Amtsinhaber @de

baseball player
type: Class
label: joueur de baseball @fr

military conflict
type: Class
label: conflit militaire @fr

website
type: ObjectProperty
type: Class
label: Ιστότοπος @el
label: site web @fr

links to Baseball Player
comment: Relation between Soccer Club and Baseball Player
sub property of: person
comment: Relazione tra Soccer Club e Baseball Player @it
type: ObjectProperty
domain: soccer club
range: baseball player
related match: name
type: NamedIndividual

links to Moss
sub property of: species
type: ObjectProperty
domain: soccer club
comment: Relazione tra Soccer Club e Moss @it
range: moss
comment: Relation between Soccer Club and Moss

links to Record Label
comment: Relation between Soccer Club and Record Label
range: record label
sub property of: organização
comment: Relazione tra Soccer Club e Record Label @it
domain: soccer club
type: ObjectProperty

links to Basketball League
type: ObjectProperty
comment: Relazione tra Soccer Club e Basketball League @it
comment: Relation between Soccer Club and Basketball League
range: basketball league
sub property of: organização
domain: soccer club

links to Drug
domain: soccer club
range: drug
comment: Relation between Soccer Club and Drug
type: ObjectProperty
comment: Relazione tra Soccer Club e Drug @it
sub property of: drug

Axiom
dbpedia infobox matching weight: 100.0
annotated property: relatedMatch
annotated target: shirtsponsors
annotated source: links to Broadcast

basketball player
label: joueur de basketball @fr
type: Class

adult actor
label: erwachsener Schauspieler @de
type: Class
label: acteur adulte @fr

links to Insect
domain: soccer club
comment: Relazione tra Soccer Club e Insect @it
sub property of: species
type: ObjectProperty
comment: Relation between Soccer Club and Insect
range: insect

Axiom
dbpedia infobox matching weight: 50.0
annotated source: links to Governor
annotated property: relatedMatch
annotated target: name

ice hockey player
label: joueur de hockey sur glace @fr
type: Class

links to American Football League
sub property of: organização
domain: soccer club
comment: Relation between Soccer Club and American Football League
type: ObjectProperty
comment: Relazione tra Soccer Club e American Football League @it
range: american football league

Axiom
dbpedia infobox matching weight: 100.0
annotated target: name
annotated property: relatedMatch
annotated source: links to Rugby Player

Christian Bishop
type: Class
label: évêque chrétien @fr

mountain range
type: Class
label: chaîne de montagne @fr

beverage
label: boisson @fr
type: Class
type: ObjectProperty

planet
type: ObjectProperty
label: planète @fr
type: Class

links to Election
domain: soccer club
comment: Relation between Soccer Club and Election
sub property of: event
type: ObjectProperty
range: Election
comment: Relazione tra Soccer Club e Election @it

links to Legislature
type: ObjectProperty
range: legislature
comment: Relation between Soccer Club and Legislature
comment: Relazione tra Soccer Club e Legislature @it
domain: soccer club
sub property of: organização

Axiom
dbpedia infobox matching weight: 50.0
annotated source: links to Tennis Player
annotated property: relatedMatch
annotated target: before

scientist
label: Wissenschaftler @de
type: Class
label: scientifique @fr

links to School
related match: ground
type: NamedIndividual
range: school
domain: soccer club
comment: Relation between Soccer Club and School
sub property of: organização
comment: Relazione tra Soccer Club e School @it
type: ObjectProperty

Axiom
dbpedia infobox matching weight: 60.0
annotated target: name
annotated property: relatedMatch
annotated source: links to Office Holder

Axiom
dbpedia infobox matching weight: 100.0
annotated property: relatedMatch
annotated source: links to Single
annotated target: name

links to Mammal
sub property of: species
range: mammal
type: ObjectProperty
domain: soccer club
comment: Relation between Soccer Club and Mammal
comment: Relazione tra Soccer Club e Mammal @it

links to World Heritage Site
type: ObjectProperty
sub property of: place
range: World Heritage Site
domain: soccer club
comment: Relation between Soccer Club and World Heritage Site
comment: Relazione tra Soccer Club e World Heritage Site @it
type: NamedIndividual
related match: ground

badminton player
type: Class
label: joueur de badminton @fr

links to Prime Minister
type: ObjectProperty
comment: Relation between Soccer Club and Prime Minister
sub property of: person
domain: soccer club
range: prime minister
comment: Relazione tra Soccer Club e Prime Minister @it
type: NamedIndividual
related match: name

olympics
label: Jeux Olympiques @fr
type: Class

links to Disease
sub property of: disease
type: ObjectProperty
range: disease
domain: soccer club
comment: Relazione tra Soccer Club e Disease @it
comment: Relation between Soccer Club and Disease

organização
type: ObjectProperty
label: organisation
label: Organisation @de

baseball league
type: Class
label: ligue de baseball @fr

links to Television Show
comment: Relation between Soccer Club and Television Show
type: ObjectProperty
range: television show
comment: Relazione tra Soccer Club e Television Show @it
sub property of: work
domain: soccer club

Axiom
dbpedia infobox matching weight: 100.0
annotated property: relatedMatch
annotated target: name
annotated source: links to Writer

bridge
label: pont @fr
type: Class

links to College Coach
range: college coach
sub property of: person
domain: soccer club
comment: Relation between Soccer Club and College Coach
type: ObjectProperty
comment: Relazione tra Soccer Club e College Coach @it
type: NamedIndividual
related match: name

links to Comedian
comment: Relation between Soccer Club and Comedian
range: comedian
domain: soccer club
type: ObjectProperty
sub property of: person
comment: Relazione tra Soccer Club e Comedian @it

links to Cyclist
sub property of: person
range: cyclist
domain: soccer club
comment: Relazione tra Soccer Club e Cyclist @it
type: ObjectProperty
comment: Relation between Soccer Club and Cyclist
type: NamedIndividual
related match: name

links to Adult Actor
comment: Relation between Soccer Club and Adult Actor
sub property of: person
domain: soccer club
comment: Relazione tra Soccer Club e Adult Actor @it
type: ObjectProperty
range: adult actor

links to Chemical Compound
range: chemical compound
sub property of: chemical compound
domain: soccer club
comment: Relazione tra Soccer Club e Chemical Compound @it
comment: Relation between Soccer Club and Chemical Compound
type: ObjectProperty

broadcast
type: Class
label: Émission de télévision @fr

mammal
label: mammifère @fr
type: Class

Axiom
dbpedia infobox matching weight: 100.0
annotated property: relatedMatch
annotated target: ground
annotated source: links to Island

Axiom
dbpedia infobox matching weight: 100.0
annotated property: relatedMatch
annotated source: links to Bird

island
label: île @fr
label: νησί @el
type: Class

comics character
type: Class
label: personnage de bandes dessinées @fr

links to Power Station
comment: Relation between Soccer Club and Power Station
comment: Relazione tra Soccer Club e Power Station @it
domain: soccer club
type: ObjectProperty
sub property of: infrastructure
range: power station

links to Shopping Mall
type: ObjectProperty
domain: soccer club
comment: Relazione tra Soccer Club e Shopping Mall @it
sub property of: place
comment: Relation between Soccer Club and Shopping Mall
range: shopping mall

event
label: évènement @fr
type: ObjectProperty

Formula One racer
label: pilote de formule 1 @fr
type: Class

skyscraper
label: gratte-ciel @fr
type: Class

Axiom
dbpedia infobox matching weight: 100.0
annotated source: links to Congressman
annotated property: relatedMatch
annotated target: name

links to Musical Artist
related match: name
type: NamedIndividual
range: musical artist
type: ObjectProperty
comment: Relazione tra Soccer Club e Musical Artist @it
sub property of: person
comment: Relation between Soccer Club and Musical Artist
domain: soccer club

links to Newspaper
sub property of: work
domain: soccer club
comment: Relation between Soccer Club and Newspaper
range: newspaper
comment: Relazione tra Soccer Club e Newspaper @it
type: ObjectProperty

radio station
type: Class
label: station de radio @fr

links to Conifer
type: ObjectProperty
comment: Relation between Soccer Club and Conifer
sub property of: species
domain: soccer club
range: conifer
comment: Relazione tra Soccer Club e Conifer @it

Axiom
dbpedia infobox matching weight: 100.0
annotated source: links to Basketball Player
annotated target: name
annotated property: relatedMatch

Axiom
dbpedia infobox matching weight: 100.0
annotated target: name
annotated source: links to American Football Player
annotated property: relatedMatch

links to College
range: college
comment: Relation between Soccer Club and College
comment: Relazione tra Soccer Club e College @it
domain: soccer club
sub property of: organização
type: ObjectProperty

member of parliament
label: membre du Parlement @fr
type: Class

links to Tennis League
type: ObjectProperty
range: tennis league
sub property of: organização
domain: soccer club
comment: Relation between Soccer Club and Tennis League
comment: Relazione tra Soccer Club e Tennis League @it

links to Canadian Football Team
range: canadian football team
comment: Relazione tra Soccer Club e Canadian Football Team @it
type: ObjectProperty
domain: soccer club
comment: Relation between Soccer Club and Canadian Football Team
sub property of: organização

conifer
label: conifères @fr
type: Class

Axiom
dbpedia infobox matching weight: 100.0
annotated property: relatedMatch
annotated source: links to Member Of Parliament
annotated target: name

airport
type: Class
label: Flughafen @de
label: aéroport @fr