links to Tennis League
sub property of: organização
type: ObjectProperty
comment: Relation between Soccer Player and Tennis League
range: tennis league
domain: soccer player
comment: Relazione tra Soccer Player e Tennis League @it

links to Formula One Racer
comment: Relazione tra Soccer Player e Formula One Racer @it
domain: soccer player
type: ObjectProperty
sub property of: person
range: Formula One racer
comment: Relation between Soccer Player and Formula One Racer

Axiom
dbpedia infobox matching weight: 100.0
annotated property: relatedMatch
annotated source: links to Office Holder
annotated target: after

links to Senator
comment: Relation between Soccer Player and Senator
range: senator
sub property of: person
domain: soccer player
type: ObjectProperty
comment: Relazione tra Soccer Player e Senator @it

television show
label: émission de télévision @fr
type: Class

disease
label: maladie @fr
type: Class
type: ObjectProperty

links to British Royalty
comment: Relazione tra Soccer Player e British Royalty @it
type: ObjectProperty
domain: soccer player
sub property of: person
range: British royalty
comment: Relation between Soccer Player and British Royalty

links to Tennis Player
domain: soccer player
range: tennis player
comment: Relazione tra Soccer Player e Tennis Player @it
comment: Relation between Soccer Player and Tennis Player
sub property of: person
type: ObjectProperty

links to Artery
domain: soccer player
comment: Relation between Soccer Player and Artery
sub property of: anatomical structure
range: artery
type: ObjectProperty
comment: Relazione tra Soccer Player e Artery @it

links to Chemical Compound
comment: Relazione tra Soccer Player e Chemical Compound @it
sub property of: chemical compound
comment: Relation between Soccer Player and Chemical Compound
range: chemical compound
domain: soccer player
type: ObjectProperty

automobile
type: Class

colour
type: ObjectProperty
label: χρώμα @el
label: couleur @fr
type: Class

links to Basketball League
type: ObjectProperty
comment: Relation between Soccer Player and Basketball League
domain: soccer player
comment: Relazione tra Soccer Player e Basketball League @it
range: basketball league
sub property of: organização

Election
type: Class
label: élection @fr

links to Song
domain: soccer player
comment: Relazione tra Soccer Player e Song @it
range: song
type: ObjectProperty
sub property of: work
comment: Relation between Soccer Player and Song

Axiom
dbpedia infobox matching weight: 5.88
annotated source: links to Town
annotated property: relatedMatch
annotated target: youthclubs

Axiom
dbpedia infobox matching weight: 100.0
annotated source: links to Cricketer
annotated property: relatedMatch
annotated target: after

links to Musical Artist
sub property of: person
comment: Relation between Soccer Player and Musical Artist
domain: soccer player
range: musical artist
type: ObjectProperty
comment: Relazione tra Soccer Player e Musical Artist @it

mean of transportation
label: moyen de transport @fr
type: ObjectProperty

american football player
label: joueur de football américain @fr
type: Class

links to Comedian
sub property of: person
comment: Relation between Soccer Player and Comedian
type: ObjectProperty
domain: soccer player
range: comedian
comment: Relazione tra Soccer Player e Comedian @it

links to Conifer
domain: soccer player
range: conifer
comment: Relazione tra Soccer Player e Conifer @it
comment: Relation between Soccer Player and Conifer
sub property of: species
type: ObjectProperty

stadium
label: stade @fr
type: Class

links to Fish
domain: soccer player
comment: Relation between Soccer Player and Fish
sub property of: species
comment: Relazione tra Soccer Player e Fish @it
range: fish
type: ObjectProperty

soccer league
label: ligue de football @fr
type: Class

astronaut
type: Class
label: Astronaut @de
label: astronaute @fr

videogames league
label: ligue de jeux vidéo @fr
type: Class

links to Colour
domain: soccer player
type: ObjectProperty
sub property of: colour
comment: Relazione tra Soccer Player e Colour @it
comment: Relation between Soccer Player and Colour
range: colour

links to Olympic Result
comment: Relazione tra Soccer Player e Olympic Result @it
range: olympic result
comment: Relation between Soccer Player and Olympic Result
sub property of: olympic result
domain: soccer player
type: ObjectProperty

links to Convention
sub property of: event
comment: Relazione tra Soccer Player e Convention @it
domain: soccer player
comment: Relation between Soccer Player and Convention
type: ObjectProperty
range: convention

Axiom
dbpedia infobox matching weight: 4.76
annotated source: links to Administrative Region
annotated property: relatedMatch
annotated target: ci

links to Cricket League
domain: soccer player
type: ObjectProperty
sub property of: organização
comment: Relation between Soccer Player and Cricket League
range: cricket league
comment: Relazione tra Soccer Player e Cricket League @it

wrestler
label: lutteur @fr
type: Class

links to Bridge
domain: soccer player
comment: Relation between Soccer Player and Bridge
type: ObjectProperty
range: bridge
comment: Relazione tra Soccer Player e Bridge @it
sub property of: place

mayor
label: maire @fr
type: Class

links to Baseball League
comment: Relazione tra Soccer Player e Baseball League @it
domain: soccer player
comment: Relation between Soccer Player and Baseball League
type: ObjectProperty
sub property of: organização
range: baseball league

pope
label: pape @fr
type: Class

species
label: espèce @fr
type: ObjectProperty

links to National Collegiate Athletic Association Athlete
domain: soccer player
sub property of: person
comment: Relation between Soccer Player and National Collegiate Athletic Association Athlete
type: ObjectProperty
comment: Relazione tra Soccer Player e National Collegiate Athletic Association Athlete @it
range: national collegiate athletic association athlete

links to Ice Hockey League
range: ice hockey league
comment: Relazione tra Soccer Player e Ice Hockey League @it
sub property of: organização
comment: Relation between Soccer Player and Ice Hockey League
domain: soccer player
type: ObjectProperty

handball league
label: ligue de handball @fr
type: Class

Axiom
dbpedia infobox matching weight: 33.33
annotated source: links to Military Unit
annotated property: relatedMatch
annotated target: caps

newspaper
type: Class
label: journal @fr

links to Power Station
range: power station
comment: Relation between Soccer Player and Power Station
type: ObjectProperty
sub property of: infrastructure
domain: soccer player
comment: Relazione tra Soccer Player e Power Station @it

protected area
type: Class
label: προστατευμένη περιοχή @el
label: aire protégée @fr

game
label: jeu @fr
type: Class

road
type: Class
label: route @fr

links to Aircraft
type: ObjectProperty
domain: soccer player
comment: Relazione tra Soccer Player e Aircraft @it
range: aircraft
comment: Relation between Soccer Player and Aircraft
sub property of: mean of transportation

links to Film
type: ObjectProperty
domain: soccer player
comment: Relation between Soccer Player and Film
range: film
sub property of: work
comment: Relazione tra Soccer Player e Film @it

boxer
label: boxeur @fr
type: Class

links to Judge
comment: Relazione tra Soccer Player e Judge @it
type: ObjectProperty
comment: Relation between Soccer Player and Judge
domain: soccer player
sub property of: person
range: judge

judge
label: juge @fr
type: Class

World Heritage Site
label: site du patrimoine mondial @fr
type: Class

links to Mammal
comment: Relazione tra Soccer Player e Mammal @it
range: mammal
sub property of: species
type: ObjectProperty
domain: soccer player
comment: Relation between Soccer Player and Mammal

links to School
related match: youthclubs
type: NamedIndividual
sub property of: organização
range: school
comment: Relazione tra Soccer Player e School @it
comment: Relation between Soccer Player and School
type: ObjectProperty
domain: soccer player

language
type: ObjectProperty
label: langage @fr
type: Class

station
type: Class

Axiom
dbpedia infobox matching weight: 29.41
annotated source: links to Town
annotated target: clubs
annotated property: relatedMatch

tennis league
type: Class
label: ligue de tennis @fr

links to Non- Profit Organisation
comment: Relation between Soccer Player and Non- Profit Organisation
sub property of: organização
range: non-profit organisation
type: ObjectProperty
domain: soccer player
comment: Relazione tra Soccer Player e Non- Profit Organisation @it

lake
type: Class
label: lac @fr

links to Stadium
type: ObjectProperty
domain: soccer player
comment: Relation between Soccer Player and Stadium
range: stadium
sub property of: place
comment: Relazione tra Soccer Player e Stadium @it
related match: st
type: NamedIndividual

Axiom
dbpedia infobox matching weight: 47.06
annotated property: relatedMatch
annotated target: cityofbirth
annotated source: links to Town

links to Muscle
comment: Relation between Soccer Player and Muscle
comment: Relazione tra Soccer Player e Muscle @it
type: ObjectProperty
range: muscle
domain: soccer player
sub property of: anatomical structure

arachnid
type: Class
label: arachnides @fr

links to Bird
comment: Relazione tra Soccer Player e Bird @it
range: bird
domain: soccer player
sub property of: species
comment: Relation between Soccer Player and Bird
type: ObjectProperty

governor
type: Class
label: gouverneur @fr

links to Restaurant
comment: Relazione tra Soccer Player e Restaurant @it
comment: Relation between Soccer Player and Restaurant
domain: soccer player
sub property of: place
range: restaurant
type: ObjectProperty

administrative region
label: région administrative @fr
type: Class

Axiom
dbpedia infobox matching weight: 100.0
annotated source: links to Insect
annotated target: clubs
annotated property: relatedMatch

work
label: obra @pt
label: travail @fr
type: ObjectProperty

poker player
type: Class
label: joueur de poker @fr

river
type: Class
label: rivière @fr

lacrosse league
label: ligue de crosse @fr
type: Class

school
label: école @fr
type: Class

museum
type: Class
label: musée @fr

ship
label: navire @fr
type: Class

fish
type: Class
label: poisson @fr

tennis player
type: Class
label: joueur de tennis @fr

video game
type: Class
label: jeux vidéo @fr

trade union
label: syndicat professionnel @fr
type: Class

Axiom
dbpedia infobox matching weight: 33.33
annotated source: links to Military Unit
annotated target: youthclubs
annotated property: relatedMatch

links to Journalist
comment: Relation between Soccer Player and Journalist
comment: Relazione tra Soccer Player e Journalist @it
sub property of: person
domain: soccer player
type: ObjectProperty
range: journalist

links to Ice Hockey Player
type: ObjectProperty
domain: soccer player
sub property of: person
comment: Relation between Soccer Player and Ice Hockey Player
range: ice hockey player
comment: Relazione tra Soccer Player e Ice Hockey Player @it

links to Beverage
range: beverage
comment: Relazione tra Soccer Player e Beverage @it
domain: soccer player
type: ObjectProperty
comment: Relation between Soccer Player and Beverage
sub property of: beverage

currency
type: ObjectProperty
type: Class
label: devise @fr

prime minister
type: Class
label: premier ministre @fr

British royalty
type: Class
label: royauté Britannique @fr

historic place
type: Class
label: site historique @fr

Axiom
dbpedia infobox matching weight: 100.0
annotated property: relatedMatch
annotated source: links to Airline
annotated target: clubs

race
label: course @fr
type: Class

hospital
label: hôpital @fr
type: Class

links to Single
domain: soccer player
sub property of: work
range: single
type: ObjectProperty
comment: Relazione tra Soccer Player e Single @it
comment: Relation between Soccer Player and Single

links to Wrestling Event
domain: soccer player
sub property of: event
comment: Relazione tra Soccer Player e Wrestling Event @it
range: wrestling event
type: ObjectProperty
comment: Relation between Soccer Player and Wrestling Event

links to Pope
domain: soccer player
sub property of: person
range: pope
comment: Relazione tra Soccer Player e Pope @it
type: ObjectProperty
comment: Relation between Soccer Player and Pope

links to President
domain: soccer player
sub property of: person
type: ObjectProperty
range: president
comment: Relation between Soccer Player and President
comment: Relazione tra Soccer Player e President @it

Axiom
dbpedia infobox matching weight: 100.0
annotated property: relatedMatch
annotated target: clubs
annotated source: links to Military Person

continent
type: Class
label: ήπειρος @el

Axiom
dbpedia infobox matching weight: 100.0
annotated property: relatedMatch
annotated target: st
annotated source: links to Stadium

album
type: Class
label: Album @de

president
label: président @fr
type: Class

Axiom
dbpedia infobox matching weight: 5.88
annotated source: links to Town
annotated target: placeOfBirth
annotated property: relatedMatch

figure skater
label: patineur artistique @fr
type: Class

links to Hospital
range: hospital
sub property of: place
comment: Relazione tra Soccer Player e Hospital @it
domain: soccer player
type: ObjectProperty
comment: Relation between Soccer Player and Hospital

cricket league
label: ligue de cricket @fr
type: Class

person
label: personne @fr
type: ObjectProperty
label: pessoa @pt
label: Person @de

military unit
label: unité militaire @fr
type: Class

Axiom
dbpedia infobox matching weight: 100.0
annotated target: youthclubs
annotated property: relatedMatch
annotated source: links to Album

basketball team
type: Class

links to Planet
type: ObjectProperty
comment: Relazione tra Soccer Player e Planet @it
range: planet
comment: Relation between Soccer Player and Planet
domain: soccer player
sub property of: planet

music genre
label: genre musical @fr
type: ObjectProperty
label: género musical @pt
type: Class

links to Lake
type: ObjectProperty
domain: soccer player
range: lake
sub property of: place
comment: Relazione tra Soccer Player e Lake @it
comment: Relation between Soccer Player and Lake

writer
type: Class
label: écrivain @fr

links to Island
comment: Relazione tra Soccer Player e Island @it
sub property of: place
range: island
type: ObjectProperty
domain: soccer player
comment: Relation between Soccer Player and Island
type: NamedIndividual
related match: cityofbirth

record label
type: Class
label: label discographique @fr

architect
label: architecte @fr
type: Class

Axiom
dbpedia infobox matching weight: 100.0
annotated target: title
annotated source: links to Trade Union
annotated property: relatedMatch

Axiom
dbpedia infobox matching weight: 65.77
annotated target: youthclubs
annotated source: links to University
annotated property: relatedMatch

model
label: mannequin @fr
type: Class

links to Reptile
range: reptile
sub property of: species
type: ObjectProperty
domain: soccer player
comment: Relazione tra Soccer Player e Reptile @it
comment: Relation between Soccer Player and Reptile

links to Music Festival
comment: Relazione tra Soccer Player e Music Festival @it
type: ObjectProperty
domain: soccer player
range: music festival
comment: Relation between Soccer Player and Music Festival
sub property of: event

links to Gaelic Games Player
comment: Relation between Soccer Player and Gaelic Games Player
type: ObjectProperty
domain: soccer player
comment: Relazione tra Soccer Player e Gaelic Games Player @it
sub property of: person
range: Gaelic games player

links to Basketball Player
domain: soccer player
comment: Relation between Soccer Player and Basketball Player
type: ObjectProperty
comment: Relazione tra Soccer Player e Basketball Player @it
sub property of: person
range: basketball player

links to Comics Character
type: ObjectProperty
comment: Relazione tra Soccer Player e Comics Character @it
sub property of: person
comment: Relation between Soccer Player and Comics Character
range: comics character
domain: soccer player

links to American Football Team
comment: Relation between Soccer Player and American Football Team
domain: soccer player
sub property of: organização
range: american football team
type: ObjectProperty
comment: Relazione tra Soccer Player e American Football Team @it
related match: teams
type: NamedIndividual

olympic result
label: résultat de Jeux Olympiques @fr
type: Class
type: ObjectProperty

links to Mountain Range
comment: Relation between Soccer Player and Mountain Range
sub property of: place
comment: Relazione tra Soccer Player e Mountain Range @it
range: mountain range
domain: soccer player
type: ObjectProperty

Axiom
dbpedia infobox matching weight: 100.0
annotated property: relatedMatch
annotated source: links to College Coach
annotated target: after

links to Protected Area
range: protected area
comment: Relazione tra Soccer Player e Protected Area @it
type: ObjectProperty
comment: Relation between Soccer Player and Protected Area
sub property of: place
domain: soccer player

links to Auto Racing League
sub property of: organização
domain: soccer player
comment: Relation between Soccer Player and Auto Racing League
range: auto racing league
comment: Relazione tra Soccer Player e Auto Racing League @it
type: ObjectProperty

links to Astronaut
sub property of: person
comment: Relazione tra Soccer Player e Astronaut @it
type: ObjectProperty
domain: soccer player
range: astronaut
comment: Relation between Soccer Player and Astronaut

links to Newspaper
type: ObjectProperty
comment: Relation between Soccer Player and Newspaper
comment: Relazione tra Soccer Player e Newspaper @it
range: newspaper
domain: soccer player
sub property of: work

links to Language
type: ObjectProperty
sub property of: language
domain: soccer player
comment: Relation between Soccer Player and Language
range: language
comment: Relazione tra Soccer Player e Language @it

links to Automobile
sub property of: mean of transportation
comment: Relazione tra Soccer Player e Automobile @it
comment: Relation between Soccer Player and Automobile
domain: soccer player
range: automobile
type: ObjectProperty

comics creator
type: Class
label: créateur de bandes dessinées @fr

links to Monarch
comment: Relation between Soccer Player and Monarch
range: monarch
comment: Relazione tra Soccer Player e Monarch @it
sub property of: person
type: ObjectProperty
domain: soccer player

aircraft
label: αεροσκάφος @el
type: Class
label: avion @fr

links to Poker Player
comment: Relazione tra Soccer Player e Poker Player @it
domain: soccer player
sub property of: person
range: poker player
comment: Relation between Soccer Player and Poker Player
type: ObjectProperty

Axiom
dbpedia infobox matching weight: 50.0
annotated property: relatedMatch
annotated target: clubs
annotated source: links to World Heritage Site

links to River
sub property of: place
domain: soccer player
comment: Relation between Soccer Player and River
range: river
comment: Relazione tra Soccer Player e River @it
type: ObjectProperty

links to Saint
sub property of: person
domain: soccer player
type: ObjectProperty
comment: Relazione tra Soccer Player e Saint @it
comment: Relation between Soccer Player and Saint
range: saint

hockey team
label: équipe de hockey @fr
type: Class

soccer player
label: joueur de football @fr
type: Class

links to Drug
sub property of: drug
domain: soccer player
type: ObjectProperty
range: drug
comment: Relazione tra Soccer Player e Drug @it
comment: Relation between Soccer Player and Drug

links to Legislature
range: legislature
comment: Relazione tra Soccer Player e Legislature @it
comment: Relation between Soccer Player and Legislature
domain: soccer player
type: ObjectProperty
sub property of: organização

reptile
type: Class

legislature
label: pouvoir législatif @fr
type: Class

links to Skyscraper
domain: soccer player
type: ObjectProperty
sub property of: place
comment: Relation between Soccer Player and Skyscraper
range: skyscraper
comment: Relazione tra Soccer Player e Skyscraper @it

Axiom
dbpedia infobox matching weight: 100.0
annotated target: youthclubs
annotated property: relatedMatch
annotated source: links to School

links to Writer
type: ObjectProperty
domain: soccer player
sub property of: person
range: writer
comment: Relazione tra Soccer Player e Writer @it
comment: Relation between Soccer Player and Writer
type: NamedIndividual
related match: clubs

links to College
comment: Relation between Soccer Player and College
comment: Relazione tra Soccer Player e College @it
domain: soccer player
type: ObjectProperty
range: college
sub property of: organização

airline
label: compagnie aérienne @fr
type: Class

links to Olympics
range: olympics
domain: soccer player
comment: Relation between Soccer Player and Olympics
sub property of: event
type: ObjectProperty
comment: Relazione tra Soccer Player e Olympics @it

monarch
label: monarque @fr
type: Class

congressman
label: membre du Congrès @fr
type: Class

Axiom
dbpedia infobox matching weight: 50.0
annotated property: relatedMatch
annotated target: youthclubs
annotated source: links to World Heritage Site

golf player
label: golfeur @fr
type: Class

Axiom
dbpedia infobox matching weight: 100.0
annotated property: relatedMatch
annotated source: links to Island
annotated target: cityofbirth

links to Badminton Player
comment: Relazione tra Soccer Player e Badminton Player @it
type: ObjectProperty
domain: soccer player
sub property of: person
comment: Relation between Soccer Player and Badminton Player
range: badminton player

links to Park
type: ObjectProperty
range: park
comment: Relazione tra Soccer Player e Park @it
comment: Relation between Soccer Player and Park
domain: soccer player
sub property of: place

links to Election
comment: Relazione tra Soccer Player e Election @it
comment: Relation between Soccer Player and Election
type: ObjectProperty
range: Election
domain: soccer player
sub property of: event

activity
label: activité @fr
label: Aktivität @de
type: ObjectProperty

nascar driver
label: pilote de la nascar @fr
type: Class

Axiom
dbpedia infobox matching weight: 100.0
annotated property: relatedMatch
annotated target: clubs
annotated source: links to Grape

journalist
label: journaliste @fr
type: Class

links to Architect
domain: soccer player
comment: Relation between Soccer Player and Architect
comment: Relazione tra Soccer Player e Architect @it
range: architect
sub property of: person
type: ObjectProperty

insect
type: Class
label: insecte @fr

film
type: Class
label: ταινία @el

Axiom
dbpedia infobox matching weight: 11.76
annotated source: links to Town
annotated property: relatedMatch
annotated target: ci

links to Hockey Team
domain: soccer player
range: hockey team
comment: Relation between Soccer Player and Hockey Team
comment: Relazione tra Soccer Player e Hockey Team @it
sub property of: organização
type: ObjectProperty

links to Ski Area
comment: Relazione tra Soccer Player e Ski Area @it
sub property of: place
domain: soccer player
type: ObjectProperty
comment: Relation between Soccer Player and Ski Area
range: ski area

american football team
label: équipe américaine de football américain @fr
type: Class

links to Christian Bishop
sub property of: person
range: Christian Bishop
domain: soccer player
type: ObjectProperty
comment: Relation between Soccer Player and Christian Bishop
comment: Relazione tra Soccer Player e Christian Bishop @it

chemical compound
label: produit chimique @fr
type: ObjectProperty
type: Class

bird
type: Class
label: oiseau @fr

links to Insect
comment: Relation between Soccer Player and Insect
range: insect
type: ObjectProperty
domain: soccer player
sub property of: species
comment: Relazione tra Soccer Player e Insect @it
type: NamedIndividual
related match: clubs

Axiom
dbpedia infobox matching weight: 95.24
annotated property: relatedMatch
annotated source: links to Administrative Region
annotated target: clubs

Gaelic games player
type: Class
label: joueur de sports gaéliques @fr

power station
type: Class

links to Race
type: ObjectProperty
domain: soccer player
comment: Relazione tra Soccer Player e Race @it
sub property of: event
range: race
comment: Relation between Soccer Player and Race

links to Game
type: ObjectProperty
range: game
domain: soccer player
comment: Relazione tra Soccer Player e Game @it
sub property of: activity
comment: Relation between Soccer Player and Game

links to Rugby Player
comment: Relazione tra Soccer Player e Rugby Player @it
range: rugby player
domain: soccer player
type: ObjectProperty
comment: Relation between Soccer Player and Rugby Player
sub property of: person

links to Trade Union
comment: Relation between Soccer Player and Trade Union
sub property of: organização
range: trade union
domain: soccer player
type: ObjectProperty
comment: Relazione tra Soccer Player e Trade Union @it
related match: title
type: NamedIndividual

musical artist
label: artista musical @pt
type: Class
label: musicien @fr

Axiom
dbpedia infobox matching weight: 100.0
annotated source: links to American Football Team
annotated target: teams
annotated property: relatedMatch

Axiom
dbpedia infobox matching weight: 100.0
annotated source: links to Village
annotated target: clubs
annotated property: relatedMatch

links to Canal
comment: Relation between Soccer Player and Canal
sub property of: place
type: ObjectProperty
comment: Relazione tra Soccer Player e Canal @it
range: canal
domain: soccer player

SoccerPlayer.owl
has author: Andrea Giovanni Nuzzolese
has author: Valentina Presutti
imports: dbpediainfoboxmatchingweight.owl
type: Ontology
imports: cpannotationschema.owl
comment: SoccerPlayer Encyclopedic Knowledge Pattern
extracted from: dbpedia.org
extracted from: en.wikipedia.org
has intent: To represent the encyclopedic knowledge expressed by an object typed as SoccerPlayer
has author: Aldo Gangemi

links to Golf League
comment: Relazione tra Soccer Player e Golf League @it
domain: soccer player
type: ObjectProperty
comment: Relation between Soccer Player and Golf League
sub property of: organização
range: golf league

park
label: parc @fr
type: Class

links to Member Of Parliament
range: member of parliament
type: ObjectProperty
comment: Relazione tra Soccer Player e Member Of Parliament @it
domain: soccer player
sub property of: person
comment: Relation between Soccer Player and Member Of Parliament

rugby player
label: joueur de rugby @fr
type: Class

links to Playboy Playmate
comment: Relation between Soccer Player and Playboy Playmate
type: ObjectProperty
comment: Relazione tra Soccer Player e Playboy Playmate @it
range: Playboy Playmate
domain: soccer player
sub property of: person

links to Mountain
range: mountain
sub property of: place
comment: Relation between Soccer Player and Mountain
type: ObjectProperty
comment: Relazione tra Soccer Player e Mountain @it
domain: soccer player

links to World Heritage Site
related match: youthclubs
type: ObjectProperty
domain: soccer player
comment: Relazione tra Soccer Player e World Heritage Site @it
related match: clubs
range: World Heritage Site
sub property of: place
comment: Relation between Soccer Player and World Heritage Site
type: NamedIndividual

american football league
type: Class

links to Criminal
sub property of: person
domain: soccer player
type: ObjectProperty
comment: Relation between Soccer Player and Criminal
range: criminal
comment: Relazione tra Soccer Player e Criminal @it

links to Museum
sub property of: place
range: museum
comment: Relation between Soccer Player and Museum
type: ObjectProperty
comment: Relazione tra Soccer Player e Museum @it
domain: soccer player

links to University
type: NamedIndividual
related match: clubs
type: ObjectProperty
comment: Relation between Soccer Player and University
domain: soccer player
related match: youthclubs
range: university
sub property of: organização
comment: Relazione tra Soccer Player e University @it

cyclist
type: Class
label: cycliste @fr

place
label: lugar @pt
label: lieu @fr
label: περιοχή @el
type: ObjectProperty

links to Figure Skater
domain: soccer player
sub property of: person
range: figure skater
type: ObjectProperty
comment: Relazione tra Soccer Player e Figure Skater @it
comment: Relation between Soccer Player and Figure Skater

Axiom
dbpedia infobox matching weight: 34.23
annotated source: links to University
annotated property: relatedMatch
annotated target: clubs

national collegiate athletic association athlete
label: athlète de la national collegiate athletic association @fr
type: Class

links to Comics Creator
comment: Relazione tra Soccer Player e Comics Creator @it
comment: Relation between Soccer Player and Comics Creator
domain: soccer player
sub property of: person
type: ObjectProperty
range: comics creator

Axiom
dbpedia infobox matching weight: 100.0
annotated target: clubs
annotated property: relatedMatch
annotated source: links to Writer

links to Band
sub property of: organização
comment: Relation between Soccer Player and Band
comment: Relazione tra Soccer Player e Band @it
domain: soccer player
type: ObjectProperty
range: Band

wrestling event
label: match de catch @fr
type: Class

infrastructure
type: ObjectProperty

basketball league
type: Class
label: ligue de basketball @fr

mountain
type: Class
label: montagne @fr
label: Βουνό @el

criminal
type: Class
label: criminel @fr

links to Continent
range: continent
type: ObjectProperty
comment: Relazione tra Soccer Player e Continent @it
sub property of: place
comment: Relation between Soccer Player and Continent
domain: soccer player

senator
type: Class
label: sénateur @fr

saint
type: Class

comedian
label: comédien @fr
type: Class

song
type: Class
label: chanson @fr

links to Military Person
type: NamedIndividual
related match: clubs
comment: Relation between Soccer Player and Military Person
sub property of: person
range: military person
domain: soccer player
type: ObjectProperty
comment: Relazione tra Soccer Player e Military Person @it

links to Bacteria
type: ObjectProperty
domain: soccer player
range: bacteria
comment: Relazione tra Soccer Player e Bacteria @it
sub property of: species
comment: Relation between Soccer Player and Bacteria

links to Television Episode
range: television episode
comment: Relation between Soccer Player and Television Episode
sub property of: work
comment: Relazione tra Soccer Player e Television Episode @it
domain: soccer player
type: ObjectProperty

Playboy Playmate
label: playmate pour Playboy @fr
type: Class

convention
type: Class
label: congrès @fr

links to Radio Station
comment: Relation between Soccer Player and Radio Station
domain: soccer player
comment: Relazione tra Soccer Player e Radio Station @it
sub property of: organização
range: radio station
type: ObjectProperty

Axiom
dbpedia infobox matching weight: 33.33
annotated property: relatedMatch
annotated target: clubs
annotated source: links to Military Unit

book
type: Class
label: livre @fr
label: βιβλίο @el
label: książka @pl
label: llibre @ca

links to Prime Minister
sub property of: person
domain: soccer player
type: ObjectProperty
range: prime minister
comment: Relazione tra Soccer Player e Prime Minister @it
comment: Relation between Soccer Player and Prime Minister

links to Military Unit
comment: Relation between Soccer Player and Military Unit
related match: youthclubs
type: NamedIndividual
related match: clubs
comment: Relazione tra Soccer Player e Military Unit @it
range: military unit
related match: caps
sub property of: organização
domain: soccer player
type: ObjectProperty

links to Historic Place
comment: Relazione tra Soccer Player e Historic Place @it
domain: soccer player
type: ObjectProperty
comment: Relation between Soccer Player and Historic Place
sub property of: place
range: historic place

device
type: ObjectProperty
label: appareil @fr

links to Arachnid
comment: Relation between Soccer Player and Arachnid
comment: Relazione tra Soccer Player e Arachnid @it
domain: soccer player
type: ObjectProperty
sub property of: species
range: arachnid

shopping mall
type: Class
label: centre commercial @fr

links to Videogames League
domain: soccer player
comment: Relation between Soccer Player and Videogames League
range: videogames league
sub property of: organização
type: ObjectProperty
comment: Relazione tra Soccer Player e Videogames League @it

links to Airport
range: airport
comment: Relation between Soccer Player and Airport
domain: soccer player
sub property of: place
type: ObjectProperty
comment: Relazione tra Soccer Player e Airport @it

bacteria
type: Class
label: bactérie @fr

links to Bone
sub property of: anatomical structure
range: bone
type: ObjectProperty
domain: soccer player
comment: Relation between Soccer Player and Bone
comment: Relazione tra Soccer Player e Bone @it

links to Cyclist
comment: Relation between Soccer Player and Cyclist
comment: Relazione tra Soccer Player e Cyclist @it
type: ObjectProperty
range: cyclist
sub property of: person
domain: soccer player

ski area
label: domaine skiable @fr
type: Class

links to Wrestler
comment: Relazione tra Soccer Player e Wrestler @it
comment: Relation between Soccer Player and Wrestler
type: ObjectProperty
range: wrestler
domain: soccer player
sub property of: person

links to American Football League
sub property of: organização
domain: soccer player
range: american football league
comment: Relazione tra Soccer Player e American Football League @it
type: ObjectProperty
comment: Relation between Soccer Player and American Football League

non-profit organisation
label: organisation à but non lucratif @fr
type: Class

rugby league
label: ligue de rugby @fr
type: Class

links to Cricketer
comment: Relation between Soccer Player and Cricketer
type: ObjectProperty
comment: Relazione tra Soccer Player e Cricketer @it
range: cricketer
sub property of: person
domain: soccer player
type: NamedIndividual
related match: after

links to Soccer League
domain: soccer player
comment: Relation between Soccer Player and Soccer League
range: soccer league
comment: Relazione tra Soccer Player e Soccer League @it
sub property of: organização
type: ObjectProperty

weapon
type: Class
label: arme @fr

links to Hotel
range: hotel
sub property of: place
type: ObjectProperty
domain: soccer player
comment: Relazione tra Soccer Player e Hotel @it
comment: Relation between Soccer Player and Hotel

drug
type: Class
label: médicament @fr
type: ObjectProperty

links to Album
related match: youthclubs
type: NamedIndividual
sub property of: work
type: ObjectProperty
domain: soccer player
comment: Relation between Soccer Player and Album
comment: Relazione tra Soccer Player e Album @it
range: album

links to Congressman
sub property of: person
domain: soccer player
comment: Relazione tra Soccer Player e Congressman @it
comment: Relation between Soccer Player and Congressman
range: congressman
type: ObjectProperty

magazine
type: Class
label: περιοδικό @el

links to Airline
type: NamedIndividual
related match: clubs
comment: Relazione tra Soccer Player e Airline @it
sub property of: organização
range: airline
domain: soccer player
comment: Relation between Soccer Player and Airline
type: ObjectProperty

links to College Coach
comment: Relazione tra Soccer Player e College Coach @it
comment: Relation between Soccer Player and College Coach
type: ObjectProperty
domain: soccer player
range: college coach
sub property of: person
type: NamedIndividual
related match: after

links to Mayor
domain: soccer player
sub property of: person
comment: Relazione tra Soccer Player e Mayor @it
type: ObjectProperty
comment: Relation between Soccer Player and Mayor
range: mayor

links to Music Genre
sub property of: music genre
type: ObjectProperty
comment: Relation between Soccer Player and Music Genre
range: music genre
comment: Relazione tra Soccer Player e Music Genre @it
domain: soccer player

canal
type: Class

military person
label: militaire @fr
type: Class

philosopher
type: Class
label: philosophe @fr

award
type: Class
label: récompense @fr
type: ObjectProperty

links to Nascar Driver
type: ObjectProperty
comment: Relazione tra Soccer Player e Nascar Driver @it
range: nascar driver
domain: soccer player
sub property of: person
comment: Relation between Soccer Player and Nascar Driver

college
type: Class

anatomical structure
type: ObjectProperty
label: structure anatomique @fr

links to Award
domain: soccer player
comment: Relation between Soccer Player and Award
range: award
type: ObjectProperty
sub property of: award
comment: Relazione tra Soccer Player e Award @it

links to Currency
type: ObjectProperty
range: currency
comment: Relazione tra Soccer Player e Currency @it
domain: soccer player
comment: Relation between Soccer Player and Currency
sub property of: currency

restaurant
type: Class

cricketer
type: Class
label: joueur de cricket @fr

links to Field Hockey League
comment: Relation between Soccer Player and Field Hockey League
domain: soccer player
sub property of: organização
comment: Relazione tra Soccer Player e Field Hockey League @it
range: field hockey league
type: ObjectProperty

single
type: Class

links to Administrative Region
type: NamedIndividual
sub property of: place
related match: ci
comment: Relation between Soccer Player and Administrative Region
comment: Relazione tra Soccer Player e Administrative Region @it
related match: clubs
range: administrative region
domain: soccer player
type: ObjectProperty

Band
label: groupe de musique @fr
type: Class
label: Musikgruppe @de
label: banda @pt

links to Historic Building
sub property of: place
comment: Relation between Soccer Player and Historic Building
domain: soccer player
type: ObjectProperty
range: historic building
comment: Relazione tra Soccer Player e Historic Building @it

links to Scientist
domain: soccer player
sub property of: person
comment: Relation between Soccer Player and Scientist
type: ObjectProperty
range: scientist
comment: Relazione tra Soccer Player e Scientist @it

links to Book
domain: soccer player
comment: Relation between Soccer Player and Book
type: ObjectProperty
comment: Relazione tra Soccer Player e Book @it
sub property of: work
range: book

town
label: ville @fr
type: Class

links to Handball League
range: handball league
comment: Relation between Soccer Player and Handball League
type: ObjectProperty
comment: Relazione tra Soccer Player e Handball League @it
sub property of: organização
domain: soccer player

university
type: Class
label: université @fr
label: πανεπιστήμιο @el

auto racing league
type: Class
label: la ligue de course automobile @fr

links to Golf Player
type: ObjectProperty
range: golf player
sub property of: person
domain: soccer player
comment: Relazione tra Soccer Player e Golf Player @it
comment: Relation between Soccer Player and Golf Player

links to Magazine
sub property of: work
type: ObjectProperty
domain: soccer player
comment: Relazione tra Soccer Player e Magazine @it
range: magazine
comment: Relation between Soccer Player and Magazine

ethnic group
label: groupe ethnique @fr
type: ObjectProperty
type: Class

links to Record Label
comment: Relation between Soccer Player and Record Label
type: ObjectProperty
sub property of: organização
domain: soccer player
comment: Relazione tra Soccer Player e Record Label @it
range: record label

artery
label: artère @fr
type: Class
label: Arterie @de

links to Ship
range: ship
domain: soccer player
comment: Relazione tra Soccer Player e Ship @it
type: ObjectProperty
comment: Relation between Soccer Player and Ship
sub property of: mean of transportation

links to Basketball Team
type: ObjectProperty
comment: Relazione tra Soccer Player e Basketball Team @it
comment: Relation between Soccer Player and Basketball Team
domain: soccer player
sub property of: organização
range: basketball team

hotel
label: hôtel @fr
type: Class

music festival
label: festival de musique @fr
type: Class

field hockey league
label: ligue d'hockey sur gazon @fr
type: Class

college coach
type: Class
label: entraîneur universitaire @fr

television episode
type: Class
label: épisode télévisé @fr

muscle
type: Class

village
label: χωριό @el
type: Class

ice hockey league
type: Class
label: ligue d'hockey sur glace @fr

links to Website
range: website
comment: Relazione tra Soccer Player e Website @it
sub property of: website
comment: Relation between Soccer Player and Website
type: ObjectProperty
domain: soccer player

links to Village
type: ObjectProperty
comment: Relazione tra Soccer Player e Village @it
domain: soccer player
comment: Relation between Soccer Player and Village
range: village
sub property of: place
type: NamedIndividual
related match: clubs

links to Video Game
comment: Relation between Soccer Player and Video Game
type: ObjectProperty
range: video game
sub property of: work
comment: Relazione tra Soccer Player e Video Game @it
domain: soccer player

links to Grape
domain: soccer player
comment: Relation between Soccer Player and Grape
comment: Relazione tra Soccer Player e Grape @it
sub property of: species
range: grape
type: ObjectProperty
type: NamedIndividual
related match: clubs

historic building
label: bâtiment historique @fr
type: Class

links to Boxer
type: ObjectProperty
comment: Relation between Soccer Player and Boxer
range: boxer
sub property of: person
domain: soccer player
comment: Relazione tra Soccer Player e Boxer @it

links to Model
comment: Relazione tra Soccer Player e Model @it
domain: soccer player
type: ObjectProperty
sub property of: person
comment: Relation between Soccer Player and Model
range: model

office holder
label: titulaire @fr
type: Class
label: Amtsinhaber @de

baseball player
label: joueur de baseball @fr
type: Class

links to Baseball Player
type: ObjectProperty
comment: Relation between Soccer Player and Baseball Player
comment: Relazione tra Soccer Player e Baseball Player @it
range: baseball player
domain: soccer player
sub property of: person

military conflict
label: conflit militaire @fr
type: Class

grape
label: raisin @fr
type: Class

website
type: ObjectProperty
type: Class
label: Ιστότοπος @el
label: site web @fr

links to Town
range: town
related match: cityofbirth
related match: ci
related match: youthclubs
type: NamedIndividual
related match: placeOfBirth
sub property of: place
type: ObjectProperty
comment: Relazione tra Soccer Player e Town @it
domain: soccer player
related match: clubs
comment: Relation between Soccer Player and Town

basketball player
label: joueur de basketball @fr
type: Class

links to Military Conflict
sub property of: event
domain: soccer player
range: military conflict
comment: Relazione tra Soccer Player e Military Conflict @it
type: ObjectProperty
comment: Relation between Soccer Player and Military Conflict

adult actor
label: erwachsener Schauspieler @de
type: Class
label: acteur adulte @fr

ice hockey player
label: joueur de hockey sur glace @fr
type: Class

Christian Bishop
type: Class
label: évêque chrétien @fr

mountain range
label: chaîne de montagne @fr
type: Class

links to Philosopher
comment: Relazione tra Soccer Player e Philosopher @it
type: ObjectProperty
comment: Relation between Soccer Player and Philosopher
sub property of: person
range: philosopher
domain: soccer player

beverage
type: ObjectProperty
type: Class
label: boisson @fr

links to Lacrosse League
domain: soccer player
sub property of: organização
type: ObjectProperty
comment: Relation between Soccer Player and Lacrosse League
range: lacrosse league
comment: Relazione tra Soccer Player e Lacrosse League @it

planet
type: Class
label: planète @fr
type: ObjectProperty

scientist
label: scientifique @fr
type: Class
label: Wissenschaftler @de

links to Shopping Mall
comment: Relation between Soccer Player and Shopping Mall
sub property of: place
domain: soccer player
comment: Relazione tra Soccer Player e Shopping Mall @it
range: shopping mall
type: ObjectProperty

links to Disease
type: ObjectProperty
range: disease
sub property of: disease
comment: Relazione tra Soccer Player e Disease @it
comment: Relation between Soccer Player and Disease
domain: soccer player

golf league
type: Class
label: ligue de golf @fr

links to American Football Player
domain: soccer player
comment: Relazione tra Soccer Player e American Football Player @it
range: american football player
sub property of: person
comment: Relation between Soccer Player and American Football Player
type: ObjectProperty

links to Broadcast
comment: Relation between Soccer Player and Broadcast
type: ObjectProperty
comment: Relazione tra Soccer Player e Broadcast @it
sub property of: organização
range: broadcast
domain: soccer player

badminton player
type: Class
label: joueur de badminton @fr

olympics
label: Jeux Olympiques @fr
type: Class

links to Governor
type: ObjectProperty
domain: soccer player
range: governor
comment: Relation between Soccer Player and Governor
comment: Relazione tra Soccer Player e Governor @it
sub property of: person

organização
type: ObjectProperty
label: organisation
label: Organisation @de

baseball league
label: ligue de baseball @fr
type: Class

links to Weapon
comment: Relation between Soccer Player and Weapon
sub property of: device
type: ObjectProperty
comment: Relazione tra Soccer Player e Weapon @it
domain: soccer player
range: weapon

bridge
type: Class
label: pont @fr

links to Rugby League
comment: Relation between Soccer Player and Rugby League
range: rugby league
type: ObjectProperty
comment: Relazione tra Soccer Player e Rugby League @it
domain: soccer player
sub property of: organização

broadcast
label: Émission de télévision @fr
type: Class

mammal
label: mammifère @fr
type: Class

island
type: Class
label: νησί @el
label: île @fr

comics character
label: personnage de bandes dessinées @fr
type: Class

event
type: ObjectProperty
label: évènement @fr

Formula One racer
label: pilote de formule 1 @fr
type: Class

links to Road
range: road
sub property of: infrastructure
type: ObjectProperty
domain: soccer player
comment: Relation between Soccer Player and Road
comment: Relazione tra Soccer Player e Road @it

skyscraper
label: gratte-ciel @fr
type: Class

links to Station
domain: soccer player
type: ObjectProperty
sub property of: place
range: station
comment: Relation between Soccer Player and Station
comment: Relazione tra Soccer Player e Station @it

links to Ethnic Group
sub property of: ethnic group
comment: Relation between Soccer Player and Ethnic Group
type: ObjectProperty
domain: soccer player
comment: Relazione tra Soccer Player e Ethnic Group @it
range: ethnic group

radio station
type: Class
label: station de radio @fr

links to Television Show
sub property of: work
comment: Relazione tra Soccer Player e Television Show @it
comment: Relation between Soccer Player and Television Show
type: ObjectProperty
domain: soccer player
range: television show

member of parliament
label: membre du Parlement @fr
type: Class

bone
label: os @fr
label: Knochen @de
type: Class

links to Office Holder
type: ObjectProperty
domain: soccer player
sub property of: person
comment: Relazione tra Soccer Player e Office Holder @it
comment: Relation between Soccer Player and Office Holder
range: office holder
related match: after
type: NamedIndividual

conifer
label: conifères @fr
type: Class

airport
label: aéroport @fr
label: Flughafen @de
type: Class

links to Adult Actor
type: ObjectProperty
range: adult actor
domain: soccer player
comment: Relazione tra Soccer Player e Adult Actor @it
comment: Relation between Soccer Player and Adult Actor
sub property of: person