Axiom
dbpedia infobox matching weight: 100.0
annotated source: links to Book
annotated property: relatedMatch
annotated target: related

television show
type: Class
label: émission de télévision @fr

Axiom
dbpedia infobox matching weight: 1.75
annotated property: relatedMatch
annotated target: director
annotated source: links to American Football Player

Axiom
dbpedia infobox matching weight: 14.29
annotated target: creator
annotated source: links to Military Person
annotated property: relatedMatch

links to Brain
range: brain
comment: Relation between Television Show and Brain
domain: television show
comment: Relazione tra Television Show e Brain @it
sub property of: anatomical structure
type: ObjectProperty

automobile
type: Class

colour
type: Class
label: couleur @fr
label: χρώμα @el
type: ObjectProperty

Election
label: élection @fr
type: Class

Axiom
dbpedia infobox matching weight: 10.53
annotated property: relatedMatch
annotated source: links to Model
annotated target: presenter

Axiom
dbpedia infobox matching weight: 100.0
annotated property: relatedMatch
annotated source: links to Magazine
annotated target: starring

mean of transportation
type: ObjectProperty
label: moyen de transport @fr

links to Planet
type: ObjectProperty
comment: Relation between Television Show and Planet
comment: Relazione tra Television Show e Planet @it
range: planet
sub property of: planet
domain: television show

Axiom
dbpedia infobox matching weight: 90.91
annotated property: relatedMatch
annotated target: starring
annotated source: links to Adult Actor

soccer league
label: ligue de football @fr
type: Class

Axiom
dbpedia infobox matching weight: 32.24
annotated property: relatedMatch
annotated source: links to Journalist
annotated target: starring

links to Newspaper
sub property of: work
comment: Relazione tra Television Show e Newspaper @it
domain: television show
type: ObjectProperty
range: newspaper
comment: Relation between Television Show and Newspaper

links to Stadium
related match: location
type: NamedIndividual
type: ObjectProperty
sub property of: place
domain: television show
comment: Relation between Television Show and Stadium
comment: Relazione tra Television Show e Stadium @it
range: stadium

Axiom
dbpedia infobox matching weight: 9.09
annotated source: links to Basketball Player
annotated property: relatedMatch
annotated target: judges

links to Hotel
type: ObjectProperty
sub property of: place
comment: Relazione tra Television Show e Hotel @it
range: hotel
domain: television show
comment: Relation between Television Show and Hotel

wrestler
type: Class
label: lutteur @fr

Axiom
dbpedia infobox matching weight: 100.0
annotated target: location
annotated property: relatedMatch
annotated source: links to Island

Axiom
dbpedia infobox matching weight: 4.55
annotated property: relatedMatch
annotated target: presenter
annotated source: links to Adult Actor

species
label: espèce @fr
type: ObjectProperty

Axiom
dbpedia infobox matching weight: 1.27
annotated target: aux
annotated property: relatedMatch
annotated source: links to Comedian

Axiom
dbpedia infobox matching weight: 7.69
annotated property: relatedMatch
annotated target: writer
annotated source: links to Member Of Parliament

road
type: Class
label: route @fr

Axiom
dbpedia infobox matching weight: 40.0
annotated property: relatedMatch
annotated source: links to Figure Skater
annotated target: judges

Axiom
dbpedia infobox matching weight: 8.16
annotated property: relatedMatch
annotated target: pundits
annotated source: links to Soccer Player

boxer
type: Class
label: boxeur @fr

judge
label: juge @fr
type: Class

World Heritage Site
type: Class
label: site du patrimoine mondial @fr

Women's Tennis Association tournament
label: Tournoi de la Women's Tennis Association @fr
type: Class

Axiom
dbpedia infobox matching weight: 50.0
annotated property: relatedMatch
annotated target: network
annotated source: links to Mammal

station
type: Class

links to Convention
comment: Relazione tra Television Show e Convention @it
domain: television show
sub property of: event
range: convention
type: ObjectProperty
comment: Relation between Television Show and Convention

links to Space Shuttle
range: space shuttle
comment: Relazione tra Television Show e Space Shuttle @it
comment: Relation between Television Show and Space Shuttle
domain: television show
sub property of: mean of transportation
type: ObjectProperty

Axiom
dbpedia infobox matching weight: 2.04
annotated source: links to Soccer Player
annotated target: judges
annotated property: relatedMatch

lake
type: Class
label: lac @fr

links to Shopping Mall
domain: television show
comment: Relation between Television Show and Shopping Mall
sub property of: place
comment: Relazione tra Television Show e Shopping Mall @it
type: ObjectProperty
range: shopping mall

Axiom
dbpedia infobox matching weight: 0.64
annotated source: links to Comedian
annotated target: judges
annotated property: relatedMatch

links to Comics Character
comment: Relazione tra Television Show e Comics Character @it
range: comics character
type: ObjectProperty
sub property of: person
domain: television show
comment: Relation between Television Show and Comics Character

arachnid
label: arachnides @fr
type: Class

links to Historic Place
related match: location
type: NamedIndividual
comment: Relazione tra Television Show e Historic Place @it
comment: Relation between Television Show and Historic Place
range: historic place
domain: television show
sub property of: place
type: ObjectProperty

governor
type: Class
label: gouverneur @fr

Axiom
dbpedia infobox matching weight: 100.0
annotated property: relatedMatch
annotated target: starring
annotated source: links to Playboy Playmate

Axiom
dbpedia infobox matching weight: 25.0
annotated target: judges
annotated property: relatedMatch
annotated source: links to Rugby Player

poker player
type: Class
label: joueur de poker @fr

Axiom
dbpedia infobox matching weight: 0.48
annotated property: relatedMatch
annotated target: winners
annotated source: links to Comedian

ship
type: Class
label: navire @fr

fish
type: Class
label: poisson @fr

tennis player
label: joueur de tennis @fr
type: Class

links to Game
range: game
comment: Relazione tra Television Show e Game @it
sub property of: activity
domain: television show
comment: Relation between Television Show and Game
type: ObjectProperty

links to Grand Prix
comment: Relation between Television Show and Grand Prix
range: Grand Prix
sub property of: event
domain: television show
type: ObjectProperty
comment: Relazione tra Television Show e Grand Prix @it

links to Launch Pad
comment: Relazione tra Television Show e Launch Pad @it
domain: television show
range: launch pad
sub property of: place
type: ObjectProperty
comment: Relation between Television Show and Launch Pad

Axiom
dbpedia infobox matching weight: 40.0
annotated property: relatedMatch
annotated target: presenter
annotated source: links to Cricketer

links to Ice Hockey Player
comment: Relation between Television Show and Ice Hockey Player
related match: voices
related match: presenter
comment: Relazione tra Television Show e Ice Hockey Player @it
related match: writer
sub property of: person
domain: television show
type: NamedIndividual
range: ice hockey player
related match: director
related match: starring
type: ObjectProperty
related match: cameras

prime minister
label: premier ministre @fr
type: Class

race
label: course @fr
type: Class

Axiom
dbpedia infobox matching weight: 1.4
annotated property: relatedMatch
annotated target: aux
annotated source: links to Journalist

links to Reptile
sub property of: species
range: reptile
domain: television show
type: ObjectProperty
comment: Relazione tra Television Show e Reptile @it
comment: Relation between Television Show and Reptile

links to Ethnic Group
sub property of: ethnic group
comment: Relation between Television Show and Ethnic Group
range: ethnic group
type: ObjectProperty
comment: Relazione tra Television Show e Ethnic Group @it
domain: television show

links to Comedian
related match: writer
related match: director
related match: scenicArtDesign
related match: starring
range: comedian
related match: executiveProducer
domain: television show
related match: developer
related match: creator
type: NamedIndividual
related match: aux
related match: voices
related match: composer
comment: Relazione tra Television Show e Comedian @it
related match: presenter
related match: tvSeriesWrittenBy
related match: judges
comment: Relation between Television Show and Comedian
related match: winners
sub property of: person
type: ObjectProperty
related match: producer
related match: narrated

hospital
type: Class
label: hôpital @fr

links to Comics Creator
related match: producer
type: ObjectProperty
related match: createdBy
related match: voices
sub property of: person
range: comics creator
type: NamedIndividual
related match: executiveProducer
domain: television show
related match: writer
comment: Relazione tra Television Show e Comics Creator @it
related match: starring
related match: developer
related match: company
comment: Relation between Television Show and Comics Creator
related match: creator

Axiom
dbpedia infobox matching weight: 33.33
annotated source: links to Criminal
annotated target: writer
annotated property: relatedMatch

links to Record Label
related match: distributor
type: NamedIndividual
comment: Relazione tra Television Show e Record Label @it
type: ObjectProperty
range: record label
domain: television show
comment: Relation between Television Show and Record Label
sub property of: organisation

lunar crater
label: cratère lunaire @fr
type: Class

links to Videogames League
type: ObjectProperty
comment: Relation between Television Show and Videogames League
domain: television show
comment: Relazione tra Television Show e Videogames League @it
sub property of: organisation
range: videogames league

links to Protected Area
domain: television show
comment: Relazione tra Television Show e Protected Area @it
type: ObjectProperty
range: protected area
comment: Relation between Television Show and Protected Area
sub property of: place

links to Drug
comment: Relation between Television Show and Drug
range: drug
sub property of: drug
comment: Relazione tra Television Show e Drug @it
domain: television show
type: ObjectProperty

links to Military Person
comment: Relazione tra Television Show e Military Person @it
related match: creator
related match: writer
range: military person
type: ObjectProperty
type: NamedIndividual
domain: television show
related match: starring
comment: Relation between Television Show and Military Person
sub property of: person

Axiom
dbpedia infobox matching weight: 61.76
annotated source: links to Office Holder
annotated property: relatedMatch
annotated target: starring

Axiom
dbpedia infobox matching weight: 1.4
annotated target: creator
annotated property: relatedMatch
annotated source: links to Journalist

album
type: Class
label: Album @de

president
type: Class
label: président @fr

moss
type: Class
label: mousses @fr

Axiom
dbpedia infobox matching weight: 6.05
annotated target: voices
annotated source: links to Comedian
annotated property: relatedMatch

links to Ship
comment: Relazione tra Television Show e Ship @it
type: ObjectProperty
domain: television show
comment: Relation between Television Show and Ship
range: ship
sub property of: mean of transportation

links to Monarch
comment: Relazione tra Television Show e Monarch @it
comment: Relation between Television Show and Monarch
domain: television show
sub property of: person
range: monarch
type: ObjectProperty

links to Lunar Crater
comment: Relazione tra Television Show e Lunar Crater @it
comment: Relation between Television Show and Lunar Crater
domain: television show
range: lunar crater
sub property of: place
type: ObjectProperty

Axiom
dbpedia infobox matching weight: 4.08
annotated target: creator
annotated source: links to Soccer Player
annotated property: relatedMatch

military unit
type: Class
label: unité militaire @fr

links to British Royalty
domain: television show
sub property of: person
comment: Relazione tra Television Show e British Royalty @it
type: ObjectProperty
range: British royalty
comment: Relation between Television Show and British Royalty

links to Rugby Player
related match: starring
type: NamedIndividual
related match: writer
comment: Relation between Television Show and Rugby Player
domain: television show
comment: Relazione tra Television Show e Rugby Player @it
sub property of: person
related match: executiveProducer
related match: presenter
type: ObjectProperty
range: rugby player
related match: judges

soccer manager
type: Class
label: entraîneur de football @fr

basketball team
type: Class

links to Model
range: model
type: ObjectProperty
comment: Relation between Television Show and Model
related match: judges
comment: Relazione tra Television Show e Model @it
domain: television show
sub property of: person
related match: presenter
related match: starring
type: NamedIndividual
related match: voices
related match: aux

links to Congressman
related match: voices
related match: starring
domain: television show
type: NamedIndividual
comment: Relation between Television Show and Congressman
type: ObjectProperty
range: congressman
comment: Relazione tra Television Show e Congressman @it
sub property of: person

cycad
label: cycadophytes @fr
type: Class

Axiom
dbpedia infobox matching weight: 50.0
annotated target: company
annotated property: relatedMatch
annotated source: links to Mammal

Axiom
dbpedia infobox matching weight: 100.0
annotated property: relatedMatch
annotated target: starring
annotated source: links to Architect

links to Fungus
range: fungus
sub property of: species
comment: Relazione tra Television Show e Fungus @it
type: ObjectProperty
comment: Relation between Television Show and Fungus
domain: television show

links to Television Episode
sub property of: work
domain: television show
comment: Relation between Television Show and Television Episode
comment: Relazione tra Television Show e Television Episode @it
type: ObjectProperty
range: television episode
type: NamedIndividual
related match: executiveProducer

crustacean
type: Class
label: crustacés @fr

links to Grape
range: grape
domain: television show
sub property of: species
comment: Relazione tra Television Show e Grape @it
type: ObjectProperty
comment: Relation between Television Show and Grape

Axiom
dbpedia infobox matching weight: 50.0
annotated target: aux
annotated source: links to Tennis Player
annotated property: relatedMatch

film festival
type: Class
label: festival du film @fr

Axiom
dbpedia infobox matching weight: 16.67
annotated source: links to Comics Creator
annotated target: writer
annotated property: relatedMatch

links to Town
comment: Relation between Television Show and Town
range: town
comment: Relazione tra Television Show e Town @it
type: ObjectProperty
sub property of: place
domain: television show
type: NamedIndividual
related match: location

links to Poker Player
comment: Relation between Television Show and Poker Player
sub property of: person
comment: Relazione tra Television Show e Poker Player @it
range: poker player
related match: director
related match: starring
domain: television show
related match: creator
type: NamedIndividual
type: ObjectProperty

Axiom
dbpedia infobox matching weight: 2.94
annotated property: relatedMatch
annotated source: links to Office Holder
annotated target: presenter

links to Wrestling Event
comment: Relation between Television Show and Wrestling Event
type: ObjectProperty
comment: Relazione tra Television Show e Wrestling Event @it
domain: television show
sub property of: event
range: wrestling event

links to Prime Minister
domain: television show
sub property of: person
type: ObjectProperty
comment: Relazione tra Television Show e Prime Minister @it
range: prime minister
comment: Relation between Television Show and Prime Minister
type: NamedIndividual
related match: starring

links to Album
comment: Relazione tra Television Show e Album @it
domain: television show
type: ObjectProperty
comment: Relation between Television Show and Album
range: album
sub property of: work

lighthouse
label: phare @fr
type: Class

links to Auto Racing League
sub property of: organisation
comment: Relazione tra Television Show e Auto Racing League @it
comment: Relation between Television Show and Auto Racing League
type: ObjectProperty
domain: television show
range: auto racing league

aircraft
label: avion @fr
type: Class
label: αεροσκάφος @el

Axiom
dbpedia infobox matching weight: 2.94
annotated property: relatedMatch
annotated source: links to Office Holder
annotated target: producer

Axiom
dbpedia infobox matching weight: 100.0
annotated target: title
annotated property: relatedMatch
annotated source: links to Award

links to Judge
comment: Relazione tra Television Show e Judge @it
type: ObjectProperty
sub property of: person
comment: Relation between Television Show and Judge
range: judge
domain: television show

Axiom
dbpedia infobox matching weight: 5.0
annotated target: writer
annotated source: links to Ice Hockey Player
annotated property: relatedMatch

links to Website
domain: television show
comment: Relation between Television Show and Website
related match: network
sub property of: website
type: NamedIndividual
comment: Relazione tra Television Show e Website @it
related match: channel
range: website
type: ObjectProperty

links to American Football League
domain: television show
comment: Relation between Television Show and American Football League
range: american football league
type: ObjectProperty
comment: Relazione tra Television Show e American Football League @it
sub property of: organisation

legislature
label: pouvoir législatif @fr
type: Class

links to Amphibian
comment: Relazione tra Television Show e Amphibian @it
range: amphibian
sub property of: species
comment: Relation between Television Show and Amphibian
domain: television show
type: ObjectProperty

airline
type: Class
label: compagnie aérienne @fr

Axiom
dbpedia infobox matching weight: 67.52
annotated property: relatedMatch
annotated target: starring
annotated source: links to Comedian

monarch
type: Class
label: monarque @fr

Axiom
dbpedia infobox matching weight: 12.5
annotated target: executiveProducer
annotated property: relatedMatch
annotated source: links to College Coach

golf player
label: golfeur @fr
type: Class

nascar driver
type: Class
label: pilote de la nascar @fr

space mission
type: Class
label: διαστημική αποστολή @el
label: mission spatiale @fr

Axiom
dbpedia infobox matching weight: 100.0
annotated source: links to Record Label
annotated target: distributor
annotated property: relatedMatch

insect
label: insecte @fr
type: Class

Axiom
dbpedia infobox matching weight: 100.0
annotated property: relatedMatch
annotated source: links to Golf Player
annotated target: starring

Axiom
dbpedia infobox matching weight: 36.0
annotated property: relatedMatch
annotated target: starring
annotated source: links to Wrestler

links to Astronaut
type: NamedIndividual
related match: starring
type: ObjectProperty
comment: Relazione tra Television Show e Astronaut @it
domain: television show
comment: Relation between Television Show and Astronaut
sub property of: person
range: astronaut

Axiom
dbpedia infobox matching weight: 15.38
annotated target: voices
annotated property: relatedMatch
annotated source: links to Member Of Parliament

Supreme Court of the United States case
label: cas juridique de la Cour suprême des États-Unis @fr
type: Class

links to Pope
range: pope
comment: Relazione tra Television Show e Pope @it
domain: television show
comment: Relation between Television Show and Pope
sub property of: person
type: ObjectProperty

Gaelic games player
label: joueur de sports gaéliques @fr
type: Class

links to Legislature
comment: Relation between Television Show and Legislature
type: ObjectProperty
range: legislature
sub property of: organisation
comment: Relazione tra Television Show e Legislature @it
domain: television show

fungus
type: Class
label: fungi @fr

links to Rocket
comment: Relation between Television Show and Rocket
type: ObjectProperty
comment: Relazione tra Television Show e Rocket @it
sub property of: mean of transportation
range: rocket
domain: television show

links to Muscle
domain: television show
range: muscle
type: ObjectProperty
sub property of: anatomical structure
comment: Relazione tra Television Show e Muscle @it
comment: Relation between Television Show and Muscle

links to Music Festival
comment: Relation between Television Show and Music Festival
comment: Relazione tra Television Show e Music Festival @it
type: ObjectProperty
range: music festival
sub property of: event
domain: television show

links to Continent
range: continent
sub property of: place
domain: television show
comment: Relation between Television Show and Continent
comment: Relazione tra Television Show e Continent @it
type: ObjectProperty

park
type: Class
label: parc @fr

brain
label: cerveau @fr
type: Class

links to Member Of Parliament
related match: voices
related match: creator
comment: Relazione tra Television Show e Member Of Parliament @it
related match: starring
sub property of: person
type: ObjectProperty
comment: Relation between Television Show and Member Of Parliament
related match: presenter
type: NamedIndividual
related match: writer
range: member of parliament
domain: television show

Axiom
dbpedia infobox matching weight: 3.82
annotated source: links to Comedian
annotated target: presenter
annotated property: relatedMatch

cardinal
type: Class

rugby player
type: Class
label: joueur de rugby @fr

american football league
type: Class

Axiom
dbpedia infobox matching weight: 8.82
annotated target: writer
annotated property: relatedMatch
annotated source: links to Office Holder

cyclist
label: cycliste @fr
type: Class

Axiom
dbpedia infobox matching weight: 60.0
annotated source: links to Senator
annotated target: starring
annotated property: relatedMatch

national collegiate athletic association athlete
type: Class
label: athlète de la national collegiate athletic association @fr

links to Beverage
type: NamedIndividual
related match: studios
domain: television show
comment: Relation between Television Show and Beverage
range: beverage
sub property of: beverage
type: ObjectProperty
comment: Relazione tra Television Show e Beverage @it

links to Colour
comment: Relazione tra Television Show e Colour @it
comment: Relation between Television Show and Colour
range: colour
sub property of: colour
domain: television show
type: ObjectProperty

wrestling event
type: Class
label: match de catch @fr

Axiom
dbpedia infobox matching weight: 5.88
annotated source: links to Office Holder
annotated property: relatedMatch
annotated target: voices

Axiom
dbpedia infobox matching weight: 100.0
annotated property: relatedMatch
annotated target: location
annotated source: links to Historic Place

basketball league
label: ligue de basketball @fr
type: Class

Axiom
dbpedia infobox matching weight: 11.11
annotated source: links to Poker Player
annotated target: creator
annotated property: relatedMatch

links to Book
related match: related
type: NamedIndividual
sub property of: work
type: ObjectProperty
comment: Relazione tra Television Show e Book @it
comment: Relation between Television Show and Book
domain: television show
range: book

senator
type: Class
label: sénateur @fr

saint
type: Class

Axiom
dbpedia infobox matching weight: 20.0
annotated property: relatedMatch
annotated target: voices
annotated source: links to Figure Skater

Axiom
dbpedia infobox matching weight: 33.33
annotated source: links to Criminal
annotated target: supervisingStoryEd
annotated property: relatedMatch

Axiom
dbpedia infobox matching weight: 10.0
annotated property: relatedMatch
annotated source: links to Ice Hockey Player
annotated target: director

convention
type: Class
label: congrès @fr

Axiom
dbpedia infobox matching weight: 7.14
annotated property: relatedMatch
annotated target: executiveProducer
annotated source: links to Comics Creator

book
label: książka @pl
label: llibre @ca
label: βιβλίο @el
label: livre @fr
type: Class

device
type: ObjectProperty
label: appareil @fr

shopping mall
label: centre commercial @fr
type: Class

links to Fern
sub property of: species
comment: Relation between Television Show and Fern
type: ObjectProperty
range: fern
comment: Relazione tra Television Show e Fern @it
domain: television show

Axiom
dbpedia infobox matching weight: 25.0
annotated source: links to Website
annotated property: relatedMatch
annotated target: channel

ski area
type: Class
label: domaine skiable @fr

Axiom
dbpedia infobox matching weight: 4.0
annotated property: relatedMatch
annotated source: links to Wrestler
annotated target: presenter

space station
type: Class
label: station spatiale @fr

non-profit organisation
label: organisation à but non lucratif @fr
type: Class

Axiom
dbpedia infobox matching weight: 33.33
annotated source: links to Formula One Racer
annotated property: relatedMatch
annotated target: presenter

canadian football league
type: Class

links to Governor
range: governor
comment: Relation between Television Show and Governor
comment: Relazione tra Television Show e Governor @it
domain: television show
sub property of: person
type: ObjectProperty

rugby league
label: ligue de rugby @fr
type: Class

Axiom
dbpedia infobox matching weight: 66.67
annotated source: links to Formula One Racer
annotated property: relatedMatch
annotated target: starring

wine region
type: Class
label: région viticole @fr

links to Mollusca
comment: Relation between Television Show and Mollusca
comment: Relazione tra Television Show e Mollusca @it
type: ObjectProperty
domain: television show
range: mollusca
sub property of: species

weapon
type: Class
label: arme @fr

links to National Collegiate Athletic Association Athlete
range: national collegiate athletic association athlete
type: ObjectProperty
comment: Relazione tra Television Show e National Collegiate Athletic Association Athlete @it
comment: Relation between Television Show and National Collegiate Athletic Association Athlete
domain: television show
sub property of: person

links to Womens Tennis Association Tournament
type: ObjectProperty
comment: Relation between Television Show and Womens Tennis Association Tournament
range: Women's Tennis Association tournament
sub property of: event
domain: television show
comment: Relazione tra Television Show e Womens Tennis Association Tournament @it

Axiom
dbpedia infobox matching weight: 8.0
annotated property: relatedMatch
annotated target: executiveProducer
annotated source: links to Wrestler

links to Soccer League
sub property of: organisation
comment: Relazione tra Television Show e Soccer League @it
range: soccer league
domain: television show
comment: Relation between Television Show and Soccer League
type: ObjectProperty

links to Bacteria
type: ObjectProperty
range: bacteria
sub property of: species
domain: television show
comment: Relazione tra Television Show e Bacteria @it
comment: Relation between Television Show and Bacteria

philosopher
label: philosophe @fr
type: Class

links to Canadian Football Team
type: ObjectProperty
range: canadian football team
comment: Relazione tra Television Show e Canadian Football Team @it
comment: Relation between Television Show and Canadian Football Team
domain: television show
sub property of: organisation

Axiom
dbpedia infobox matching weight: 5.0
annotated source: links to Ice Hockey Player
annotated target: voices
annotated property: relatedMatch

TelevisionShow.owl
comment: TelevisionShow Encyclopedic Knowledge Pattern
type: Ontology
imports: dbpediainfoboxmatchingweight.owl
imports: cpannotationschema.owl
extracted from: en.wikipedia.org
has author: Andrea Giovanni Nuzzolese
extracted from: dbpedia.org
has intent: To represent the encyclopedic knowledge expressed by an object typed as TelevisionShow
has author: Aldo Gangemi
has author: Valentina Presutti

Axiom
dbpedia infobox matching weight: 8.82
annotated property: relatedMatch
annotated source: links to Office Holder
annotated target: executiveProducer

sport
type: Class

Axiom
dbpedia infobox matching weight: 17.89
annotated target: judges
annotated property: relatedMatch
annotated source: links to Model

restaurant
type: Class

links to Road
type: ObjectProperty
comment: Relazione tra Television Show e Road @it
range: road
domain: television show
sub property of: infrastructure
comment: Relation between Television Show and Road

nerve
type: Class
label: nerf @fr

links to Nerve
domain: television show
comment: Relation between Television Show and Nerve
sub property of: anatomical structure
type: ObjectProperty
comment: Relazione tra Television Show e Nerve @it
range: nerve

town
label: ville @fr
type: Class

university
label: πανεπιστήμιο @el
label: université @fr
type: Class

Axiom
dbpedia infobox matching weight: 100.0
annotated property: relatedMatch
annotated source: links to Astronaut
annotated target: starring

auto racing league
label: la ligue de course automobile @fr
type: Class

links to Trade Union
domain: television show
range: trade union
type: ObjectProperty
sub property of: organisation
comment: Relazione tra Television Show e Trade Union @it
comment: Relation between Television Show and Trade Union

links to Arachnid
comment: Relazione tra Television Show e Arachnid @it
comment: Relation between Television Show and Arachnid
type: ObjectProperty
range: arachnid
domain: television show
sub property of: species

Axiom
dbpedia infobox matching weight: 0.47
annotated source: links to Journalist
annotated property: relatedMatch
annotated target: judges

links to Moss
type: ObjectProperty
sub property of: species
comment: Relazione tra Television Show e Moss @it
range: moss
domain: television show
comment: Relation between Television Show and Moss

artery
label: Arterie @de
type: Class
label: artère @fr

links to Station
sub property of: place
range: station
domain: television show
comment: Relazione tra Television Show e Station @it
type: ObjectProperty
comment: Relation between Television Show and Station

hotel
label: hôtel @fr
type: Class

music festival
label: festival de musique @fr
type: Class

links to Embryology
domain: television show
type: ObjectProperty
comment: Relazione tra Television Show e Embryology @it
range: embryology
sub property of: anatomical structure
comment: Relation between Television Show and Embryology

Axiom
dbpedia infobox matching weight: 3.57
annotated property: relatedMatch
annotated target: starring
annotated source: links to Comics Creator

Axiom
dbpedia infobox matching weight: 4.76
annotated target: voices
annotated property: relatedMatch
annotated source: links to Comics Creator

muscle
type: Class

village
type: Class
label: χωριό @el

Axiom
dbpedia infobox matching weight: 1.19
annotated property: relatedMatch
annotated target: company
annotated source: links to Comics Creator

ice hockey league
label: ligue d'hockey sur glace @fr
type: Class

Axiom
dbpedia infobox matching weight: 14.29
annotated property: relatedMatch
annotated target: director
annotated source: links to Soccer Manager

Axiom
dbpedia infobox matching weight: 12.5
annotated target: creator percent 28s percent 29
annotated property: relatedMatch
annotated source: links to College Coach

links to Aircraft
domain: television show
comment: Relazione tra Television Show e Aircraft @it
comment: Relation between Television Show and Aircraft
sub property of: mean of transportation
range: aircraft
type: ObjectProperty

office holder
label: titulaire @fr
label: Amtsinhaber @de
type: Class

baseball player
label: joueur de baseball @fr
type: Class

website
type: ObjectProperty
type: Class
label: Ιστότοπος @el
label: site web @fr

grape
label: raisin @fr
type: Class

Axiom
dbpedia infobox matching weight: 16.67
annotated property: relatedMatch
annotated source: links to Scientist
annotated target: writer

links to Baseball League
comment: Relazione tra Television Show e Baseball League @it
domain: television show
range: baseball league
sub property of: organisation
comment: Relation between Television Show and Baseball League
type: ObjectProperty

Axiom
dbpedia infobox matching weight: 2.04
annotated source: links to Soccer Player
annotated property: relatedMatch
annotated target: developer

links to Cave
comment: Relazione tra Television Show e Cave @it
sub property of: place
type: ObjectProperty
domain: television show
comment: Relation between Television Show and Cave
range: cave

links to Scientist
related match: creator
comment: Relazione tra Television Show e Scientist @it
related match: writer
type: ObjectProperty
domain: television show
comment: Relation between Television Show and Scientist
related match: starring
sub property of: person
range: scientist
type: NamedIndividual

basketball player
label: joueur de basketball @fr
type: Class

links to Bridge
range: bridge
type: ObjectProperty
comment: Relazione tra Television Show e Bridge @it
domain: television show
sub property of: place
comment: Relation between Television Show and Bridge

adult actor
label: erwachsener Schauspieler @de
type: Class
label: acteur adulte @fr

links to Award
sub property of: award
domain: television show
comment: Relation between Television Show and Award
comment: Relazione tra Television Show e Award @it
type: ObjectProperty
range: award
related match: title
type: NamedIndividual

Axiom
dbpedia infobox matching weight: 1.05
annotated source: links to Model
annotated target: voices
annotated property: relatedMatch

links to Ice Hockey League
domain: television show
comment: Relazione tra Television Show e Ice Hockey League @it
range: ice hockey league
type: ObjectProperty
comment: Relation between Television Show and Ice Hockey League
sub property of: organisation

ice hockey player
label: joueur de hockey sur glace @fr
type: Class

Axiom
dbpedia infobox matching weight: 2.04
annotated property: relatedMatch
annotated target: producer
annotated source: links to Soccer Player

Axiom
dbpedia infobox matching weight: 50.0
annotated source: links to Tennis Player
annotated property: relatedMatch
annotated target: starring

Axiom
dbpedia infobox matching weight: 90.91
annotated target: starring
annotated property: relatedMatch
annotated source: links to Basketball Player

links to Criminal
related match: supervisingStoryEd
related match: creator
domain: television show
type: NamedIndividual
type: ObjectProperty
comment: Relation between Television Show and Criminal
range: criminal
sub property of: person
comment: Relazione tra Television Show e Criminal @it
related match: writer

links to Locomotive
comment: Relazione tra Television Show e Locomotive @it
domain: television show
range: locomotive
comment: Relation between Television Show and Locomotive
type: ObjectProperty
sub property of: mean of transportation

links to Volleyball League
comment: Relazione tra Television Show e Volleyball League @it
sub property of: organisation
type: ObjectProperty
range: volleyball league
comment: Relation between Television Show and Volleyball League
domain: television show

beverage
label: boisson @fr
type: Class
type: ObjectProperty

Axiom
dbpedia infobox matching weight: 100.0
annotated property: relatedMatch
annotated target: aux
annotated source: links to Automobile

Axiom
dbpedia infobox matching weight: 0.93
annotated source: links to Journalist
annotated target: before
annotated property: relatedMatch

planet
type: Class
label: planète @fr
type: ObjectProperty

scientist
label: scientifique @fr
type: Class
label: Wissenschaftler @de

golf league
label: ligue de golf @fr
type: Class

Axiom
dbpedia infobox matching weight: 25.0
annotated property: relatedMatch
annotated source: links to Rugby Player
annotated target: presenter

Axiom
dbpedia infobox matching weight: 0.16
annotated source: links to Comedian
annotated property: relatedMatch
annotated target: composer

Axiom
dbpedia infobox matching weight: 14.29
annotated property: relatedMatch
annotated source: links to Soccer Player
annotated target: presenter

links to Disease
domain: television show
range: disease
type: ObjectProperty
sub property of: disease
comment: Relazione tra Television Show e Disease @it
comment: Relation between Television Show and Disease

links to Site Of Special Scientific Interest
range: Site of Special Scientific Interest
comment: Relation between Television Show and Site Of Special Scientific Interest
type: ObjectProperty
comment: Relazione tra Television Show e Site Of Special Scientific Interest @it
sub property of: place
domain: television show

olympics
label: Jeux Olympiques @fr
type: Class

links to Cardinal
domain: television show
type: ObjectProperty
comment: Relazione tra Television Show e Cardinal @it
comment: Relation between Television Show and Cardinal
range: cardinal
sub property of: person

bridge
label: pont @fr
type: Class

Axiom
dbpedia infobox matching weight: 11.11
annotated property: relatedMatch
annotated source: links to Poker Player
annotated target: director

Axiom
dbpedia infobox matching weight: 42.86
annotated property: relatedMatch
annotated source: links to Soccer Manager
annotated target: voices

links to Basketball Team
comment: Relation between Television Show and Basketball Team
range: basketball team
type: ObjectProperty
sub property of: organisation
domain: television show
comment: Relazione tra Television Show e Basketball Team @it

Axiom
dbpedia infobox matching weight: 100.0
annotated property: relatedMatch
annotated target: executiveProducer
annotated source: links to Television Episode

links to Soccer Club
range: soccer club
domain: television show
comment: Relazione tra Television Show e Soccer Club @it
sub property of: organisation
comment: Relation between Television Show and Soccer Club
type: ObjectProperty

Axiom
dbpedia infobox matching weight: 42.86
annotated source: links to Soccer Manager
annotated target: starring
annotated property: relatedMatch

links to Chemical Compound
sub property of: chemical compound
comment: Relazione tra Television Show e Chemical Compound @it
type: ObjectProperty
domain: television show
comment: Relation between Television Show and Chemical Compound
range: chemical compound

vein
label: veine @fr
type: Class

links to Hospital
comment: Relation between Television Show and Hospital
type: ObjectProperty
domain: television show
comment: Relazione tra Television Show e Hospital @it
range: hospital
sub property of: place

island
label: île @fr
label: νησί @el
type: Class

comics character
type: Class
label: personnage de bandes dessinées @fr

links to Golf Player
type: NamedIndividual
related match: starring
domain: television show
comment: Relation between Television Show and Golf Player
sub property of: person
type: ObjectProperty
range: golf player
comment: Relazione tra Television Show e Golf Player @it

event
type: ObjectProperty
label: évènement @fr

links to Conifer
sub property of: species
comment: Relazione tra Television Show e Conifer @it
domain: television show
type: ObjectProperty
comment: Relation between Television Show and Conifer
range: conifer

Formula One racer
label: pilote de formule 1 @fr
type: Class

skyscraper
type: Class
label: gratte-ciel @fr

Axiom
dbpedia infobox matching weight: 45.0
annotated source: links to Ice Hockey Player
annotated property: relatedMatch
annotated target: starring

Axiom
dbpedia infobox matching weight: 5.56
annotated source: links to Gaelic Games Player
annotated target: presenter
annotated property: relatedMatch

radio station
label: station de radio @fr
type: Class

links to American Football Team
comment: Relation between Television Show and American Football Team
domain: television show
sub property of: organisation
type: ObjectProperty
comment: Relazione tra Television Show e American Football Team @it
range: american football team

member of parliament
type: Class
label: membre du Parlement @fr

bone
label: os @fr
label: Knochen @de
type: Class

links to Crustacean
type: ObjectProperty
range: crustacean
sub property of: species
comment: Relazione tra Television Show e Crustacean @it
comment: Relation between Television Show and Crustacean
domain: television show

conifer
type: Class
label: conifères @fr

airport
label: aéroport @fr
label: Flughafen @de
type: Class

Axiom
dbpedia infobox matching weight: 40.0
annotated property: relatedMatch
annotated source: links to Figure Skater
annotated target: starring

Axiom
dbpedia infobox matching weight: 0.32
annotated property: relatedMatch
annotated source: links to Comedian
annotated target: developer

links to Magazine
related match: starring
type: NamedIndividual
range: magazine
comment: Relation between Television Show and Magazine
domain: television show
sub property of: work
comment: Relazione tra Television Show e Magazine @it
type: ObjectProperty

Axiom
dbpedia infobox matching weight: 3.57
annotated target: developer
annotated source: links to Comics Creator
annotated property: relatedMatch

Axiom
dbpedia infobox matching weight: 16.67
annotated source: links to Scientist
annotated property: relatedMatch
annotated target: creator

Axiom
dbpedia infobox matching weight: 20.0
annotated target: producer
annotated property: relatedMatch
annotated source: links to Wrestler

links to Lighthouse
type: ObjectProperty
comment: Relazione tra Television Show e Lighthouse @it
comment: Relation between Television Show and Lighthouse
range: lighthouse
domain: television show
sub property of: place

rocket
type: Class
label: fusée @fr

links to Election
sub property of: event
range: Election
domain: television show
comment: Relation between Television Show and Election
type: ObjectProperty
comment: Relazione tra Television Show e Election @it

Axiom
dbpedia infobox matching weight: 84.21
annotated property: relatedMatch
annotated source: links to American Football Player
annotated target: starring

disease
label: maladie @fr
type: Class
type: ObjectProperty

Axiom
dbpedia infobox matching weight: 69.47
annotated property: relatedMatch
annotated target: starring
annotated source: links to Model

Axiom
dbpedia infobox matching weight: 2.94
annotated target: themeMusicComposer
annotated property: relatedMatch
annotated source: links to Office Holder

Axiom
dbpedia infobox matching weight: 93.75
annotated property: relatedMatch
annotated target: starring
annotated source: links to Baseball Player

links to Military Conflict
sub property of: event
comment: Relation between Television Show and Military Conflict
range: military conflict
comment: Relazione tra Television Show e Military Conflict @it
domain: television show
type: ObjectProperty

Axiom
dbpedia infobox matching weight: 2.94
annotated property: relatedMatch
annotated target: createdBy
annotated source: links to Office Holder

links to Bird
comment: Relazione tra Television Show e Bird @it
sub property of: species
domain: television show
type: ObjectProperty
range: bird
comment: Relation between Television Show and Bird

links to Mixed Martial Arts League
range: mixed martial arts league
domain: television show
sub property of: organisation
type: ObjectProperty
comment: Relazione tra Television Show e Mixed Martial Arts League @it
comment: Relation between Television Show and Mixed Martial Arts League

american football player
label: joueur de football américain @fr
type: Class

Legal Case
type: ObjectProperty
label: cas juridique @fr

stadium
type: Class
label: stade @fr

Axiom
dbpedia infobox matching weight: 2.04
annotated property: relatedMatch
annotated target: editor
annotated source: links to Soccer Player

astronaut
type: Class
label: Astronaut @de
label: astronaute @fr

Axiom
dbpedia infobox matching weight: 71.43
annotated source: links to Military Person
annotated target: starring
annotated property: relatedMatch

videogames league
label: ligue de jeux vidéo @fr
type: Class

Axiom
dbpedia infobox matching weight: 28.0
annotated target: creator
annotated property: relatedMatch
annotated source: links to Wrestler

Axiom
dbpedia infobox matching weight: 4.08
annotated property: relatedMatch
annotated target: aux
annotated source: links to Soccer Player

Axiom
dbpedia infobox matching weight: 30.0
annotated source: links to Ice Hockey Player
annotated property: relatedMatch
annotated target: presenter

Axiom
dbpedia infobox matching weight: 3.98
annotated target: writer
annotated property: relatedMatch
annotated source: links to Comedian

Site of Special Scientific Interest
type: Class
label: site d'intérêt scientifique particulier @fr

Axiom
dbpedia infobox matching weight: 100.0
annotated target: opentheme
annotated property: relatedMatch
annotated source: links to Single

mayor
type: Class
label: maire @fr

amphibian
label: amphibien @fr
type: Class

pope
type: Class
label: pape @fr

Axiom
dbpedia infobox matching weight: 20.0
annotated target: aux
annotated property: relatedMatch
annotated source: links to Cricketer

links to Christian Bishop
comment: Relation between Television Show and Christian Bishop
range: Christian Bishop
sub property of: person
domain: television show
comment: Relazione tra Television Show e Christian Bishop @it
type: ObjectProperty

Axiom
dbpedia infobox matching weight: 66.67
annotated source: links to Scientist
annotated property: relatedMatch
annotated target: starring

links to Saint
domain: television show
range: saint
type: ObjectProperty
comment: Relazione tra Television Show e Saint @it
comment: Relation between Television Show and Saint
sub property of: person

Axiom
dbpedia infobox matching weight: 6.25
annotated property: relatedMatch
annotated target: executiveProducer
annotated source: links to Rugby Player

Axiom
dbpedia infobox matching weight: 100.0
annotated target: location
annotated property: relatedMatch
annotated source: links to Town

Axiom
dbpedia infobox matching weight: 100.0
annotated source: links to University
annotated target: recorded
annotated property: relatedMatch

newspaper
label: journal @fr
type: Class

protected area
label: aire protégée @fr
label: προστατευμένη περιοχή @el
type: Class

game
type: Class
label: jeu @fr

links to Journalist
related match: before
type: NamedIndividual
related match: starring
sub property of: person
range: journalist
related match: aux
related match: creator
type: ObjectProperty
related match: presenter
comment: Relazione tra Television Show e Journalist @it
related match: judges
related match: executiveProducer
domain: television show
comment: Relation between Television Show and Journalist
related match: producer

Axiom
dbpedia infobox matching weight: 100.0
annotated property: relatedMatch
annotated source: links to Stadium
annotated target: location

Axiom
dbpedia infobox matching weight: 100.0
annotated property: relatedMatch
annotated source: links to Beverage
annotated target: studios

links to Weapon
range: weapon
comment: Relazione tra Television Show e Weapon @it
sub property of: device
type: ObjectProperty
comment: Relation between Television Show and Weapon
domain: television show

links to Village
related match: location
type: NamedIndividual
comment: Relation between Television Show and Village
range: village
sub property of: place
type: ObjectProperty
comment: Relazione tra Television Show e Village @it
domain: television show

links to Mixed Martial Arts Event
sub property of: event
range: mixed martial arts event
comment: Relation between Television Show and Mixed Martial Arts Event
comment: Relazione tra Television Show e Mixed Martial Arts Event @it
type: ObjectProperty
domain: television show

tennis league
label: ligue de tennis @fr
type: Class

Axiom
dbpedia infobox matching weight: 20.0
annotated target: storyEditor
annotated property: relatedMatch
annotated source: links to Cricketer

Axiom
dbpedia infobox matching weight: 20.0
annotated property: relatedMatch
annotated target: starring
annotated source: links to Cricketer

links to Wine Region
sub property of: place
range: wine region
domain: television show
comment: Relation between Television Show and Wine Region
type: ObjectProperty
comment: Relazione tra Television Show e Wine Region @it

Axiom
dbpedia infobox matching weight: 7.69
annotated source: links to Member Of Parliament
annotated property: relatedMatch
annotated target: creator

Axiom
dbpedia infobox matching weight: 1.75
annotated source: links to Comedian
annotated property: relatedMatch
annotated target: director

Axiom
dbpedia infobox matching weight: 4.0
annotated target: developer
annotated property: relatedMatch
annotated source: links to Wrestler

work
label: obra @pt
label: travail @fr
type: ObjectProperty

Axiom
dbpedia infobox matching weight: 60.71
annotated property: relatedMatch
annotated source: links to Comics Creator
annotated target: creator

river
label: rivière @fr
type: Class

Axiom
dbpedia infobox matching weight: 3.13
annotated property: relatedMatch
annotated source: links to Baseball Player
annotated target: judges

links to Badminton Player
type: ObjectProperty
range: badminton player
sub property of: person
domain: television show
comment: Relazione tra Television Show e Badminton Player @it
comment: Relation between Television Show and Badminton Player

links to Power Station
comment: Relation between Television Show and Power Station
range: power station
sub property of: infrastructure
comment: Relazione tra Television Show e Power Station @it
type: ObjectProperty
domain: television show

school
label: école @fr
type: Class

museum
type: Class
label: musée @fr

video game
type: Class
label: jeux vidéo @fr

trade union
type: Class
label: syndicat professionnel @fr

Axiom
dbpedia infobox matching weight: 33.33
annotated target: creator
annotated property: relatedMatch
annotated source: links to Criminal

links to Supreme Court Of The United States Case
sub property of: Legal Case
type: ObjectProperty
range: Supreme Court of the United States case
domain: television show
comment: Relation between Television Show and Supreme Court Of The United States Case
comment: Relazione tra Television Show e Supreme Court Of The United States Case @it

Axiom
dbpedia infobox matching weight: 1.75
annotated source: links to American Football Player
annotated target: creator
annotated property: relatedMatch

currency
type: ObjectProperty
type: Class
label: devise @fr

British royalty
label: royauté Britannique @fr
type: Class

Axiom
dbpedia infobox matching weight: 20.0
annotated target: executiveProducer
annotated source: links to Senator
annotated property: relatedMatch

historic place
type: Class
label: site historique @fr

Axiom
dbpedia infobox matching weight: 100.0
annotated property: relatedMatch
annotated target: director
annotated source: links to President

monument
type: Class

links to Insect
comment: Relation between Television Show and Insect
range: insect
comment: Relazione tra Television Show e Insect @it
domain: television show
sub property of: species
type: ObjectProperty

links to Canadian Football League
domain: television show
sub property of: organisation
comment: Relazione tra Television Show e Canadian Football League @it
type: ObjectProperty
range: canadian football league
comment: Relation between Television Show and Canadian Football League

Axiom
dbpedia infobox matching weight: 75.0
annotated source: links to Website
annotated property: relatedMatch
annotated target: network

links to Historic Building
comment: Relation between Television Show and Historic Building
type: ObjectProperty
domain: television show
sub property of: place
range: historic building
comment: Relazione tra Television Show e Historic Building @it

Axiom
dbpedia infobox matching weight: 15.38
annotated target: presenter
annotated property: relatedMatch
annotated source: links to Member Of Parliament

links to Canal
sub property of: place
comment: Relation between Television Show and Canal
type: ObjectProperty
comment: Relazione tra Television Show e Canal @it
domain: television show
range: canal

links to Single
type: NamedIndividual
related match: opentheme
comment: Relation between Television Show and Single
domain: television show
range: single
type: ObjectProperty
sub property of: work
comment: Relazione tra Television Show e Single @it

continent
type: Class
label: ήπειρος @el

Axiom
dbpedia infobox matching weight: 1.19
annotated property: relatedMatch
annotated target: createdBy
annotated source: links to Comics Creator

links to Rugby League
type: ObjectProperty
sub property of: organisation
domain: television show
comment: Relazione tra Television Show e Rugby League @it
comment: Relation between Television Show and Rugby League
range: rugby league

Axiom
dbpedia infobox matching weight: 4.55
annotated property: relatedMatch
annotated target: judges
annotated source: links to Adult Actor

links to Soccer Player
type: ObjectProperty
related match: starring
sub property of: person
range: soccer player
related match: creator
type: NamedIndividual
domain: television show
related match: storyEditor
comment: Relation between Television Show and Soccer Player
related match: executiveProducer
related match: aux
related match: editor
related match: pundits
related match: writtenby
related match: judges
related match: voices
related match: presenter
related match: developer
comment: Relazione tra Television Show e Soccer Player @it
related match: producer

figure skater
label: patineur artistique @fr
type: Class

Axiom
dbpedia infobox matching weight: 9.71
annotated target: creator
annotated source: links to Comedian
annotated property: relatedMatch

links to Space Mission
domain: television show
sub property of: event
comment: Relation between Television Show and Space Mission
comment: Relazione tra Television Show e Space Mission @it
type: ObjectProperty
range: space mission

person
label: personne @fr
label: pessoa @pt
type: ObjectProperty
label: Person @de

links to American Football Player
range: american football player
related match: creator
related match: producer
sub property of: person
related match: commentators
related match: executiveProducer
domain: television show
related match: director
type: NamedIndividual
related match: starring
related match: presenter
comment: Relation between Television Show and American Football Player
type: ObjectProperty
comment: Relazione tra Television Show e American Football Player @it

links to President
type: NamedIndividual
related match: director
domain: television show
range: president
comment: Relazione tra Television Show e President @it
type: ObjectProperty
sub property of: person
comment: Relation between Television Show and President

Axiom
dbpedia infobox matching weight: 0.16
annotated property: relatedMatch
annotated target: producer
annotated source: links to Comedian

canadian football team
type: Class
label: équipe canadienne de football américain @fr

music genre
label: genre musical @fr
type: ObjectProperty
label: género musical @pt
type: Class

links to University
type: ObjectProperty
range: university
domain: television show
comment: Relazione tra Television Show e University @it
comment: Relation between Television Show and University
sub property of: organisation
type: NamedIndividual
related match: recorded

record label
label: label discographique @fr
type: Class

architect
label: architecte @fr
type: Class

model
label: mannequin @fr
type: Class

ambassador
type: Class
label: ambassadeur @fr

links to Boxer
comment: Relation between Television Show and Boxer
domain: television show
type: NamedIndividual
type: ObjectProperty
related match: voices
comment: Relazione tra Television Show e Boxer @it
range: boxer
related match: starring
sub property of: person

Axiom
dbpedia infobox matching weight: 61.68
annotated source: links to Journalist
annotated property: relatedMatch
annotated target: presenter

links to Mammal
sub property of: species
related match: company
range: mammal
type: NamedIndividual
domain: television show
type: ObjectProperty
related match: network
comment: Relation between Television Show and Mammal
comment: Relazione tra Television Show e Mammal @it

links to Mountain
comment: Relazione tra Television Show e Mountain @it
domain: television show
range: mountain
sub property of: place
type: ObjectProperty
comment: Relation between Television Show and Mountain

Axiom
dbpedia infobox matching weight: 100.0
annotated property: relatedMatch
annotated source: links to Cyclist
annotated target: director

Axiom
dbpedia infobox matching weight: 2.94
annotated target: director
annotated source: links to Office Holder
annotated property: relatedMatch

Grand Prix
type: Class
label: grand prix @fr

chancellor
label: chancelier @fr
type: Class

links to World Heritage Site
comment: Relation between Television Show and World Heritage Site
type: ObjectProperty
sub property of: place
range: World Heritage Site
domain: television show
comment: Relazione tra Television Show e World Heritage Site @it

links to Office Holder
related match: createdBy
related match: themeMusicComposer
type: ObjectProperty
range: office holder
related match: voices
related match: producer
type: NamedIndividual
comment: Relation between Television Show and Office Holder
sub property of: person
related match: presenter
comment: Relazione tra Television Show e Office Holder @it
related match: director
related match: executiveProducer
related match: writer
related match: starring
domain: television show

links to Formula One Racer
comment: Relazione tra Television Show e Formula One Racer @it
domain: television show
sub property of: person
comment: Relation between Television Show and Formula One Racer
type: ObjectProperty
range: Formula One racer
related match: starring
related match: presenter
type: NamedIndividual

comics creator
label: créateur de bandes dessinées @fr
type: Class

links to Airline
comment: Relation between Television Show and Airline
domain: television show
sub property of: organisation
type: ObjectProperty
comment: Relazione tra Television Show e Airline @it
range: airline

links to Tennis Player
comment: Relation between Television Show and Tennis Player
type: ObjectProperty
type: NamedIndividual
comment: Relazione tra Television Show e Tennis Player @it
related match: starring
related match: aux
range: tennis player
domain: television show
sub property of: person

hockey team
type: Class
label: équipe de hockey @fr

soccer player
label: joueur de football @fr
type: Class

links to Automobile
range: automobile
comment: Relazione tra Television Show e Automobile @it
sub property of: mean of transportation
type: ObjectProperty
comment: Relation between Television Show and Automobile
domain: television show
related match: aux
type: NamedIndividual

links to Military Unit
comment: Relazione tra Television Show e Military Unit @it
sub property of: organisation
range: military unit
type: ObjectProperty
domain: television show
comment: Relation between Television Show and Military Unit

reptile
type: Class

Axiom
dbpedia infobox matching weight: 53.85
annotated target: starring
annotated property: relatedMatch
annotated source: links to Member Of Parliament

cave
label: grotte @fr
type: Class

Axiom
dbpedia infobox matching weight: 0.16
annotated target: scenicArtDesign
annotated property: relatedMatch
annotated source: links to Comedian

links to Film Festival
domain: television show
sub property of: event
comment: Relazione tra Television Show e Film Festival @it
range: film festival
type: ObjectProperty
comment: Relation between Television Show and Film Festival

links to School
comment: Relation between Television Show and School
sub property of: organisation
domain: television show
comment: Relazione tra Television Show e School @it
type: ObjectProperty
range: school

links to Golf League
type: ObjectProperty
comment: Relation between Television Show and Golf League
domain: television show
comment: Relazione tra Television Show e Golf League @it
sub property of: organisation
range: golf league

congressman
type: Class
label: membre du Congrès @fr

links to Monument
sub property of: place
comment: Relazione tra Television Show e Monument @it
type: ObjectProperty
domain: television show
comment: Relation between Television Show and Monument
range: monument

links to Adult Actor
related match: starring
comment: Relazione tra Television Show e Adult Actor @it
type: ObjectProperty
related match: judges
comment: Relation between Television Show and Adult Actor
domain: television show
related match: presenter
sub property of: person
type: NamedIndividual
range: adult actor

activity
type: ObjectProperty
label: Aktivität @de
label: activité @fr

journalist
type: Class
label: journaliste @fr

mixed martial arts league
type: Class
label: ligue d'arts martiaux mixtes @fr

american football team
label: équipe américaine de football américain @fr
type: Class

links to Park
domain: television show
comment: Relation between Television Show and Park
sub property of: place
type: ObjectProperty
range: park
comment: Relazione tra Television Show e Park @it

links to Music Genre
comment: Relation between Television Show and Music Genre
range: music genre
comment: Relazione tra Television Show e Music Genre @it
type: ObjectProperty
sub property of: music genre
domain: television show

Axiom
dbpedia infobox matching weight: 37.5
annotated property: relatedMatch
annotated source: links to Rugby Player
annotated target: starring

chemical compound
type: Class
type: ObjectProperty
label: produit chimique @fr

bird
label: oiseau @fr
type: Class

links to Video Game
comment: Relation between Television Show and Video Game
sub property of: work
range: video game
type: ObjectProperty
domain: television show
comment: Relazione tra Television Show e Video Game @it

power station
type: Class

Axiom
dbpedia infobox matching weight: 5.0
annotated property: relatedMatch
annotated source: links to Ice Hockey Player
annotated target: cameras

links to River
comment: Relazione tra Television Show e River @it
sub property of: place
domain: television show
comment: Relation between Television Show and River
range: river
type: ObjectProperty

fern
type: Class
label: fougères @fr

links to Green Alga
type: ObjectProperty
sub property of: species
range: green alga
domain: television show
comment: Relazione tra Television Show e Green Alga @it
comment: Relation between Television Show and Green Alga

Axiom
dbpedia infobox matching weight: 94.44
annotated target: starring
annotated source: links to Gaelic Games Player
annotated property: relatedMatch

links to Restaurant
domain: television show
comment: Relazione tra Television Show e Restaurant @it
range: restaurant
comment: Relation between Television Show and Restaurant
type: ObjectProperty
sub property of: place

links to Nascar Driver
type: NamedIndividual
related match: starring
domain: television show
comment: Relation between Television Show and Nascar Driver
type: ObjectProperty
range: nascar driver
sub property of: person
comment: Relazione tra Television Show e Nascar Driver @it

musical
type: Class
label: musique @fr

links to Artery
type: ObjectProperty
range: artery
domain: television show
comment: Relazione tra Television Show e Artery @it
sub property of: anatomical structure
comment: Relation between Television Show and Artery

links to Ski Area
range: ski area
comment: Relation between Television Show and Ski Area
sub property of: place
domain: television show
type: ObjectProperty
comment: Relazione tra Television Show e Ski Area @it

links to Soccer Manager
comment: Relation between Television Show and Soccer Manager
comment: Relazione tra Television Show e Soccer Manager @it
range: soccer manager
related match: director
type: ObjectProperty
related match: starring
type: NamedIndividual
related match: voices
domain: television show
sub property of: person

links to Bone
comment: Relazione tra Television Show e Bone @it
type: ObjectProperty
comment: Relation between Television Show and Bone
sub property of: anatomical structure
domain: television show
range: bone

place
type: ObjectProperty
label: περιοχή @el
label: lieu @fr
label: lugar @pt

links to Basketball Player
type: NamedIndividual
related match: starring
sub property of: person
range: basketball player
comment: Relazione tra Television Show e Basketball Player @it
domain: television show
type: ObjectProperty
related match: judges
comment: Relation between Television Show and Basketball Player

links to Architect
type: NamedIndividual
related match: starring
range: architect
comment: Relazione tra Television Show e Architect @it
comment: Relation between Television Show and Architect
type: ObjectProperty
domain: television show
sub property of: person

links to Hockey Team
comment: Relazione tra Television Show e Hockey Team @it
range: hockey team
sub property of: organisation
type: ObjectProperty
domain: television show
comment: Relation between Television Show and Hockey Team

infrastructure
type: ObjectProperty

mountain
label: Βουνό @el
label: montagne @fr
type: Class

criminal
label: criminel @fr
type: Class

space shuttle
label: navette spatiale @fr
type: Class

Axiom
dbpedia infobox matching weight: 2.04
annotated source: links to Soccer Player
annotated property: relatedMatch
annotated target: writtenby

links to Island
type: NamedIndividual
related match: location
range: island
comment: Relazione tra Television Show e Island @it
domain: television show
comment: Relation between Television Show and Island
type: ObjectProperty
sub property of: place

comedian
label: comédien @fr
type: Class

Axiom
dbpedia infobox matching weight: 75.0
annotated target: starring
annotated property: relatedMatch
annotated source: links to College Coach

green alga
type: Class
label: algue verte @fr

Axiom
dbpedia infobox matching weight: 16.67
annotated source: links to Boxer
annotated property: relatedMatch
annotated target: voices

Playboy Playmate
type: Class
label: playmate pour Playboy @fr

Axiom
dbpedia infobox matching weight: 50.0
annotated source: links to Congressman
annotated property: relatedMatch
annotated target: starring

Axiom
dbpedia infobox matching weight: 1.75
annotated target: producer
annotated property: relatedMatch
annotated source: links to American Football Player

links to Museum
comment: Relazione tra Television Show e Museum @it
domain: television show
sub property of: place
type: ObjectProperty
comment: Relation between Television Show and Museum
range: museum

links to Cycad
type: ObjectProperty
comment: Relation between Television Show and Cycad
comment: Relazione tra Television Show e Cycad @it
sub property of: species
range: cycad
domain: television show

Axiom
dbpedia infobox matching weight: 100.0
annotated property: relatedMatch
annotated source: links to Nascar Driver
annotated target: starring

Axiom
dbpedia infobox matching weight: 6.12
annotated target: voices
annotated source: links to Soccer Player
annotated property: relatedMatch

bacteria
label: bactérie @fr
type: Class

links to Philosopher
type: ObjectProperty
comment: Relazione tra Television Show e Philosopher @it
sub property of: person
range: philosopher
domain: television show
comment: Relation between Television Show and Philosopher

links to Mayor
range: mayor
sub property of: person
comment: Relazione tra Television Show e Mayor @it
comment: Relation between Television Show and Mayor
type: ObjectProperty
domain: television show

mollusca
type: Class
label: mollusque @fr

drug
type: Class
label: médicament @fr
type: ObjectProperty

links to Radio Station
range: radio station
domain: television show
sub property of: organisation
comment: Relation between Television Show and Radio Station
type: ObjectProperty
comment: Relazione tra Television Show e Radio Station @it

Axiom
dbpedia infobox matching weight: 6.25
annotated property: relatedMatch
annotated target: writer
annotated source: links to Rugby Player

Axiom
dbpedia infobox matching weight: 83.33
annotated source: links to Boxer
annotated property: relatedMatch
annotated target: starring

links to Mountain Range
domain: television show
sub property of: place
type: ObjectProperty
comment: Relation between Television Show and Mountain Range
comment: Relazione tra Television Show e Mountain Range @it
range: mountain range

magazine
label: περιοδικό @el
type: Class

links to Space Station
type: ObjectProperty
sub property of: mean of transportation
comment: Relazione tra Television Show e Space Station @it
range: space station
domain: television show
comment: Relation between Television Show and Space Station

canal
type: Class

military person
type: Class
label: militaire @fr

award
type: ObjectProperty
label: récompense @fr
type: Class

links to Lake
sub property of: place
type: ObjectProperty
range: lake
domain: television show
comment: Relation between Television Show and Lake
comment: Relazione tra Television Show e Lake @it

locomotive
type: Class

college
type: Class

anatomical structure
label: structure anatomique @fr
type: ObjectProperty

cricketer
label: joueur de cricket @fr
type: Class

single
type: Class

mixed martial arts event
label: évènement d'arts martiaux mixtes @fr
type: Class

links to Non- Profit Organisation
comment: Relation between Television Show and Non- Profit Organisation
type: ObjectProperty
sub property of: organisation
range: non-profit organisation
domain: television show
comment: Relazione tra Television Show e Non- Profit Organisation @it

links to Fish
comment: Relazione tra Television Show e Fish @it
range: fish
type: ObjectProperty
domain: television show
comment: Relation between Television Show and Fish
sub property of: species

Axiom
dbpedia infobox matching weight: 0.16
annotated target: tvSeriesWrittenBy
annotated property: relatedMatch
annotated source: links to Comedian

Axiom
dbpedia infobox matching weight: 5.26
annotated property: relatedMatch
annotated source: links to American Football Player
annotated target: presenter

ethnic group
label: groupe ethnique @fr
type: ObjectProperty
type: Class

Axiom
dbpedia infobox matching weight: 100.0
annotated target: starring
annotated source: links to Prime Minister
annotated property: relatedMatch

links to Wrestler
range: wrestler
related match: creator
related match: developer
related match: producer
sub property of: person
type: ObjectProperty
comment: Relazione tra Television Show e Wrestler @it
related match: presenter
domain: television show
related match: executiveProducer
type: NamedIndividual
related match: starring
comment: Relation between Television Show and Wrestler

embryology
type: Class
label: embryologie @fr

Axiom
dbpedia infobox matching weight: 1.4
annotated property: relatedMatch
annotated source: links to Journalist
annotated target: executiveProducer

links to Vein
domain: television show
sub property of: anatomical structure
comment: Relation between Television Show and Vein
range: vein
comment: Relazione tra Television Show e Vein @it
type: ObjectProperty

Axiom
dbpedia infobox matching weight: 0.32
annotated property: relatedMatch
annotated target: narrated
annotated source: links to Comedian

volleyball league
type: Class
label: ligue de volleyball @fr

links to Playboy Playmate
related match: starring
type: NamedIndividual
comment: Relazione tra Television Show e Playboy Playmate @it
type: ObjectProperty
range: Playboy Playmate
comment: Relation between Television Show and Playboy Playmate
sub property of: person
domain: television show

college coach
type: Class
label: entraîneur universitaire @fr

links to Cyclist
comment: Relazione tra Television Show e Cyclist @it
sub property of: person
type: ObjectProperty
comment: Relation between Television Show and Cyclist
domain: television show
range: cyclist
related match: director
type: NamedIndividual

television episode
label: épisode télévisé @fr
type: Class

Axiom
dbpedia infobox matching weight: 77.78
annotated source: links to Poker Player
annotated property: relatedMatch
annotated target: starring

links to Baseball Player
type: ObjectProperty
domain: television show
related match: director
related match: judges
comment: Relazione tra Television Show e Baseball Player @it
sub property of: person
type: NamedIndividual
related match: starring
comment: Relation between Television Show and Baseball Player
range: baseball player

links to Eurovision Song Contest Entry
range: Eurovision song contest entry
comment: Relation between Television Show and Eurovision Song Contest Entry
comment: Relazione tra Television Show e Eurovision Song Contest Entry @it
domain: television show
type: ObjectProperty
sub property of: work

links to Cricketer
comment: Relazione tra Television Show e Cricketer @it
related match: starring
range: cricketer
type: ObjectProperty
comment: Relation between Television Show and Cricketer
related match: storyEditor
related match: aux
domain: television show
type: NamedIndividual
sub property of: person
related match: presenter

Axiom
dbpedia infobox matching weight: 50.0
annotated property: relatedMatch
annotated source: links to Congressman
annotated target: voices

soccer club
type: Class
label: club de football @fr

links to Basketball League
type: ObjectProperty
sub property of: organisation
comment: Relation between Television Show and Basketball League
comment: Relazione tra Television Show e Basketball League @it
domain: television show
range: basketball league

Axiom
dbpedia infobox matching weight: 2.04
annotated target: executiveProducer
annotated property: relatedMatch
annotated source: links to Soccer Player

historic building
label: bâtiment historique @fr
type: Class

links to Ambassador
type: ObjectProperty
comment: Relazione tra Television Show e Ambassador @it
range: ambassador
domain: television show
sub property of: person
comment: Relation between Television Show and Ambassador

military conflict
type: Class
label: conflit militaire @fr

links to College
range: college
domain: television show
sub property of: organisation
comment: Relazione tra Television Show e College @it
type: ObjectProperty
comment: Relation between Television Show and College

links to College Coach
related match: executiveProducer
related match: creator percent 28s percent 29
type: ObjectProperty
type: NamedIndividual
comment: Relation between Television Show and College Coach
related match: starring
comment: Relazione tra Television Show e College Coach @it
sub property of: person
range: college coach
domain: television show

Axiom
dbpedia infobox matching weight: 3.5
annotated property: relatedMatch
annotated source: links to Comedian
annotated target: executiveProducer

links to Tennis League
type: ObjectProperty
range: tennis league
domain: television show
sub property of: organisation
comment: Relation between Television Show and Tennis League
comment: Relazione tra Television Show e Tennis League @it

launch pad
type: Class
label: rampe de lancement @fr

Axiom
dbpedia infobox matching weight: 3.51
annotated property: relatedMatch
annotated source: links to American Football Player
annotated target: executiveProducer

links to Airport
type: NamedIndividual
related match: location
comment: Relazione tra Television Show e Airport @it
type: ObjectProperty
domain: television show
sub property of: place
range: airport
comment: Relation between Television Show and Airport

Christian Bishop
type: Class
label: évêque chrétien @fr

mountain range
type: Class
label: chaîne de montagne @fr

Axiom
dbpedia infobox matching weight: 1.75
annotated property: relatedMatch
annotated target: commentators
annotated source: links to American Football Player

links to Chancellor
comment: Relation between Television Show and Chancellor
type: ObjectProperty
domain: television show
range: chancellor
sub property of: person
comment: Relazione tra Television Show e Chancellor @it

Axiom
dbpedia infobox matching weight: 100.0
annotated target: location
annotated source: links to Airport
annotated property: relatedMatch

links to Figure Skater
domain: television show
related match: starring
comment: Relazione tra Television Show e Figure Skater @it
type: NamedIndividual
related match: voices
comment: Relation between Television Show and Figure Skater
type: ObjectProperty
related match: judges
sub property of: person
range: figure skater

links to Skyscraper
comment: Relazione tra Television Show e Skyscraper @it
range: skyscraper
sub property of: place
type: ObjectProperty
comment: Relation between Television Show and Skyscraper
domain: television show

Axiom
dbpedia infobox matching weight: 2.04
annotated property: relatedMatch
annotated target: storyEditor
annotated source: links to Soccer Player

Axiom
dbpedia infobox matching weight: 0.47
annotated target: producer
annotated property: relatedMatch
annotated source: links to Journalist

Axiom
dbpedia infobox matching weight: 1.05
annotated property: relatedMatch
annotated source: links to Model
annotated target: aux

Axiom
dbpedia infobox matching weight: 100.0
annotated source: links to Sport
annotated target: format
annotated property: relatedMatch

badminton player
label: joueur de badminton @fr
type: Class

links to Senator
type: ObjectProperty
related match: executiveProducer
related match: director
comment: Relation between Television Show and Senator
domain: television show
comment: Relazione tra Television Show e Senator @it
sub property of: person
related match: starring
type: NamedIndividual
range: senator

organisation
label: Organisation @de
label: organização @pt
type: ObjectProperty

baseball league
label: ligue de baseball @fr
type: Class

links to Race
type: ObjectProperty
comment: Relazione tra Television Show e Race @it
comment: Relation between Television Show and Race
domain: television show
sub property of: event
range: race

links to Musical
sub property of: work
comment: Relazione tra Television Show e Musical @it
type: ObjectProperty
range: musical
comment: Relation between Television Show and Musical
domain: television show

Axiom
dbpedia infobox matching weight: 100.0
annotated source: links to Village
annotated property: relatedMatch
annotated target: location

mammal
label: mammifère @fr
type: Class

Axiom
dbpedia infobox matching weight: 48.98
annotated target: starring
annotated source: links to Soccer Player
annotated property: relatedMatch

links to Currency
domain: television show
comment: Relation between Television Show and Currency
sub property of: currency
range: currency
type: ObjectProperty
comment: Relazione tra Television Show e Currency @it

Eurovision song contest entry
label: concours Eurovision de la chanson @fr
type: Class

Axiom
dbpedia infobox matching weight: 3.13
annotated target: director
annotated property: relatedMatch
annotated source: links to Baseball Player

Axiom
dbpedia infobox matching weight: 1.19
annotated property: relatedMatch
annotated target: producer
annotated source: links to Comics Creator

links to Olympics
range: olympics
type: ObjectProperty
domain: television show
comment: Relation between Television Show and Olympics
sub property of: event
comment: Relazione tra Television Show e Olympics @it

Axiom
dbpedia infobox matching weight: 20.0
annotated target: director
annotated property: relatedMatch
annotated source: links to Senator

links to Sport
related match: format
type: NamedIndividual
comment: Relation between Television Show and Sport
type: ObjectProperty
comment: Relazione tra Television Show e Sport @it
sub property of: activity
domain: television show
range: sport

Axiom
dbpedia infobox matching weight: 14.29
annotated property: relatedMatch
annotated target: writer
annotated source: links to Military Person

links to Gaelic Games Player
comment: Relation between Television Show and Gaelic Games Player
domain: television show
related match: presenter
comment: Relazione tra Television Show e Gaelic Games Player @it
range: Gaelic games player
type: ObjectProperty
sub property of: person
type: NamedIndividual
related match: starring