links to Congressman
sub property of: person
comment: Relazione tra Tennis Player e Congressman @it
type: ObjectProperty
domain: tennis player
range: congressman
comment: Relation between Tennis Player and Congressman

links to Model
type: ObjectProperty
comment: Relazione tra Tennis Player e Model @it
comment: Relation between Tennis Player and Model
domain: tennis player
sub property of: person
range: model

links to Soccer League
type: ObjectProperty
comment: Relation between Tennis Player and Soccer League
domain: tennis player
range: soccer league
sub property of: organização
comment: Relazione tra Tennis Player e Soccer League @it

television show
label: émission de télévision @fr
type: Class

links to Basketball Player
domain: tennis player
sub property of: person
comment: Relazione tra Tennis Player e Basketball Player @it
range: basketball player
type: NamedIndividual
comment: Relation between Tennis Player and Basketball Player
related match: before
type: ObjectProperty
related match: after

disease
label: maladie @fr
type: Class
type: ObjectProperty

links to American Football Team
range: american football team
type: ObjectProperty
comment: Relazione tra Tennis Player e American Football Team @it
domain: tennis player
comment: Relation between Tennis Player and American Football Team
sub property of: organização

Election
label: élection @fr
type: Class

links to Pope
comment: Relation between Tennis Player and Pope
type: ObjectProperty
comment: Relazione tra Tennis Player e Pope @it
sub property of: person
range: pope
domain: tennis player

Axiom
dbpedia infobox matching weight: 25.0
annotated source: links to American Football Player
annotated property: relatedMatch
annotated target: years

links to Olympic Result
sub property of: olympic result
range: olympic result
comment: Relation between Tennis Player and Olympic Result
comment: Relazione tra Tennis Player e Olympic Result @it
type: ObjectProperty
domain: tennis player

american football player
type: Class
label: joueur de football américain @fr

Legal Case
type: ObjectProperty
label: cas juridique @fr

stadium
label: stade @fr
type: Class

soccer league
type: Class
label: ligue de football @fr

links to Election
comment: Relation between Tennis Player and Election
range: Election
type: ObjectProperty
domain: tennis player
comment: Relazione tra Tennis Player e Election @it
sub property of: event

links to Island
sub property of: place
comment: Relazione tra Tennis Player e Island @it
type: ObjectProperty
domain: tennis player
range: island
comment: Relation between Tennis Player and Island

wrestler
label: lutteur @fr
type: Class

links to Currency
sub property of: currency
type: ObjectProperty
range: currency
comment: Relation between Tennis Player and Currency
domain: tennis player
comment: Relazione tra Tennis Player e Currency @it

links to American Football Player
comment: Relation between Tennis Player and American Football Player
type: NamedIndividual
type: ObjectProperty
domain: tennis player
comment: Relazione tra Tennis Player e American Football Player @it
related match: after
related match: years
range: american football player
sub property of: person
related match: before

mayor
label: maire @fr
type: Class

pope
type: Class
label: pape @fr

Axiom
dbpedia infobox matching weight: 25.0
annotated property: relatedMatch
annotated target: before
annotated source: links to American Football Player

species
type: ObjectProperty
label: espèce @fr

links to Insect
comment: Relazione tra Tennis Player e Insect @it
domain: tennis player
comment: Relation between Tennis Player and Insect
range: insect
sub property of: species
type: ObjectProperty

links to Ski Area
comment: Relation between Tennis Player and Ski Area
domain: tennis player
sub property of: place
type: ObjectProperty
comment: Relazione tra Tennis Player e Ski Area @it
range: ski area

newspaper
label: journal @fr
type: Class

game
type: Class
label: jeu @fr

road
label: route @fr
type: Class

boxer
type: Class
label: boxeur @fr

World Heritage Site
type: Class
label: site du patrimoine mondial @fr

language
type: ObjectProperty
label: langage @fr
type: Class

Axiom
dbpedia infobox matching weight: 50.0
annotated property: relatedMatch
annotated source: links to Boxer
annotated target: before

links to Wrestler
comment: Relazione tra Tennis Player e Wrestler @it
comment: Relation between Tennis Player and Wrestler
range: wrestler
sub property of: person
domain: tennis player
type: ObjectProperty

links to Basketball League
range: basketball league
comment: Relation between Tennis Player and Basketball League
domain: tennis player
type: ObjectProperty
comment: Relazione tra Tennis Player e Basketball League @it
sub property of: organização

links to Award
domain: tennis player
sub property of: award
type: ObjectProperty
comment: Relation between Tennis Player and Award
range: award
comment: Relazione tra Tennis Player e Award @it

lake
type: Class
label: lac @fr

links to Hockey Team
range: hockey team
type: ObjectProperty
sub property of: organização
domain: tennis player
comment: Relation between Tennis Player and Hockey Team
comment: Relazione tra Tennis Player e Hockey Team @it

links to Bone
type: ObjectProperty
range: bone
comment: Relation between Tennis Player and Bone
sub property of: anatomical structure
domain: tennis player
comment: Relazione tra Tennis Player e Bone @it

links to University
comment: Relazione tra Tennis Player e University @it
range: university
type: ObjectProperty
comment: Relation between Tennis Player and University
sub property of: organização
domain: tennis player

links to Soccer Player
type: ObjectProperty
range: soccer player
comment: Relation between Tennis Player and Soccer Player
comment: Relazione tra Tennis Player e Soccer Player @it
sub property of: person
domain: tennis player

work
type: ObjectProperty
label: travail @fr
label: obra @pt

river
type: Class
label: rivière @fr

links to Musical Artist
comment: Relazione tra Tennis Player e Musical Artist @it
comment: Relation between Tennis Player and Musical Artist
range: musical artist
domain: tennis player
sub property of: person
type: ObjectProperty

school
type: Class
label: école @fr

fish
type: Class
label: poisson @fr

museum
label: musée @fr
type: Class

tennis player
label: joueur de tennis @fr
type: Class

links to Musical
range: musical
type: ObjectProperty
domain: tennis player
comment: Relazione tra Tennis Player e Musical @it
sub property of: work
comment: Relation between Tennis Player and Musical

video game
type: Class
label: jeux vidéo @fr

links to Television Show
comment: Relazione tra Tennis Player e Television Show @it
sub property of: work
comment: Relation between Tennis Player and Television Show
type: ObjectProperty
domain: tennis player
range: television show

links to Hospital
domain: tennis player
range: hospital
sub property of: place
comment: Relazione tra Tennis Player e Hospital @it
comment: Relation between Tennis Player and Hospital
type: ObjectProperty

links to Figure Skater
sub property of: person
type: ObjectProperty
range: figure skater
comment: Relation between Tennis Player and Figure Skater
comment: Relazione tra Tennis Player e Figure Skater @it
domain: tennis player

links to Mayor
range: mayor
sub property of: person
comment: Relazione tra Tennis Player e Mayor @it
domain: tennis player
type: ObjectProperty
comment: Relation between Tennis Player and Mayor

currency
type: ObjectProperty
type: Class
label: devise @fr

British royalty
type: Class
label: royauté Britannique @fr

prime minister
type: Class
label: premier ministre @fr

historic place
label: site historique @fr
type: Class

hospital
label: hôpital @fr
type: Class

links to Historic Place
range: historic place
domain: tennis player
sub property of: place
comment: Relazione tra Tennis Player e Historic Place @it
comment: Relation between Tennis Player and Historic Place
type: ObjectProperty

links to Military Unit
range: military unit
comment: Relation between Tennis Player and Military Unit
domain: tennis player
sub property of: organização
type: ObjectProperty
comment: Relazione tra Tennis Player e Military Unit @it

links to Reptile
type: ObjectProperty
comment: Relazione tra Tennis Player e Reptile @it
comment: Relation between Tennis Player and Reptile
domain: tennis player
sub property of: species
range: reptile

links to Video Game
range: video game
type: ObjectProperty
comment: Relazione tra Tennis Player e Video Game @it
domain: tennis player
comment: Relation between Tennis Player and Video Game
sub property of: work

links to Language
range: language
comment: Relazione tra Tennis Player e Language @it
comment: Relation between Tennis Player and Language
type: ObjectProperty
domain: tennis player
sub property of: language

continent
label: ήπειρος @el
type: Class

links to Soccer Club
type: ObjectProperty
comment: Relation between Tennis Player and Soccer Club
domain: tennis player
comment: Relazione tra Tennis Player e Soccer Club @it
sub property of: organização
range: soccer club

links to Film
sub property of: work
type: ObjectProperty
comment: Relazione tra Tennis Player e Film @it
range: film
domain: tennis player
comment: Relation between Tennis Player and Film

links to Muscle
comment: Relation between Tennis Player and Muscle
range: muscle
sub property of: anatomical structure
comment: Relazione tra Tennis Player e Muscle @it
type: ObjectProperty
domain: tennis player

links to Music Festival
domain: tennis player
range: music festival
sub property of: event
comment: Relation between Tennis Player and Music Festival
type: ObjectProperty
comment: Relazione tra Tennis Player e Music Festival @it

president
type: Class
label: président @fr

album
label: Album @de
type: Class

figure skater
type: Class
label: patineur artistique @fr

links to Website
domain: tennis player
type: ObjectProperty
sub property of: website
range: website
comment: Relation between Tennis Player and Website
comment: Relazione tra Tennis Player e Website @it

person
label: personne @fr
type: ObjectProperty
label: pessoa @pt
label: Person @de

military unit
type: Class
label: unité militaire @fr

links to Monarch
type: ObjectProperty
sub property of: person
comment: Relation between Tennis Player and Monarch
domain: tennis player
comment: Relazione tra Tennis Player e Monarch @it
range: monarch

links to Book
range: book
domain: tennis player
type: ObjectProperty
comment: Relation between Tennis Player and Book
comment: Relazione tra Tennis Player e Book @it
sub property of: work

soccer manager
label: entraîneur de football @fr
type: Class

basketball team
type: Class

links to Song
range: song
sub property of: work
comment: Relation between Tennis Player and Song
comment: Relazione tra Tennis Player e Song @it
type: ObjectProperty
domain: tennis player

music genre
label: genre musical @fr
type: ObjectProperty
label: género musical @pt
type: Class

links to Historic Building
comment: Relazione tra Tennis Player e Historic Building @it
comment: Relation between Tennis Player and Historic Building
sub property of: place
type: ObjectProperty
domain: tennis player
range: historic building

writer
label: écrivain @fr
type: Class

links to Boxer
domain: tennis player
type: NamedIndividual
sub property of: person
related match: after
comment: Relation between Tennis Player and Boxer
comment: Relazione tra Tennis Player e Boxer @it
range: boxer
type: ObjectProperty
related match: before

links to Formula One Racer
comment: Relation between Tennis Player and Formula One Racer
comment: Relazione tra Tennis Player e Formula One Racer @it
type: ObjectProperty
domain: tennis player
sub property of: person
range: Formula One racer

model
type: Class
label: mannequin @fr

olympic result
type: ObjectProperty
type: Class
label: résultat de Jeux Olympiques @fr

links to President
type: ObjectProperty
sub property of: person
domain: tennis player
comment: Relazione tra Tennis Player e President @it
range: president
comment: Relation between Tennis Player and President

links to Music Genre
sub property of: music genre
type: ObjectProperty
range: music genre
comment: Relazione tra Tennis Player e Music Genre @it
comment: Relation between Tennis Player and Music Genre
domain: tennis player

comics creator
type: Class
label: créateur de bandes dessinées @fr

links to Golf League
comment: Relazione tra Tennis Player e Golf League @it
type: ObjectProperty
domain: tennis player
comment: Relation between Tennis Player and Golf League
sub property of: organização
range: golf league

links to Comics Creator
comment: Relation between Tennis Player and Comics Creator
sub property of: person
domain: tennis player
comment: Relazione tra Tennis Player e Comics Creator @it
range: comics creator
type: ObjectProperty

links to Nascar Driver
comment: Relazione tra Tennis Player e Nascar Driver @it
sub property of: person
comment: Relation between Tennis Player and Nascar Driver
type: ObjectProperty
range: nascar driver
domain: tennis player

links to Golf Player
sub property of: person
domain: tennis player
comment: Relazione tra Tennis Player e Golf Player @it
type: ObjectProperty
range: golf player
comment: Relation between Tennis Player and Golf Player

hockey team
type: Class
label: équipe de hockey @fr

links to Fish
domain: tennis player
comment: Relation between Tennis Player and Fish
type: ObjectProperty
comment: Relazione tra Tennis Player e Fish @it
sub property of: species
range: fish

soccer player
label: joueur de football @fr
type: Class

reptile
type: Class

links to Mountain
sub property of: place
domain: tennis player
range: mountain
type: ObjectProperty
comment: Relazione tra Tennis Player e Mountain @it
comment: Relation between Tennis Player and Mountain

legislature
label: pouvoir législatif @fr
type: Class

links to Drug
comment: Relation between Tennis Player and Drug
sub property of: drug
type: ObjectProperty
comment: Relazione tra Tennis Player e Drug @it
domain: tennis player
range: drug

airline
type: Class
label: compagnie aérienne @fr

monarch
label: monarque @fr
type: Class

links to Basketball Team
sub property of: organização
comment: Relation between Tennis Player and Basketball Team
domain: tennis player
type: ObjectProperty
comment: Relazione tra Tennis Player e Basketball Team @it
range: basketball team

congressman
label: membre du Congrès @fr
type: Class

links to Game
type: ObjectProperty
domain: tennis player
comment: Relation between Tennis Player and Game
range: game
comment: Relazione tra Tennis Player e Game @it
sub property of: activity

links to Legislature
range: legislature
sub property of: organização
type: ObjectProperty
comment: Relation between Tennis Player and Legislature
comment: Relazione tra Tennis Player e Legislature @it
domain: tennis player

links to Mountain Range
comment: Relation between Tennis Player and Mountain Range
comment: Relazione tra Tennis Player e Mountain Range @it
sub property of: place
domain: tennis player
type: ObjectProperty
range: mountain range

golf player
type: Class
label: golfeur @fr

nascar driver
type: Class
label: pilote de la nascar @fr

activity
type: ObjectProperty
label: Aktivität @de
label: activité @fr

journalist
label: journaliste @fr
type: Class

links to Beverage
domain: tennis player
comment: Relation between Tennis Player and Beverage
comment: Relazione tra Tennis Player e Beverage @it
sub property of: beverage
type: ObjectProperty
range: beverage

insect
label: insecte @fr
type: Class

film
label: ταινία @el
type: Class

links to Stadium
domain: tennis player
type: ObjectProperty
comment: Relazione tra Tennis Player e Stadium @it
sub property of: place
range: stadium
comment: Relation between Tennis Player and Stadium

american football team
type: Class
label: équipe américaine de football américain @fr

Supreme Court of the United States case
label: cas juridique de la Cour suprême des États-Unis @fr
type: Class

bird
type: Class
label: oiseau @fr

chemical compound
label: produit chimique @fr
type: ObjectProperty
type: Class

links to Olympics
comment: Relazione tra Tennis Player e Olympics @it
comment: Relation between Tennis Player and Olympics
type: ObjectProperty
range: olympics
domain: tennis player
sub property of: event

links to Playboy Playmate
domain: tennis player
range: Playboy Playmate
comment: Relation between Tennis Player and Playboy Playmate
type: ObjectProperty
sub property of: person
comment: Relazione tra Tennis Player e Playboy Playmate @it

links to Bird
comment: Relation between Tennis Player and Bird
comment: Relazione tra Tennis Player e Bird @it
sub property of: species
range: bird
type: ObjectProperty
domain: tennis player

musical artist
label: artista musical @pt
type: Class
label: musicien @fr

links to Military Conflict
domain: tennis player
comment: Relation between Tennis Player and Military Conflict
range: military conflict
comment: Relazione tra Tennis Player e Military Conflict @it
sub property of: event
type: ObjectProperty

links to American Football League
range: american football league
comment: Relazione tra Tennis Player e American Football League @it
type: ObjectProperty
comment: Relation between Tennis Player and American Football League
sub property of: organização
domain: tennis player

links to Ice Hockey Player
domain: tennis player
sub property of: person
type: ObjectProperty
range: ice hockey player
comment: Relation between Tennis Player and Ice Hockey Player
comment: Relazione tra Tennis Player e Ice Hockey Player @it

park
type: Class
label: parc @fr

links to Road
domain: tennis player
range: road
comment: Relazione tra Tennis Player e Road @it
type: ObjectProperty
comment: Relation between Tennis Player and Road
sub property of: infrastructure

links to Magazine
sub property of: work
range: magazine
comment: Relation between Tennis Player and Magazine
type: ObjectProperty
domain: tennis player
comment: Relazione tra Tennis Player e Magazine @it

american football league
type: Class

musical
type: Class
label: musique @fr

links to Single
type: ObjectProperty
comment: Relation between Tennis Player and Single
sub property of: work
comment: Relazione tra Tennis Player e Single @it
domain: tennis player
range: single

cyclist
label: cycliste @fr
type: Class

links to British Royalty
comment: Relazione tra Tennis Player e British Royalty @it
comment: Relation between Tennis Player and British Royalty
type: ObjectProperty
range: British royalty
sub property of: person
domain: tennis player

place
label: lugar @pt
label: lieu @fr
label: περιοχή @el
type: ObjectProperty

links to Cricketer
type: ObjectProperty
sub property of: person
domain: tennis player
comment: Relation between Tennis Player and Cricketer
comment: Relazione tra Tennis Player e Cricketer @it
range: cricketer

TennisPlayer.owl
has author: Aldo Gangemi
imports: cpannotationschema.owl
has author: Andrea Giovanni Nuzzolese
imports: dbpediainfoboxmatchingweight.owl
comment: TennisPlayer Encyclopedic Knowledge Pattern
extracted from: dbpedia.org
extracted from: en.wikipedia.org
has author: Valentina Presutti
type: Ontology
has intent: To represent the encyclopedic knowledge expressed by an object typed as TennisPlayer

infrastructure
type: ObjectProperty

basketball league
label: ligue de basketball @fr
type: Class

links to Airline
domain: tennis player
range: airline
comment: Relazione tra Tennis Player e Airline @it
sub property of: organização
type: ObjectProperty
comment: Relation between Tennis Player and Airline

mountain
label: Βουνό @el
label: montagne @fr
type: Class

links to Planet
type: ObjectProperty
sub property of: planet
comment: Relazione tra Tennis Player e Planet @it
range: planet
domain: tennis player
comment: Relation between Tennis Player and Planet

links to Broadcast
comment: Relation between Tennis Player and Broadcast
type: ObjectProperty
domain: tennis player
sub property of: organização
comment: Relazione tra Tennis Player e Broadcast @it
range: broadcast

links to Prime Minister
type: ObjectProperty
sub property of: person
domain: tennis player
comment: Relazione tra Tennis Player e Prime Minister @it
comment: Relation between Tennis Player and Prime Minister
range: prime minister

links to Plant
range: plant
comment: Relation between Tennis Player and Plant
domain: tennis player
type: ObjectProperty
comment: Relazione tra Tennis Player e Plant @it
sub property of: species

comedian
label: comédien @fr
type: Class

song
label: chanson @fr
type: Class

links to Member Of Parliament
sub property of: person
type: ObjectProperty
domain: tennis player
comment: Relazione tra Tennis Player e Member Of Parliament @it
comment: Relation between Tennis Player and Member Of Parliament
range: member of parliament

Playboy Playmate
label: playmate pour Playboy @fr
type: Class

book
type: Class
label: livre @fr
label: βιβλίο @el
label: llibre @ca
label: książka @pl

links to Ice Hockey League
domain: tennis player
range: ice hockey league
type: ObjectProperty
comment: Relazione tra Tennis Player e Ice Hockey League @it
sub property of: organização
comment: Relation between Tennis Player and Ice Hockey League

links to Military Person
domain: tennis player
comment: Relation between Tennis Player and Military Person
type: ObjectProperty
comment: Relazione tra Tennis Player e Military Person @it
range: military person
sub property of: person

ski area
label: domaine skiable @fr
type: Class

links to Cyclist
type: ObjectProperty
comment: Relazione tra Tennis Player e Cyclist @it
sub property of: person
domain: tennis player
range: cyclist
comment: Relation between Tennis Player and Cyclist

non-profit organisation
label: organisation à but non lucratif @fr
type: Class

links to Museum
sub property of: place
comment: Relation between Tennis Player and Museum
comment: Relazione tra Tennis Player e Museum @it
type: ObjectProperty
domain: tennis player
range: museum

drug
type: Class
label: médicament @fr
type: ObjectProperty

links to Non- Profit Organisation
comment: Relation between Tennis Player and Non- Profit Organisation
domain: tennis player
sub property of: organização
range: non-profit organisation
type: ObjectProperty
comment: Relazione tra Tennis Player e Non- Profit Organisation @it

links to Chemical Compound
range: chemical compound
type: ObjectProperty
comment: Relazione tra Tennis Player e Chemical Compound @it
domain: tennis player
sub property of: chemical compound
comment: Relation between Tennis Player and Chemical Compound

magazine
label: περιοδικό @el
type: Class

links to Office Holder
comment: Relation between Tennis Player and Office Holder
sub property of: person
domain: tennis player
type: ObjectProperty
range: office holder
comment: Relazione tra Tennis Player e Office Holder @it

military person
type: Class
label: militaire @fr

links to Supreme Court Of The United States Case
domain: tennis player
comment: Relazione tra Tennis Player e Supreme Court Of The United States Case @it
comment: Relation between Tennis Player and Supreme Court Of The United States Case
type: ObjectProperty
range: Supreme Court of the United States case
sub property of: Legal Case

philosopher
label: philosophe @fr
type: Class

award
type: ObjectProperty
label: récompense @fr
type: Class

links to Newspaper
sub property of: work
range: newspaper
domain: tennis player
comment: Relazione tra Tennis Player e Newspaper @it
type: ObjectProperty
comment: Relation between Tennis Player and Newspaper

links to Comics Character
sub property of: person
domain: tennis player
range: comics character
comment: Relazione tra Tennis Player e Comics Character @it
comment: Relation between Tennis Player and Comics Character
type: ObjectProperty

links to Band
range: Band
comment: Relation between Tennis Player and Band
sub property of: organização
type: ObjectProperty
comment: Relazione tra Tennis Player e Band @it
domain: tennis player

links to Park
comment: Relazione tra Tennis Player e Park @it
sub property of: place
comment: Relation between Tennis Player and Park
range: park
type: ObjectProperty
domain: tennis player

anatomical structure
label: structure anatomique @fr
type: ObjectProperty

links to Philosopher
comment: Relation between Tennis Player and Philosopher
range: philosopher
sub property of: person
domain: tennis player
type: ObjectProperty
comment: Relazione tra Tennis Player e Philosopher @it

cricketer
label: joueur de cricket @fr
type: Class

single
type: Class

Band
label: groupe de musique @fr
type: Class
label: Musikgruppe @de
label: banda @pt

links to Baseball Player
type: ObjectProperty
comment: Relazione tra Tennis Player e Baseball Player @it
range: baseball player
sub property of: person
domain: tennis player
comment: Relation between Tennis Player and Baseball Player

university
type: Class
label: université @fr
label: πανεπιστήμιο @el

ethnic group
label: groupe ethnique @fr
type: ObjectProperty
type: Class

music festival
type: Class
label: festival de musique @fr

Axiom
dbpedia infobox matching weight: 33.33
annotated source: links to Basketball Player
annotated property: relatedMatch
annotated target: before

links to School
range: school
sub property of: organização
domain: tennis player
type: ObjectProperty
comment: Relazione tra Tennis Player e School @it
comment: Relation between Tennis Player and School

college coach
type: Class
label: entraîneur universitaire @fr

muscle
type: Class

village
type: Class
label: χωριό @el

ice hockey league
type: Class
label: ligue d'hockey sur glace @fr

links to Adult Actor
comment: Relation between Tennis Player and Adult Actor
range: adult actor
comment: Relazione tra Tennis Player e Adult Actor @it
domain: tennis player
type: ObjectProperty
sub property of: person

soccer club
type: Class
label: club de football @fr

links to Scientist
comment: Relazione tra Tennis Player e Scientist @it
comment: Relation between Tennis Player and Scientist
range: scientist
sub property of: person
domain: tennis player
type: ObjectProperty

historic building
type: Class
label: bâtiment historique @fr

links to Writer
comment: Relazione tra Tennis Player e Writer @it
type: ObjectProperty
domain: tennis player
sub property of: person
range: writer
comment: Relation between Tennis Player and Writer

office holder
label: titulaire @fr
label: Amtsinhaber @de
type: Class

baseball player
type: Class
label: joueur de baseball @fr

military conflict
type: Class
label: conflit militaire @fr

website
type: ObjectProperty
type: Class
label: site web @fr
label: Ιστότοπος @el

links to Comedian
domain: tennis player
type: ObjectProperty
range: comedian
comment: Relazione tra Tennis Player e Comedian @it
comment: Relation between Tennis Player and Comedian
sub property of: person

links to Lake
sub property of: place
comment: Relation between Tennis Player and Lake
comment: Relazione tra Tennis Player e Lake @it
domain: tennis player
type: ObjectProperty
range: lake

Axiom
dbpedia infobox matching weight: 66.67
annotated source: links to Basketball Player
annotated property: relatedMatch
annotated target: after

links to Continent
sub property of: place
range: continent
comment: Relation between Tennis Player and Continent
type: ObjectProperty
domain: tennis player
comment: Relazione tra Tennis Player e Continent @it

links to Village
sub property of: place
comment: Relation between Tennis Player and Village
type: ObjectProperty
domain: tennis player
range: village
comment: Relazione tra Tennis Player e Village @it

basketball player
label: joueur de basketball @fr
type: Class

links to River
comment: Relation between Tennis Player and River
sub property of: place
comment: Relazione tra Tennis Player e River @it
range: river
domain: tennis player
type: ObjectProperty

adult actor
label: erwachsener Schauspieler @de
type: Class
label: acteur adulte @fr

ice hockey player
label: joueur de hockey sur glace @fr
type: Class

links to Soccer Manager
comment: Relazione tra Tennis Player e Soccer Manager @it
type: ObjectProperty
domain: tennis player
comment: Relation between Tennis Player and Soccer Manager
sub property of: person
range: soccer manager

mountain range
type: Class
label: chaîne de montagne @fr

links to Disease
range: disease
type: ObjectProperty
sub property of: disease
comment: Relazione tra Tennis Player e Disease @it
domain: tennis player
comment: Relation between Tennis Player and Disease

links to World Heritage Site
range: World Heritage Site
comment: Relazione tra Tennis Player e World Heritage Site @it
domain: tennis player
type: ObjectProperty
sub property of: place
comment: Relation between Tennis Player and World Heritage Site

beverage
label: boisson @fr
type: Class
type: ObjectProperty

planet
type: Class
label: planète @fr
type: ObjectProperty

links to Radio Station
comment: Relazione tra Tennis Player e Radio Station @it
sub property of: organização
domain: tennis player
range: radio station
comment: Relation between Tennis Player and Radio Station
type: ObjectProperty

links to Ethnic Group
type: ObjectProperty
comment: Relation between Tennis Player and Ethnic Group
comment: Relazione tra Tennis Player e Ethnic Group @it
range: ethnic group
sub property of: ethnic group
domain: tennis player

scientist
label: scientifique @fr
type: Class
label: Wissenschaftler @de

Axiom
dbpedia infobox matching weight: 50.0
annotated source: links to American Football Player
annotated property: relatedMatch
annotated target: after

golf league
label: ligue de golf @fr
type: Class

links to College Coach
comment: Relazione tra Tennis Player e College Coach @it
range: college coach
sub property of: person
comment: Relation between Tennis Player and College Coach
domain: tennis player
type: ObjectProperty

links to Airport
type: ObjectProperty
comment: Relation between Tennis Player and Airport
domain: tennis player
comment: Relazione tra Tennis Player e Airport @it
sub property of: place
range: airport

badminton player
label: joueur de badminton @fr
type: Class

olympics
type: Class
label: Jeux Olympiques @fr

organização
type: ObjectProperty
label: organisation
label: Organisation @de

links to Badminton Player
type: ObjectProperty
comment: Relazione tra Tennis Player e Badminton Player @it
sub property of: person
range: badminton player
domain: tennis player
comment: Relation between Tennis Player and Badminton Player

links to Journalist
range: journalist
comment: Relation between Tennis Player and Journalist
type: ObjectProperty
sub property of: person
comment: Relazione tra Tennis Player e Journalist @it
domain: tennis player

plant
type: Class
label: plante @fr

broadcast
type: Class
label: Émission de télévision @fr

links to Album
domain: tennis player
type: ObjectProperty
comment: Relation between Tennis Player and Album
sub property of: work
comment: Relazione tra Tennis Player e Album @it
range: album

Axiom
dbpedia infobox matching weight: 50.0
annotated property: relatedMatch
annotated target: after
annotated source: links to Boxer

island
type: Class
label: νησί @el
label: île @fr

comics character
type: Class
label: personnage de bandes dessinées @fr

event
type: ObjectProperty
label: évènement @fr

Formula One racer
type: Class
label: pilote de formule 1 @fr

radio station
type: Class
label: station de radio @fr

bone
type: Class
label: Knochen @de
label: os @fr

member of parliament
label: membre du Parlement @fr
type: Class

airport
type: Class
label: Flughafen @de
label: aéroport @fr