links to Ship
sub property of: mean of transportation
type: ObjectProperty
comment: Relation between Trade Union and Ship
comment: Relazione tra Trade Union e Ship @it
domain: trade union
range: ship

links to Website
domain: trade union
type: ObjectProperty
range: website
comment: Relazione tra Trade Union e Website @it
comment: Relation between Trade Union and Website
sub property of: website

television show
label: émission de télévision @fr
type: Class

disease
label: maladie @fr
type: Class
type: ObjectProperty

links to Protected Area
sub property of: place
domain: trade union
comment: Relazione tra Trade Union e Protected Area @it
range: protected area
comment: Relation between Trade Union and Protected Area
type: ObjectProperty

links to Video Game
comment: Relation between Trade Union and Video Game
comment: Relazione tra Trade Union e Video Game @it
range: video game
domain: trade union
type: ObjectProperty
sub property of: work

links to River
sub property of: place
comment: Relazione tra Trade Union e River @it
domain: trade union
comment: Relation between Trade Union and River
type: ObjectProperty
range: river

automobile
type: Class

colour
type: ObjectProperty
label: χρώμα @el
label: couleur @fr
type: Class

Election
label: élection @fr
type: Class

mean of transportation
label: moyen de transport @fr
type: ObjectProperty

american football player
type: Class
label: joueur de football américain @fr

Legal Case
type: ObjectProperty
label: cas juridique @fr

stadium
type: Class
label: stade @fr

soccer league
label: ligue de football @fr
type: Class

links to American Football Player
domain: trade union
comment: Relazione tra Trade Union e American Football Player @it
range: american football player
comment: Relation between Trade Union and American Football Player
sub property of: person
type: ObjectProperty

TradeUnion.owl
extracted from: en.wikipedia.org
has author: Aldo Gangemi
type: Ontology
imports: cpannotationschema.owl
imports: dbpediainfoboxmatchingweight.owl
extracted from: dbpedia.org
has intent: To represent the encyclopedic knowledge expressed by an object typed as TradeUnion
has author: Andrea Giovanni Nuzzolese
has author: Valentina Presutti
comment: TradeUnion Encyclopedic Knowledge Pattern

links to Radio Station
comment: Relation between Trade Union and Radio Station
range: radio station
comment: Relazione tra Trade Union e Radio Station @it
domain: trade union
type: ObjectProperty
sub property of: organisation

links to Airport
type: ObjectProperty
range: airport
domain: trade union
sub property of: place
comment: Relazione tra Trade Union e Airport @it
comment: Relation between Trade Union and Airport

mayor
type: Class
label: maire @fr

pope
type: Class
label: pape @fr

species
label: espèce @fr
type: ObjectProperty

links to Boxer
comment: Relation between Trade Union and Boxer
range: boxer
type: ObjectProperty
sub property of: person
domain: trade union
comment: Relazione tra Trade Union e Boxer @it

links to Musical
range: musical
type: ObjectProperty
comment: Relazione tra Trade Union e Musical @it
comment: Relation between Trade Union and Musical
sub property of: work
domain: trade union

newspaper
label: journal @fr
type: Class

links to Comedian
range: comedian
comment: Relazione tra Trade Union e Comedian @it
comment: Relation between Trade Union and Comedian
type: ObjectProperty
domain: trade union
sub property of: person

protected area
type: Class
label: προστατευμένη περιοχή @el
label: aire protégée @fr

road
label: route @fr
type: Class

boxer
label: boxeur @fr
type: Class

judge
label: juge @fr
type: Class

links to Election
type: ObjectProperty
comment: Relazione tra Trade Union e Election @it
domain: trade union
comment: Relation between Trade Union and Election
range: Election
sub property of: event

links to Canadian Football Team
type: ObjectProperty
comment: Relazione tra Trade Union e Canadian Football Team @it
domain: trade union
sub property of: organisation
range: canadian football team
comment: Relation between Trade Union and Canadian Football Team

links to Magazine
range: magazine
type: ObjectProperty
comment: Relazione tra Trade Union e Magazine @it
comment: Relation between Trade Union and Magazine
domain: trade union
sub property of: work

language
type: ObjectProperty
label: langage @fr
type: Class

station
type: Class

lake
label: lac @fr
type: Class

governor
type: Class
label: gouverneur @fr

work
label: obra @pt
label: travail @fr
type: ObjectProperty

river
type: Class
label: rivière @fr

lacrosse league
type: Class
label: ligue de crosse @fr

school
type: Class
label: école @fr

links to University
comment: Relation between Trade Union and University
range: university
type: ObjectProperty
domain: trade union
comment: Relazione tra Trade Union e University @it
sub property of: organisation

museum
type: Class
label: musée @fr

ship
type: Class
label: navire @fr

links to Hockey Team
type: ObjectProperty
range: hockey team
comment: Relazione tra Trade Union e Hockey Team @it
comment: Relation between Trade Union and Hockey Team
sub property of: organisation
domain: trade union

video game
label: jeux vidéo @fr
type: Class

trade union
label: syndicat professionnel @fr
type: Class

links to Stadium
comment: Relation between Trade Union and Stadium
domain: trade union
sub property of: place
comment: Relazione tra Trade Union e Stadium @it
type: ObjectProperty
range: stadium

currency
type: ObjectProperty
type: Class
label: devise @fr

British royalty
type: Class
label: royauté Britannique @fr

prime minister
label: premier ministre @fr
type: Class

historic place
type: Class
label: site historique @fr

hospital
type: Class
label: hôpital @fr

continent
label: ήπειρος @el
type: Class

president
label: président @fr
type: Class

album
type: Class
label: Album @de

links to Town
comment: Relazione tra Trade Union e Town @it
comment: Relation between Trade Union and Town
sub property of: place
domain: trade union
type: ObjectProperty
range: town

person
label: personne @fr
label: pessoa @pt
type: ObjectProperty
label: Person @de

military unit
type: Class
label: unité militaire @fr

links to Military Unit
type: ObjectProperty
comment: Relazione tra Trade Union e Military Unit @it
domain: trade union
sub property of: organisation
comment: Relation between Trade Union and Military Unit
range: military unit

links to American Football League
type: ObjectProperty
domain: trade union
range: american football league
comment: Relation between Trade Union and American Football League
sub property of: organisation
comment: Relazione tra Trade Union e American Football League @it

soccer manager
label: entraîneur de football @fr
type: Class

links to Television Episode
comment: Relation between Trade Union and Television Episode
domain: trade union
range: television episode
comment: Relazione tra Trade Union e Television Episode @it
sub property of: work
type: ObjectProperty

canadian football team
type: Class
label: équipe canadienne de football américain @fr

links to Airline
range: airline
comment: Relation between Trade Union and Airline
sub property of: organisation
comment: Relazione tra Trade Union e Airline @it
domain: trade union
type: ObjectProperty

links to Member Of Parliament
type: ObjectProperty
domain: trade union
comment: Relazione tra Trade Union e Member Of Parliament @it
comment: Relation between Trade Union and Member Of Parliament
range: member of parliament
sub property of: person

writer
label: écrivain @fr
type: Class

links to Pope
sub property of: person
domain: trade union
comment: Relazione tra Trade Union e Pope @it
type: ObjectProperty
range: pope
comment: Relation between Trade Union and Pope

links to Saint
comment: Relazione tra Trade Union e Saint @it
domain: trade union
comment: Relation between Trade Union and Saint
type: ObjectProperty
range: saint
sub property of: person

architect
label: architecte @fr
type: Class

links to School
domain: trade union
comment: Relazione tra Trade Union e School @it
comment: Relation between Trade Union and School
range: school
sub property of: organisation
type: ObjectProperty

links to Automobile
sub property of: mean of transportation
domain: trade union
type: ObjectProperty
range: automobile
comment: Relazione tra Trade Union e Automobile @it
comment: Relation between Trade Union and Automobile

links to Skyscraper
range: skyscraper
comment: Relazione tra Trade Union e Skyscraper @it
sub property of: place
type: ObjectProperty
comment: Relation between Trade Union and Skyscraper
domain: trade union

film festival
label: festival du film @fr
type: Class

links to Cricketer
domain: trade union
comment: Relazione tra Trade Union e Cricketer @it
type: ObjectProperty
comment: Relation between Trade Union and Cricketer
sub property of: person
range: cricketer

links to Governor
comment: Relazione tra Trade Union e Governor @it
type: ObjectProperty
range: governor
domain: trade union
comment: Relation between Trade Union and Governor
sub property of: person

comics creator
label: créateur de bandes dessinées @fr
type: Class

aircraft
label: αεροσκάφος @el
type: Class
label: avion @fr

links to President
comment: Relation between Trade Union and President
type: ObjectProperty
sub property of: person
range: president
comment: Relazione tra Trade Union e President @it
domain: trade union

links to Soccer Manager
type: ObjectProperty
comment: Relazione tra Trade Union e Soccer Manager @it
sub property of: person
comment: Relation between Trade Union and Soccer Manager
domain: trade union
range: soccer manager

links to Baseball League
comment: Relazione tra Trade Union e Baseball League @it
domain: trade union
range: baseball league
sub property of: organisation
comment: Relation between Trade Union and Baseball League
type: ObjectProperty

hockey team
type: Class
label: équipe de hockey @fr

links to Road
range: road
comment: Relazione tra Trade Union e Road @it
domain: trade union
sub property of: infrastructure
comment: Relation between Trade Union and Road
type: ObjectProperty

links to Scientist
comment: Relazione tra Trade Union e Scientist @it
type: ObjectProperty
range: scientist
comment: Relation between Trade Union and Scientist
domain: trade union
sub property of: person

soccer player
type: Class
label: joueur de football @fr

links to Non- Profit Organisation
sub property of: organisation
type: ObjectProperty
comment: Relazione tra Trade Union e Non- Profit Organisation @it
range: non-profit organisation
domain: trade union
comment: Relation between Trade Union and Non- Profit Organisation

legislature
label: pouvoir législatif @fr
type: Class

links to Legislature
comment: Relazione tra Trade Union e Legislature @it
range: legislature
domain: trade union
sub property of: organisation
comment: Relation between Trade Union and Legislature
type: ObjectProperty

airline
label: compagnie aérienne @fr
type: Class

links to American Football Team
sub property of: organisation
type: ObjectProperty
comment: Relation between Trade Union and American Football Team
range: american football team
comment: Relazione tra Trade Union e American Football Team @it
domain: trade union

congressman
type: Class
label: membre du Congrès @fr

links to Award
comment: Relazione tra Trade Union e Award @it
domain: trade union
comment: Relation between Trade Union and Award
sub property of: award
type: ObjectProperty
range: award

links to Museum
type: ObjectProperty
sub property of: place
comment: Relazione tra Trade Union e Museum @it
domain: trade union
range: museum
comment: Relation between Trade Union and Museum

golf player
type: Class
label: golfeur @fr

activity
type: ObjectProperty
label: Aktivität @de
label: activité @fr

journalist
type: Class
label: journaliste @fr

film
type: Class
label: ταινία @el

links to Station
comment: Relazione tra Trade Union e Station @it
type: ObjectProperty
range: station
comment: Relation between Trade Union and Station
domain: trade union
sub property of: place

links to Soccer Player
range: soccer player
type: ObjectProperty
comment: Relazione tra Trade Union e Soccer Player @it
comment: Relation between Trade Union and Soccer Player
sub property of: person
domain: trade union

american football team
label: équipe américaine de football américain @fr
type: Class

Supreme Court of the United States case
label: cas juridique de la Cour suprême des États-Unis @fr
type: Class

links to Beverage
comment: Relazione tra Trade Union e Beverage @it
domain: trade union
comment: Relation between Trade Union and Beverage
sub property of: beverage
range: beverage
type: ObjectProperty

links to Senator
comment: Relazione tra Trade Union e Senator @it
domain: trade union
type: ObjectProperty
comment: Relation between Trade Union and Senator
sub property of: person
range: senator

musical artist
label: musicien @fr
type: Class
label: artista musical @pt

links to Judge
comment: Relazione tra Trade Union e Judge @it
comment: Relation between Trade Union and Judge
domain: trade union
sub property of: person
range: judge
type: ObjectProperty

links to Ethnic Group
type: ObjectProperty
range: ethnic group
comment: Relation between Trade Union and Ethnic Group
domain: trade union
sub property of: ethnic group
comment: Relazione tra Trade Union e Ethnic Group @it

park
label: parc @fr
type: Class

links to Rugby Player
type: ObjectProperty
comment: Relation between Trade Union and Rugby Player
comment: Relazione tra Trade Union e Rugby Player @it
range: rugby player
sub property of: person
domain: trade union

links to Colour
type: ObjectProperty
range: colour
sub property of: colour
comment: Relazione tra Trade Union e Colour @it
comment: Relation between Trade Union and Colour
domain: trade union

rugby player
label: joueur de rugby @fr
type: Class

links to Village
comment: Relazione tra Trade Union e Village @it
sub property of: place
type: ObjectProperty
domain: trade union
range: village
comment: Relation between Trade Union and Village

american football league
type: Class

links to Golf Player
comment: Relation between Trade Union and Golf Player
sub property of: person
type: ObjectProperty
range: golf player
domain: trade union
comment: Relazione tra Trade Union e Golf Player @it

musical
type: Class
label: musique @fr

links to Currency
range: currency
comment: Relazione tra Trade Union e Currency @it
domain: trade union
comment: Relation between Trade Union and Currency
type: ObjectProperty
sub property of: currency

links to Aircraft
sub property of: mean of transportation
domain: trade union
comment: Relation between Trade Union and Aircraft
range: aircraft
type: ObjectProperty
comment: Relazione tra Trade Union e Aircraft @it

links to Philosopher
comment: Relation between Trade Union and Philosopher
range: philosopher
comment: Relazione tra Trade Union e Philosopher @it
domain: trade union
type: ObjectProperty
sub property of: person

links to Album
domain: trade union
comment: Relation between Trade Union and Album
sub property of: work
type: ObjectProperty
range: album
comment: Relazione tra Trade Union e Album @it

place
type: ObjectProperty
label: περιοχή @el
label: lieu @fr
label: lugar @pt

links to Prime Minister
domain: trade union
comment: Relation between Trade Union and Prime Minister
comment: Relazione tra Trade Union e Prime Minister @it
sub property of: person
range: prime minister
type: ObjectProperty

links to Architect
range: architect
sub property of: person
comment: Relazione tra Trade Union e Architect @it
comment: Relation between Trade Union and Architect
type: ObjectProperty
domain: trade union

links to Language
range: language
comment: Relation between Trade Union and Language
domain: trade union
type: ObjectProperty
sub property of: language
comment: Relazione tra Trade Union e Language @it

links to Park
type: ObjectProperty
comment: Relazione tra Trade Union e Park @it
domain: trade union
range: park
sub property of: place
comment: Relation between Trade Union and Park

infrastructure
type: ObjectProperty

basketball league
label: ligue de basketball @fr
type: Class

links to Island
domain: trade union
type: ObjectProperty
comment: Relazione tra Trade Union e Island @it
range: island
sub property of: place
comment: Relation between Trade Union and Island

mountain
label: Βουνό @el
label: montagne @fr
type: Class

criminal
type: Class
label: criminel @fr

flowering plant
label: angiospermes @fr
type: Class

saint
type: Class

senator
type: Class
label: sénateur @fr

comedian
label: comédien @fr
type: Class

links to Musical Artist
range: musical artist
sub property of: person
type: ObjectProperty
comment: Relation between Trade Union and Musical Artist
comment: Relazione tra Trade Union e Musical Artist @it
domain: trade union

book
type: Class
label: livre @fr
label: βιβλίο @el
label: llibre @ca
label: książka @pl

shopping mall
type: Class
label: centre commercial @fr

links to Military Person
type: ObjectProperty
sub property of: person
comment: Relation between Trade Union and Military Person
range: military person
domain: trade union
comment: Relazione tra Trade Union e Military Person @it

non-profit organisation
type: Class
label: organisation à but non lucratif @fr

links to Basketball League
comment: Relation between Trade Union and Basketball League
comment: Relazione tra Trade Union e Basketball League @it
range: basketball league
sub property of: organisation
type: ObjectProperty
domain: trade union

links to Television Show
type: ObjectProperty
comment: Relazione tra Trade Union e Television Show @it
sub property of: work
comment: Relation between Trade Union and Television Show
range: television show
domain: trade union

links to Shopping Mall
comment: Relazione tra Trade Union e Shopping Mall @it
range: shopping mall
comment: Relation between Trade Union and Shopping Mall
type: ObjectProperty
sub property of: place
domain: trade union

links to Adult Actor
domain: trade union
comment: Relation between Trade Union and Adult Actor
range: adult actor
type: ObjectProperty
sub property of: person
comment: Relazione tra Trade Union e Adult Actor @it

magazine
type: Class
label: περιοδικό @el

links to Congressman
range: congressman
domain: trade union
sub property of: person
comment: Relazione tra Trade Union e Congressman @it
type: ObjectProperty
comment: Relation between Trade Union and Congressman

military person
label: militaire @fr
type: Class

links to British Royalty
type: ObjectProperty
range: British royalty
domain: trade union
comment: Relazione tra Trade Union e British Royalty @it
comment: Relation between Trade Union and British Royalty
sub property of: person

philosopher
type: Class
label: philosophe @fr

links to Ice Hockey League
range: ice hockey league
sub property of: organisation
type: ObjectProperty
comment: Relation between Trade Union and Ice Hockey League
comment: Relazione tra Trade Union e Ice Hockey League @it
domain: trade union

award
type: ObjectProperty
label: récompense @fr
type: Class

links to College Coach
domain: trade union
type: ObjectProperty
sub property of: person
comment: Relation between Trade Union and College Coach
comment: Relazione tra Trade Union e College Coach @it
range: college coach

links to Hospital
sub property of: place
domain: trade union
comment: Relation between Trade Union and Hospital
type: ObjectProperty
range: hospital
comment: Relazione tra Trade Union e Hospital @it

sport
type: Class

cricketer
type: Class
label: joueur de cricket @fr

links to Newspaper
comment: Relazione tra Trade Union e Newspaper @it
comment: Relation between Trade Union and Newspaper
range: newspaper
sub property of: work
domain: trade union
type: ObjectProperty

Band
label: banda @pt
label: Musikgruppe @de
type: Class
label: groupe de musique @fr

town
label: ville @fr
type: Class

links to Film
comment: Relation between Trade Union and Film
range: film
sub property of: work
comment: Relazione tra Trade Union e Film @it
type: ObjectProperty
domain: trade union

university
label: πανεπιστήμιο @el
label: université @fr
type: Class

links to Criminal
comment: Relation between Trade Union and Criminal
comment: Relazione tra Trade Union e Criminal @it
domain: trade union
sub property of: person
type: ObjectProperty
range: criminal

links to Broadcast
type: ObjectProperty
sub property of: organisation
range: broadcast
domain: trade union
comment: Relation between Trade Union and Broadcast
comment: Relazione tra Trade Union e Broadcast @it

links to Baseball Player
range: baseball player
comment: Relazione tra Trade Union e Baseball Player @it
comment: Relation between Trade Union and Baseball Player
domain: trade union
sub property of: person
type: ObjectProperty

ethnic group
label: groupe ethnique @fr
type: ObjectProperty
type: Class

links to Sport
comment: Relation between Trade Union and Sport
comment: Relazione tra Trade Union e Sport @it
sub property of: activity
type: ObjectProperty
domain: trade union
range: sport

links to Flowering Plant
type: ObjectProperty
domain: trade union
sub property of: species
range: flowering plant
comment: Relation between Trade Union and Flowering Plant
comment: Relazione tra Trade Union e Flowering Plant @it

links to Lake
domain: trade union
type: ObjectProperty
range: lake
comment: Relazione tra Trade Union e Lake @it
sub property of: place
comment: Relation between Trade Union and Lake

college coach
label: entraîneur universitaire @fr
type: Class

television episode
label: épisode télévisé @fr
type: Class

village
label: χωριό @el
type: Class

ice hockey league
label: ligue d'hockey sur glace @fr
type: Class

links to Comics Creator
domain: trade union
comment: Relation between Trade Union and Comics Creator
sub property of: person
comment: Relazione tra Trade Union e Comics Creator @it
range: comics creator
type: ObjectProperty

links to Book
domain: trade union
range: book
comment: Relation between Trade Union and Book
sub property of: work
type: ObjectProperty
comment: Relazione tra Trade Union e Book @it

soccer club
label: club de football @fr
type: Class

links to Historic Place
range: historic place
type: ObjectProperty
comment: Relation between Trade Union and Historic Place
comment: Relazione tra Trade Union e Historic Place @it
domain: trade union
sub property of: place

links to Film Festival
comment: Relazione tra Trade Union e Film Festival @it
sub property of: event
type: ObjectProperty
comment: Relation between Trade Union and Film Festival
range: film festival
domain: trade union

office holder
type: Class
label: Amtsinhaber @de
label: titulaire @fr

baseball player
type: Class
label: joueur de baseball @fr

military conflict
type: Class
label: conflit militaire @fr

website
label: site web @fr
label: Ιστότοπος @el
type: Class
type: ObjectProperty

links to Writer
domain: trade union
comment: Relazione tra Trade Union e Writer @it
type: ObjectProperty
range: writer
comment: Relation between Trade Union and Writer
sub property of: person

adult actor
label: acteur adulte @fr
type: Class
label: erwachsener Schauspieler @de

links to Band
comment: Relazione tra Trade Union e Band @it
type: ObjectProperty
comment: Relation between Trade Union and Band
range: Band
domain: trade union
sub property of: organisation

links to Mountain
comment: Relation between Trade Union and Mountain
comment: Relazione tra Trade Union e Mountain @it
domain: trade union
sub property of: place
type: ObjectProperty
range: mountain

ice hockey player
type: Class
label: joueur de hockey sur glace @fr

links to Office Holder
comment: Relation between Trade Union and Office Holder
domain: trade union
range: office holder
type: ObjectProperty
sub property of: person
comment: Relazione tra Trade Union e Office Holder @it

links to Mayor
type: ObjectProperty
sub property of: person
comment: Relazione tra Trade Union e Mayor @it
comment: Relation between Trade Union and Mayor
range: mayor
domain: trade union

beverage
type: ObjectProperty
type: Class
label: boisson @fr

links to Ice Hockey Player
comment: Relazione tra Trade Union e Ice Hockey Player @it
domain: trade union
type: ObjectProperty
sub property of: person
comment: Relation between Trade Union and Ice Hockey Player
range: ice hockey player

links to Soccer Club
type: ObjectProperty
comment: Relazione tra Trade Union e Soccer Club @it
domain: trade union
comment: Relation between Trade Union and Soccer Club
sub property of: organisation
range: soccer club

links to Soccer League
sub property of: organisation
comment: Relazione tra Trade Union e Soccer League @it
type: ObjectProperty
domain: trade union
range: soccer league
comment: Relation between Trade Union and Soccer League

scientist
label: Wissenschaftler @de
type: Class
label: scientifique @fr

links to Disease
domain: trade union
comment: Relation between Trade Union and Disease
type: ObjectProperty
comment: Relazione tra Trade Union e Disease @it
sub property of: disease
range: disease

organisation
label: Organisation @de
label: organização @pt
type: ObjectProperty

baseball league
type: Class
label: ligue de baseball @fr

links to Military Conflict
range: military conflict
sub property of: event
domain: trade union
type: ObjectProperty
comment: Relation between Trade Union and Military Conflict
comment: Relazione tra Trade Union e Military Conflict @it

broadcast
type: Class
label: Émission de télévision @fr

island
label: île @fr
label: νησί @el
type: Class

links to Journalist
sub property of: person
comment: Relation between Trade Union and Journalist
range: journalist
type: ObjectProperty
comment: Relazione tra Trade Union e Journalist @it
domain: trade union

event
label: évènement @fr
type: ObjectProperty

skyscraper
type: Class
label: gratte-ciel @fr

links to Continent
range: continent
sub property of: place
type: ObjectProperty
comment: Relation between Trade Union and Continent
domain: trade union
comment: Relazione tra Trade Union e Continent @it

links to Lacrosse League
comment: Relation between Trade Union and Lacrosse League
domain: trade union
type: ObjectProperty
range: lacrosse league
comment: Relazione tra Trade Union e Lacrosse League @it
sub property of: organisation

radio station
type: Class
label: station de radio @fr

member of parliament
label: membre du Parlement @fr
type: Class

links to Supreme Court Of The United States Case
type: ObjectProperty
comment: Relazione tra Trade Union e Supreme Court Of The United States Case @it
sub property of: Legal Case
domain: trade union
comment: Relation between Trade Union and Supreme Court Of The United States Case
range: Supreme Court of the United States case

airport
label: aéroport @fr
label: Flughafen @de
type: Class