links to World Heritage Site
comment: Relation between Video Game and World Heritage Site
comment: Relazione tra Video Game e World Heritage Site @it
range: World Heritage Site
type: ObjectProperty
sub property of: place
domain: video game

television show
type: Class
label: émission de télévision @fr

rocket
type: Class
label: fusée @fr

links to Museum
comment: Relation between Video Game and Museum
type: ObjectProperty
sub property of: place
comment: Relazione tra Video Game e Museum @it
range: museum
domain: video game

disease
label: maladie @fr
type: Class
type: ObjectProperty

links to Golf League
range: golf league
sub property of: organisation
comment: Relation between Video Game and Golf League
domain: video game
comment: Relazione tra Video Game e Golf League @it
type: ObjectProperty

automobile
type: Class

colour
type: Class
label: couleur @fr
label: χρώμα @el
type: ObjectProperty

Election
label: élection @fr
type: Class

links to Grand Prix
comment: Relation between Video Game and Grand Prix
domain: video game
comment: Relazione tra Video Game e Grand Prix @it
type: ObjectProperty
sub property of: event
range: Grand Prix

links to Reptile
type: ObjectProperty
comment: Relazione tra Video Game e Reptile @it
domain: video game
range: reptile
sub property of: species
comment: Relation between Video Game and Reptile

links to Formula One Racer
comment: Relation between Video Game and Formula One Racer
domain: video game
range: Formula One racer
comment: Relazione tra Video Game e Formula One Racer @it
type: ObjectProperty
sub property of: person

links to Cyclist
domain: video game
type: ObjectProperty
comment: Relazione tra Video Game e Cyclist @it
sub property of: person
comment: Relation between Video Game and Cyclist
range: cyclist

mean of transportation
label: moyen de transport @fr
type: ObjectProperty

american football player
label: joueur de football américain @fr
type: Class

links to Mountain
sub property of: place
range: mountain
type: ObjectProperty
comment: Relazione tra Video Game e Mountain @it
domain: video game
comment: Relation between Video Game and Mountain

stadium
type: Class
label: stade @fr

soccer league
type: Class
label: ligue de football @fr

astronaut
label: astronaute @fr
label: Astronaut @de
type: Class

links to Comics Creator
related match: designer
type: NamedIndividual
range: comics creator
comment: Relazione tra Video Game e Comics Creator @it
comment: Relation between Video Game and Comics Creator
domain: video game
type: ObjectProperty
sub property of: person

videogames league
type: Class
label: ligue de jeux vidéo @fr

links to Flowering Plant
comment: Relazione tra Video Game e Flowering Plant @it
comment: Relation between Video Game and Flowering Plant
type: ObjectProperty
domain: video game
sub property of: species
range: flowering plant

links to Rugby Player
comment: Relazione tra Video Game e Rugby Player @it
domain: video game
comment: Relation between Video Game and Rugby Player
type: ObjectProperty
sub property of: person
range: rugby player

links to Sport
range: sport
sub property of: activity
comment: Relation between Video Game and Sport
type: ObjectProperty
domain: video game
comment: Relazione tra Video Game e Sport @it

links to Lighthouse
range: lighthouse
sub property of: place
type: ObjectProperty
domain: video game
comment: Relation between Video Game and Lighthouse
comment: Relazione tra Video Game e Lighthouse @it

wrestler
type: Class
label: lutteur @fr

links to City
related match: subdivisionName
type: NamedIndividual
sub property of: place
comment: Relation between Video Game and City
range: city
type: ObjectProperty
domain: video game
comment: Relazione tra Video Game e City @it

amphibian
type: Class
label: amphibien @fr

links to Bacteria
comment: Relazione tra Video Game e Bacteria @it
sub property of: species
domain: video game
comment: Relation between Video Game and Bacteria
range: bacteria
type: ObjectProperty

pope
label: pape @fr
type: Class

species
type: ObjectProperty
label: espèce @fr

links to Park
type: ObjectProperty
comment: Relation between Video Game and Park
sub property of: place
comment: Relazione tra Video Game e Park @it
range: park
domain: video game

links to Soccer Club
comment: Relation between Video Game and Soccer Club
range: soccer club
domain: video game
sub property of: organisation
type: ObjectProperty
comment: Relazione tra Video Game e Soccer Club @it

links to Pope
range: pope
comment: Relazione tra Video Game e Pope @it
sub property of: person
comment: Relation between Video Game and Pope
type: ObjectProperty
domain: video game

links to Airport
domain: video game
comment: Relation between Video Game and Airport
sub property of: place
comment: Relazione tra Video Game e Airport @it
range: airport
type: ObjectProperty

links to Saint
domain: video game
sub property of: person
comment: Relazione tra Video Game e Saint @it
comment: Relation between Video Game and Saint
range: saint
type: ObjectProperty

newspaper
label: journal @fr
type: Class

links to American Football Team
type: ObjectProperty
domain: video game
comment: Relation between Video Game and American Football Team
range: american football team
comment: Relazione tra Video Game e American Football Team @it
sub property of: organisation

game
label: jeu @fr
type: Class

protected area
type: Class
label: προστατευμένη περιοχή @el
label: aire protégée @fr

links to Space Station
domain: video game
type: ObjectProperty
sub property of: mean of transportation
range: space station
comment: Relation between Video Game and Space Station
comment: Relazione tra Video Game e Space Station @it

road
label: route @fr
type: Class

ginkgo
type: Class

boxer
type: Class
label: boxeur @fr

judge
type: Class
label: juge @fr

World Heritage Site
type: Class
label: site du patrimoine mondial @fr

links to Cricketer
sub property of: person
comment: Relazione tra Video Game e Cricketer @it
range: cricketer
comment: Relation between Video Game and Cricketer
domain: video game
type: ObjectProperty

language
type: ObjectProperty
label: langage @fr
type: Class

station
type: Class

links to Model
domain: video game
type: ObjectProperty
range: model
comment: Relazione tra Video Game e Model @it
comment: Relation between Video Game and Model
sub property of: person

links to Comedian
sub property of: person
range: comedian
type: ObjectProperty
domain: video game
comment: Relation between Video Game and Comedian
comment: Relazione tra Video Game e Comedian @it

lake
label: lac @fr
type: Class

arachnid
label: arachnides @fr
type: Class

governor
label: gouverneur @fr
type: Class

links to Trade Union
range: trade union
comment: Relation between Video Game and Trade Union
comment: Relazione tra Video Game e Trade Union @it
type: ObjectProperty
domain: video game
sub property of: organisation

administrative region
type: Class
label: région administrative @fr

work
type: ObjectProperty
label: travail @fr
label: obra @pt

poker player
label: joueur de poker @fr
type: Class

river
type: Class
label: rivière @fr

links to Ship
comment: Relation between Video Game and Ship
type: ObjectProperty
range: ship
domain: video game
sub property of: mean of transportation
comment: Relazione tra Video Game e Ship @it

links to Monarch
range: monarch
domain: video game
comment: Relazione tra Video Game e Monarch @it
comment: Relation between Video Game and Monarch
type: ObjectProperty
sub property of: person

lacrosse league
label: ligue de crosse @fr
type: Class

school
type: Class
label: école @fr

museum
label: musée @fr
type: Class

ship
label: navire @fr
type: Class

fish
type: Class
label: poisson @fr

tennis player
label: joueur de tennis @fr
type: Class

links to Historic Place
range: historic place
comment: Relazione tra Video Game e Historic Place @it
comment: Relation between Video Game and Historic Place
domain: video game
type: ObjectProperty
sub property of: place

video game
type: Class
label: jeux vidéo @fr

trade union
label: syndicat professionnel @fr
type: Class

currency
label: devise @fr
type: Class
type: ObjectProperty

links to Language
type: ObjectProperty
sub property of: language
domain: video game
comment: Relazione tra Video Game e Language @it
range: language
comment: Relation between Video Game and Language

prime minister
label: premier ministre @fr
type: Class

British royalty
label: royauté Britannique @fr
type: Class

historic place
type: Class
label: site historique @fr

race
type: Class
label: course @fr

hospital
type: Class
label: hôpital @fr

links to Hospital
range: hospital
comment: Relation between Video Game and Hospital
type: ObjectProperty
sub property of: place
comment: Relazione tra Video Game e Hospital @it
domain: video game

monument
type: Class

links to Band
related match: composer
comment: Relation between Video Game and Band
sub property of: organisation
type: NamedIndividual
comment: Relazione tra Video Game e Band @it
type: ObjectProperty
related match: music
range: Band
domain: video game

links to Journalist
type: ObjectProperty
sub property of: person
comment: Relation between Video Game and Journalist
domain: video game
comment: Relazione tra Video Game e Journalist @it
range: journalist

continent
label: ήπειρος @el
type: Class

Axiom
dbpedia infobox matching weight: 0.4
annotated source: links to Musical Artist
annotated target: artist
annotated property: relatedMatch

links to Legislature
type: ObjectProperty
range: legislature
sub property of: organisation
comment: Relation between Video Game and Legislature
domain: video game
comment: Relazione tra Video Game e Legislature @it

links to Canal
type: ObjectProperty
range: canal
sub property of: place
comment: Relazione tra Video Game e Canal @it
comment: Relation between Video Game and Canal
domain: video game

links to Ginkgo
comment: Relation between Video Game and Ginkgo
sub property of: species
comment: Relazione tra Video Game e Ginkgo @it
range: ginkgo
domain: video game
type: ObjectProperty

album
type: Class
label: Album @de

president
label: président @fr
type: Class

figure skater
type: Class
label: patineur artistique @fr

links to Military Conflict
range: military conflict
sub property of: event
type: ObjectProperty
comment: Relazione tra Video Game e Military Conflict @it
domain: video game
comment: Relation between Video Game and Military Conflict
related match: genre
type: NamedIndividual

links to Bone
sub property of: anatomical structure
comment: Relazione tra Video Game e Bone @it
range: bone
comment: Relation between Video Game and Bone
type: ObjectProperty
domain: video game

person
label: personne @fr
type: ObjectProperty
label: pessoa @pt
label: Person @de

military unit
type: Class
label: unité militaire @fr

soccer manager
label: entraîneur de football @fr
type: Class

links to Convention
sub property of: event
comment: Relazione tra Video Game e Convention @it
domain: video game
comment: Relation between Video Game and Convention
range: convention
type: ObjectProperty

basketball team
type: Class

canadian football team
type: Class
label: équipe canadienne de football américain @fr

music genre
label: genre musical @fr
type: ObjectProperty
label: género musical @pt
type: Class

cycad
label: cycadophytes @fr
type: Class

Axiom
dbpedia infobox matching weight: 71.43
annotated target: writer
annotated source: links to Writer
annotated property: relatedMatch

writer
type: Class
label: écrivain @fr

links to Amphibian
comment: Relation between Video Game and Amphibian
domain: video game
range: amphibian
type: ObjectProperty
sub property of: species
comment: Relazione tra Video Game e Amphibian @it

links to Lacrosse League
comment: Relazione tra Video Game e Lacrosse League @it
range: lacrosse league
sub property of: organisation
domain: video game
type: ObjectProperty
comment: Relation between Video Game and Lacrosse League

links to Disease
comment: Relation between Video Game and Disease
comment: Relazione tra Video Game e Disease @it
type: ObjectProperty
sub property of: disease
domain: video game
range: disease

links to Television Show
domain: video game
comment: Relazione tra Video Game e Television Show @it
type: ObjectProperty
comment: Relation between Video Game and Television Show
range: television show
sub property of: work

record label
label: label discographique @fr
type: Class

links to Ethnic Group
comment: Relazione tra Video Game e Ethnic Group @it
comment: Relation between Video Game and Ethnic Group
range: ethnic group
domain: video game
sub property of: ethnic group
type: ObjectProperty

links to Airline
comment: Relazione tra Video Game e Airline @it
comment: Relation between Video Game and Airline
domain: video game
range: airline
sub property of: organisation
type: ObjectProperty

architect
type: Class
label: architecte @fr

links to Rocket
comment: Relation between Video Game and Rocket
type: ObjectProperty
comment: Relazione tra Video Game e Rocket @it
range: rocket
sub property of: mean of transportation
domain: video game

model
type: Class
label: mannequin @fr

links to Basketball League
comment: Relazione tra Video Game e Basketball League @it
type: ObjectProperty
domain: video game
comment: Relation between Video Game and Basketball League
sub property of: organisation
range: basketball league

city
label: cité @fr
type: Class

links to Music Genre
range: music genre
domain: video game
sub property of: music genre
type: ObjectProperty
comment: Relazione tra Video Game e Music Genre @it
comment: Relation between Video Game and Music Genre

crustacean
type: Class
label: crustacés @fr

links to Baseball Player
type: NamedIndividual
related match: programming
range: baseball player
comment: Relation between Video Game and Baseball Player
comment: Relazione tra Video Game e Baseball Player @it
sub property of: person
domain: video game
type: ObjectProperty

links to Protected Area
domain: video game
comment: Relation between Video Game and Protected Area
type: ObjectProperty
comment: Relazione tra Video Game e Protected Area @it
sub property of: place
range: protected area

links to Television Episode
comment: Relazione tra Video Game e Television Episode @it
range: television episode
sub property of: work
type: ObjectProperty
comment: Relation between Video Game and Television Episode
domain: video game

links to Rugby League
range: rugby league
comment: Relation between Video Game and Rugby League
domain: video game
sub property of: organisation
comment: Relazione tra Video Game e Rugby League @it
type: ObjectProperty

links to Stadium
comment: Relazione tra Video Game e Stadium @it
sub property of: place
type: ObjectProperty
range: stadium
comment: Relation between Video Game and Stadium
domain: video game

links to Beverage
comment: Relazione tra Video Game e Beverage @it
sub property of: beverage
domain: video game
range: beverage
comment: Relation between Video Game and Beverage
type: ObjectProperty

links to Weapon
comment: Relazione tra Video Game e Weapon @it
comment: Relation between Video Game and Weapon
sub property of: device
range: weapon
type: ObjectProperty
domain: video game

Grand Prix
type: Class
label: grand prix @fr

lighthouse
type: Class
label: phare @fr

links to University
domain: video game
sub property of: organisation
type: ObjectProperty
comment: Relazione tra Video Game e University @it
comment: Relation between Video Game and University
range: university

chancellor
type: Class
label: chancelier @fr

links to Architect
comment: Relation between Video Game and Architect
type: ObjectProperty
comment: Relazione tra Video Game e Architect @it
domain: video game
sub property of: person
range: architect

comics creator
label: créateur de bandes dessinées @fr
type: Class

links to Planet
domain: video game
comment: Relazione tra Video Game e Planet @it
range: planet
sub property of: planet
comment: Relation between Video Game and Planet
type: ObjectProperty

links to Philosopher
domain: video game
comment: Relation between Video Game and Philosopher
range: philosopher
type: ObjectProperty
sub property of: person
comment: Relazione tra Video Game e Philosopher @it

aircraft
label: αεροσκάφος @el
type: Class
label: avion @fr

VideoGame.owl
has author: Valentina Presutti
has author: Aldo Gangemi
type: Ontology
comment: VideoGame Encyclopedic Knowledge Pattern
has intent: To represent the encyclopedic knowledge expressed by an object typed as VideoGame
extracted from: en.wikipedia.org
extracted from: dbpedia.org
has author: Andrea Giovanni Nuzzolese
imports: cpannotationschema.owl
imports: dbpediainfoboxmatchingweight.owl

hockey team
type: Class
label: équipe de hockey @fr

soccer player
label: joueur de football @fr
type: Class

links to Space Mission
range: space mission
sub property of: event
comment: Relazione tra Video Game e Space Mission @it
domain: video game
type: ObjectProperty
comment: Relation between Video Game and Space Mission

reptile
type: Class

legislature
label: pouvoir législatif @fr
type: Class

links to Administrative Region
sub property of: place
range: administrative region
comment: Relation between Video Game and Administrative Region
domain: video game
type: ObjectProperty
comment: Relazione tra Video Game e Administrative Region @it

airline
type: Class
label: compagnie aérienne @fr

Axiom
dbpedia infobox matching weight: 0.4
annotated property: relatedMatch
annotated source: links to Musical Artist
annotated target: designer

links to Military Person
comment: Relazione tra Video Game e Military Person @it
sub property of: person
type: ObjectProperty
domain: video game
comment: Relation between Video Game and Military Person
range: military person

links to Military Unit
sub property of: organisation
comment: Relazione tra Video Game e Military Unit @it
domain: video game
type: ObjectProperty
comment: Relation between Video Game and Military Unit
range: military unit
related match: developer
type: NamedIndividual

monarch
type: Class
label: monarque @fr

congressman
label: membre du Congrès @fr
type: Class

golf player
type: Class
label: golfeur @fr

activity
type: ObjectProperty
label: Aktivität @de
label: activité @fr

nascar driver
type: Class
label: pilote de la nascar @fr

journalist
type: Class
label: journaliste @fr

space mission
label: mission spatiale @fr
label: διαστημική αποστολή @el
type: Class

insect
label: insecte @fr
type: Class

links to Wrestler
domain: video game
comment: Relation between Video Game and Wrestler
type: ObjectProperty
comment: Relazione tra Video Game e Wrestler @it
sub property of: person
range: wrestler

links to Ice Hockey League
type: ObjectProperty
comment: Relation between Video Game and Ice Hockey League
comment: Relazione tra Video Game e Ice Hockey League @it
domain: video game
sub property of: organisation
range: ice hockey league

film
type: Class
label: ταινία @el

links to Historic Building
comment: Relation between Video Game and Historic Building
domain: video game
type: ObjectProperty
range: historic building
comment: Relazione tra Video Game e Historic Building @it
sub property of: place

links to Basketball Team
comment: Relazione tra Video Game e Basketball Team @it
comment: Relation between Video Game and Basketball Team
range: basketball team
type: ObjectProperty
domain: video game
sub property of: organisation

american football team
type: Class
label: équipe américaine de football américain @fr

links to Mixed Martial Arts Event
range: mixed martial arts event
comment: Relation between Video Game and Mixed Martial Arts Event
sub property of: event
domain: video game
comment: Relazione tra Video Game e Mixed Martial Arts Event @it
type: ObjectProperty

links to Election
comment: Relation between Video Game and Election
sub property of: event
range: Election
comment: Relazione tra Video Game e Election @it
domain: video game
type: ObjectProperty

bird
label: oiseau @fr
type: Class

chemical compound
type: Class
type: ObjectProperty
label: produit chimique @fr

links to Award
domain: video game
range: award
comment: Relazione tra Video Game e Award @it
comment: Relation between Video Game and Award
type: ObjectProperty
sub property of: award

Gaelic games player
label: joueur de sports gaéliques @fr
type: Class

links to Figure Skater
comment: Relation between Video Game and Figure Skater
range: figure skater
sub property of: person
domain: video game
type: ObjectProperty
comment: Relazione tra Video Game e Figure Skater @it

links to Mountain Range
sub property of: place
type: ObjectProperty
domain: video game
comment: Relation between Video Game and Mountain Range
range: mountain range
comment: Relazione tra Video Game e Mountain Range @it

fungus
type: Class
label: fungi @fr

fern
type: Class
label: fougères @fr

links to Soccer Manager
type: ObjectProperty
range: soccer manager
sub property of: person
domain: video game
comment: Relation between Video Game and Soccer Manager
comment: Relazione tra Video Game e Soccer Manager @it

musical artist
label: artista musical @pt
type: Class
label: musicien @fr

Axiom
dbpedia infobox matching weight: 0.4
annotated property: relatedMatch
annotated source: links to Musical Artist
annotated target: composers

links to Office Holder
type: ObjectProperty
domain: video game
comment: Relation between Video Game and Office Holder
comment: Relazione tra Video Game e Office Holder @it
range: office holder
sub property of: person

links to Single
domain: video game
type: ObjectProperty
comment: Relazione tra Video Game e Single @it
sub property of: work
range: single
comment: Relation between Video Game and Single

links to Village
comment: Relation between Video Game and Village
domain: video game
type: ObjectProperty
range: village
comment: Relazione tra Video Game e Village @it
sub property of: place

Axiom
dbpedia infobox matching weight: 25.0
annotated property: relatedMatch
annotated target: composer
annotated source: links to Band

links to Judge
comment: Relation between Video Game and Judge
sub property of: person
comment: Relazione tra Video Game e Judge @it
domain: video game
type: ObjectProperty
range: judge

park
type: Class
label: parc @fr

brain
type: Class
label: cerveau @fr

links to Nascar Driver
domain: video game
comment: Relation between Video Game and Nascar Driver
comment: Relazione tra Video Game e Nascar Driver @it
sub property of: person
range: nascar driver
type: ObjectProperty

rugby player
label: joueur de rugby @fr
type: Class

links to Arachnid
sub property of: species
range: arachnid
comment: Relazione tra Video Game e Arachnid @it
type: ObjectProperty
comment: Relation between Video Game and Arachnid
domain: video game

american football league
type: Class

musical
label: musique @fr
type: Class

links to Fern
range: fern
comment: Relazione tra Video Game e Fern @it
comment: Relation between Video Game and Fern
sub property of: species
domain: video game
type: ObjectProperty

cyclist
label: cycliste @fr
type: Class

links to Musical
range: musical
comment: Relation between Video Game and Musical
comment: Relazione tra Video Game e Musical @it
sub property of: work
domain: video game
type: ObjectProperty

Axiom
dbpedia infobox matching weight: 100.0
annotated source: links to Non- Profit Organisation
annotated property: relatedMatch
annotated target: platforms

links to Adult Actor
range: adult actor
comment: Relazione tra Video Game e Adult Actor @it
domain: video game
comment: Relation between Video Game and Adult Actor
type: ObjectProperty
sub property of: person

links to Island
domain: video game
type: ObjectProperty
sub property of: place
comment: Relation between Video Game and Island
comment: Relazione tra Video Game e Island @it
range: island

place
type: ObjectProperty
label: περιοχή @el
label: lieu @fr
label: lugar @pt

links to Canadian Football Team
comment: Relazione tra Video Game e Canadian Football Team @it
comment: Relation between Video Game and Canadian Football Team
type: ObjectProperty
domain: video game
sub property of: organisation
range: canadian football team

links to Crustacean
range: crustacean
type: ObjectProperty
domain: video game
comment: Relazione tra Video Game e Crustacean @it
comment: Relation between Video Game and Crustacean
sub property of: species

links to Chancellor
comment: Relazione tra Video Game e Chancellor @it
range: chancellor
type: ObjectProperty
domain: video game
comment: Relation between Video Game and Chancellor
sub property of: person

links to Continent
sub property of: place
domain: video game
range: continent
comment: Relazione tra Video Game e Continent @it
comment: Relation between Video Game and Continent
type: ObjectProperty
related match: released
type: NamedIndividual

wrestling event
type: Class
label: match de catch @fr

infrastructure
type: ObjectProperty

links to Playboy Playmate
domain: video game
type: ObjectProperty
comment: Relation between Video Game and Playboy Playmate
range: Playboy Playmate
sub property of: person
comment: Relazione tra Video Game e Playboy Playmate @it

Axiom
dbpedia infobox matching weight: 98.8
annotated source: links to Musical Artist
annotated target: composer
annotated property: relatedMatch

links to Christian Bishop
range: Christian Bishop
comment: Relazione tra Video Game e Christian Bishop @it
type: ObjectProperty
domain: video game
sub property of: person
comment: Relation between Video Game and Christian Bishop

links to Writer
type: ObjectProperty
type: NamedIndividual
domain: video game
range: writer
comment: Relazione tra Video Game e Writer @it
related match: writer
comment: Relation between Video Game and Writer
sub property of: person
related match: designer

basketball league
label: ligue de basketball @fr
type: Class

links to Mollusca
range: mollusca
sub property of: species
comment: Relazione tra Video Game e Mollusca @it
comment: Relation between Video Game and Mollusca
domain: video game
type: ObjectProperty

links to American Football League
sub property of: organisation
comment: Relation between Video Game and American Football League
comment: Relazione tra Video Game e American Football League @it
range: american football league
type: ObjectProperty
domain: video game

mountain
label: Βουνό @el
label: montagne @fr
type: Class

criminal
label: criminel @fr
type: Class

links to Radio Station
comment: Relation between Video Game and Radio Station
range: radio station
sub property of: organisation
type: ObjectProperty
domain: video game
comment: Relazione tra Video Game e Radio Station @it

space shuttle
type: Class
label: navette spatiale @fr

flowering plant
type: Class
label: angiospermes @fr

senator
label: sénateur @fr
type: Class

links to Aircraft
comment: Relazione tra Video Game e Aircraft @it
comment: Relation between Video Game and Aircraft
range: aircraft
sub property of: mean of transportation
type: ObjectProperty
domain: video game

saint
type: Class

valley
label: vallée @fr
type: Class

links to Space Shuttle
comment: Relazione tra Video Game e Space Shuttle @it
range: space shuttle
comment: Relation between Video Game and Space Shuttle
sub property of: mean of transportation
type: ObjectProperty
domain: video game

comedian
label: comédien @fr
type: Class

Axiom
dbpedia infobox matching weight: 50.0
annotated property: relatedMatch
annotated target: lastAlbum
annotated source: links to Album

links to Hockey Team
comment: Relation between Video Game and Hockey Team
type: ObjectProperty
comment: Relazione tra Video Game e Hockey Team @it
range: hockey team
sub property of: organisation
domain: video game

Playboy Playmate
label: playmate pour Playboy @fr
type: Class

convention
label: congrès @fr
type: Class

links to Poker Player
sub property of: person
range: poker player
type: ObjectProperty
comment: Relazione tra Video Game e Poker Player @it
comment: Relation between Video Game and Poker Player
domain: video game
related match: designer
type: NamedIndividual

book
type: Class
label: livre @fr
label: βιβλίο @el
label: książka @pl
label: llibre @ca

device
label: appareil @fr
type: ObjectProperty

shopping mall
type: Class
label: centre commercial @fr

Axiom
dbpedia infobox matching weight: 100.0
annotated property: relatedMatch
annotated target: designer
annotated source: links to Poker Player

links to Lake
range: lake
sub property of: place
type: ObjectProperty
domain: video game
comment: Relation between Video Game and Lake
comment: Relazione tra Video Game e Lake @it

links to Eurovision Song Contest Entry
comment: Relazione tra Video Game e Eurovision Song Contest Entry @it
comment: Relation between Video Game and Eurovision Song Contest Entry
range: Eurovision song contest entry
sub property of: work
domain: video game
type: ObjectProperty

links to Musical Artist
domain: video game
sub property of: person
related match: composers
type: NamedIndividual
related match: designer
range: musical artist
type: ObjectProperty
comment: Relation between Video Game and Musical Artist
related match: artist
related match: composer
comment: Relazione tra Video Game e Musical Artist @it

links to Automobile
domain: video game
sub property of: mean of transportation
type: ObjectProperty
comment: Relation between Video Game and Automobile
comment: Relazione tra Video Game e Automobile @it
range: automobile

bacteria
type: Class
label: bactérie @fr

links to Tennis Player
domain: video game
comment: Relazione tra Video Game e Tennis Player @it
comment: Relation between Video Game and Tennis Player
type: ObjectProperty
sub property of: person
range: tennis player

ski area
type: Class
label: domaine skiable @fr

links to Ski Area
domain: video game
type: ObjectProperty
range: ski area
sub property of: place
comment: Relazione tra Video Game e Ski Area @it
comment: Relation between Video Game and Ski Area

space station
type: Class
label: station spatiale @fr

non-profit organisation
type: Class
label: organisation à but non lucratif @fr

canadian football league
type: Class

rugby league
label: ligue de rugby @fr
type: Class

mollusca
label: mollusque @fr
type: Class

links to Member Of Parliament
sub property of: person
comment: Relazione tra Video Game e Member Of Parliament @it
range: member of parliament
comment: Relation between Video Game and Member Of Parliament
domain: video game
type: ObjectProperty

Axiom
dbpedia infobox matching weight: 100.0
annotated source: links to Continent
annotated property: relatedMatch
annotated target: released

weapon
label: arme @fr
type: Class

links to Broadcast
domain: video game
type: ObjectProperty
range: broadcast
sub property of: organisation
comment: Relation between Video Game and Broadcast
comment: Relazione tra Video Game e Broadcast @it

links to Baseball League
type: ObjectProperty
comment: Relation between Video Game and Baseball League
sub property of: organisation
range: baseball league
domain: video game
comment: Relazione tra Video Game e Baseball League @it

drug
type: ObjectProperty
label: médicament @fr
type: Class

links to Currency
type: ObjectProperty
range: currency
domain: video game
comment: Relation between Video Game and Currency
comment: Relazione tra Video Game e Currency @it
sub property of: currency

links to Prime Minister
domain: video game
comment: Relazione tra Video Game e Prime Minister @it
comment: Relation between Video Game and Prime Minister
range: prime minister
type: ObjectProperty
sub property of: person

Axiom
dbpedia infobox matching weight: 50.0
annotated property: relatedMatch
annotated target: nextAlbum
annotated source: links to Album

links to Fungus
domain: video game
type: ObjectProperty
range: fungus
comment: Relazione tra Video Game e Fungus @it
sub property of: species
comment: Relation between Video Game and Fungus

links to Book
sub property of: work
comment: Relazione tra Video Game e Book @it
range: book
type: ObjectProperty
domain: video game
comment: Relation between Video Game and Book

links to Drug
comment: Relazione tra Video Game e Drug @it
range: drug
sub property of: drug
domain: video game
comment: Relation between Video Game and Drug
type: ObjectProperty

links to Conifer
comment: Relation between Video Game and Conifer
sub property of: species
range: conifer
type: ObjectProperty
comment: Relazione tra Video Game e Conifer @it
domain: video game

canal
type: Class

military person
type: Class
label: militaire @fr

links to Bird
type: ObjectProperty
comment: Relazione tra Video Game e Bird @it
sub property of: species
range: bird
comment: Relation between Video Game and Bird
domain: video game

philosopher
type: Class
label: philosophe @fr

award
type: Class
label: récompense @fr
type: ObjectProperty

locomotive
type: Class

college
type: Class

links to Film
domain: video game
type: ObjectProperty
comment: Relation between Video Game and Film
range: film
comment: Relazione tra Video Game e Film @it
sub property of: work

anatomical structure
label: structure anatomique @fr
type: ObjectProperty

sport
type: Class

links to Governor
range: governor
domain: video game
comment: Relazione tra Video Game e Governor @it
comment: Relation between Video Game and Governor
sub property of: person
type: ObjectProperty

links to Shopping Mall
comment: Relation between Video Game and Shopping Mall
sub property of: place
comment: Relazione tra Video Game e Shopping Mall @it
range: shopping mall
domain: video game
type: ObjectProperty

restaurant
type: Class

cricketer
label: joueur de cricket @fr
type: Class

single
type: Class

mixed martial arts event
label: évènement d'arts martiaux mixtes @fr
type: Class

Band
label: banda @pt
label: Musikgruppe @de
type: Class
label: groupe de musique @fr

Axiom
dbpedia infobox matching weight: 100.0
annotated property: relatedMatch
annotated target: programming
annotated source: links to Baseball Player

town
label: ville @fr
type: Class

links to School
range: school
sub property of: organisation
comment: Relazione tra Video Game e School @it
comment: Relation between Video Game and School
domain: video game
type: ObjectProperty

university
label: πανεπιστήμιο @el
label: université @fr
type: Class

links to Videogames League
type: ObjectProperty
sub property of: organisation
domain: video game
comment: Relazione tra Video Game e Videogames League @it
comment: Relation between Video Game and Videogames League
range: videogames league

protein
type: ObjectProperty
type: Class
label: protéine @fr

ethnic group
type: Class
type: ObjectProperty
label: groupe ethnique @fr

links to Station
comment: Relazione tra Video Game e Station @it
comment: Relation between Video Game and Station
range: station
domain: video game
type: ObjectProperty
sub property of: place

links to Soccer League
range: soccer league
comment: Relazione tra Video Game e Soccer League @it
sub property of: organisation
type: ObjectProperty
comment: Relation between Video Game and Soccer League
domain: video game

motorcycle racing league
label: ligue de courses motocycliste @fr
type: Class

Axiom
dbpedia infobox matching weight: 28.57
annotated property: relatedMatch
annotated target: designer
annotated source: links to Writer

links to Gaelic Games Player
comment: Relation between Video Game and Gaelic Games Player
range: Gaelic games player
domain: video game
sub property of: person
type: ObjectProperty
comment: Relazione tra Video Game e Gaelic Games Player @it

hotel
label: hôtel @fr
type: Class

music festival
label: festival de musique @fr
type: Class

links to Monument
comment: Relation between Video Game and Monument
type: ObjectProperty
range: monument
domain: video game
comment: Relazione tra Video Game e Monument @it
sub property of: place

college coach
label: entraîneur universitaire @fr
type: Class

television episode
label: épisode télévisé @fr
type: Class

village
type: Class
label: χωριό @el

links to Album
related match: nextAlbum
sub property of: work
domain: video game
comment: Relation between Video Game and Album
comment: Relazione tra Video Game e Album @it
type: NamedIndividual
range: album
type: ObjectProperty
related match: lastAlbum

ice hockey league
type: Class
label: ligue d'hockey sur glace @fr

links to Skyscraper
comment: Relazione tra Video Game e Skyscraper @it
domain: video game
type: ObjectProperty
comment: Relation between Video Game and Skyscraper
range: skyscraper
sub property of: place

links to Ice Hockey Player
type: ObjectProperty
comment: Relazione tra Video Game e Ice Hockey Player @it
comment: Relation between Video Game and Ice Hockey Player
range: ice hockey player
sub property of: person
domain: video game

soccer club
type: Class
label: club de football @fr

links to Town
comment: Relation between Video Game and Town
comment: Relazione tra Video Game e Town @it
type: ObjectProperty
range: town
domain: video game
sub property of: place

historic building
type: Class
label: bâtiment historique @fr

links to Golf Player
domain: video game
comment: Relazione tra Video Game e Golf Player @it
type: ObjectProperty
sub property of: person
comment: Relation between Video Game and Golf Player
range: golf player

links to Congressman
comment: Relation between Video Game and Congressman
domain: video game
type: ObjectProperty
sub property of: person
range: congressman
comment: Relazione tra Video Game e Congressman @it

office holder
type: Class
label: Amtsinhaber @de
label: titulaire @fr

baseball player
type: Class
label: joueur de baseball @fr

military conflict
label: conflit militaire @fr
type: Class

links to Hotel
range: hotel
sub property of: place
type: ObjectProperty
comment: Relazione tra Video Game e Hotel @it
domain: video game
comment: Relation between Video Game and Hotel

links to Cycad
range: cycad
type: ObjectProperty
sub property of: species
domain: video game
comment: Relazione tra Video Game e Cycad @it
comment: Relation between Video Game and Cycad

Axiom
dbpedia infobox matching weight: 75.0
annotated target: music
annotated property: relatedMatch
annotated source: links to Band

links to Brain
sub property of: anatomical structure
comment: Relazione tra Video Game e Brain @it
domain: video game
type: ObjectProperty
range: brain
comment: Relation between Video Game and Brain

basketball player
type: Class
label: joueur de basketball @fr

adult actor
label: acteur adulte @fr
type: Class
label: erwachsener Schauspieler @de

links to Criminal
type: ObjectProperty
sub property of: person
range: criminal
comment: Relazione tra Video Game e Criminal @it
comment: Relation between Video Game and Criminal
domain: video game

links to Motorcycle Racing League
comment: Relazione tra Video Game e Motorcycle Racing League @it
domain: video game
type: ObjectProperty
sub property of: organisation
range: motorcycle racing league
comment: Relation between Video Game and Motorcycle Racing League

links to Record Label
domain: video game
comment: Relazione tra Video Game e Record Label @it
sub property of: organisation
comment: Relation between Video Game and Record Label
type: ObjectProperty
range: record label

ice hockey player
label: joueur de hockey sur glace @fr
type: Class

links to President
range: president
type: ObjectProperty
domain: video game
comment: Relation between Video Game and President
comment: Relazione tra Video Game e President @it
sub property of: person

links to Music Festival
domain: video game
comment: Relazione tra Video Game e Music Festival @it
sub property of: event
comment: Relation between Video Game and Music Festival
type: ObjectProperty
range: music festival

links to Chemical Compound
comment: Relazione tra Video Game e Chemical Compound @it
sub property of: chemical compound
comment: Relation between Video Game and Chemical Compound
domain: video game
type: ObjectProperty
range: chemical compound

links to Non- Profit Organisation
type: ObjectProperty
domain: video game
comment: Relation between Video Game and Non- Profit Organisation
range: non-profit organisation
sub property of: organisation
comment: Relazione tra Video Game e Non- Profit Organisation @it
related match: platforms
type: NamedIndividual

Christian Bishop
label: évêque chrétien @fr
type: Class

mountain range
label: chaîne de montagne @fr
type: Class

links to British Royalty
range: British royalty
type: ObjectProperty
sub property of: person
domain: video game
comment: Relation between Video Game and British Royalty
comment: Relazione tra Video Game e British Royalty @it

links to Comics Character
type: ObjectProperty
domain: video game
comment: Relation between Video Game and Comics Character
range: comics character
sub property of: person
comment: Relazione tra Video Game e Comics Character @it

beverage
label: boisson @fr
type: Class
type: ObjectProperty

links to Boxer
sub property of: person
comment: Relation between Video Game and Boxer
range: boxer
comment: Relazione tra Video Game e Boxer @it
domain: video game
type: ObjectProperty

links to Valley
sub property of: place
range: valley
comment: Relation between Video Game and Valley
comment: Relazione tra Video Game e Valley @it
type: ObjectProperty
domain: video game

links to Road
range: road
comment: Relazione tra Video Game e Road @it
comment: Relation between Video Game and Road
sub property of: infrastructure
type: ObjectProperty
domain: video game

planet
type: ObjectProperty
label: planète @fr
type: Class

links to Bridge
domain: video game
type: ObjectProperty
comment: Relazione tra Video Game e Bridge @it
range: bridge
comment: Relation between Video Game and Bridge
sub property of: place

Axiom
dbpedia infobox matching weight: 100.0
annotated source: links to Comics Creator
annotated target: designer
annotated property: relatedMatch

links to College
type: ObjectProperty
domain: video game
comment: Relazione tra Video Game e College @it
sub property of: organisation
comment: Relation between Video Game and College
range: college

scientist
type: Class
label: Wissenschaftler @de
label: scientifique @fr

links to Mammal
type: ObjectProperty
sub property of: species
comment: Relazione tra Video Game e Mammal @it
comment: Relation between Video Game and Mammal
range: mammal
domain: video game

links to Soccer Player
comment: Relation between Video Game and Soccer Player
sub property of: person
comment: Relazione tra Video Game e Soccer Player @it
range: soccer player
domain: video game
type: ObjectProperty

golf league
label: ligue de golf @fr
type: Class

links to Scientist
sub property of: person
comment: Relation between Video Game and Scientist
range: scientist
domain: video game
comment: Relazione tra Video Game e Scientist @it
type: ObjectProperty

links to Basketball Player
range: basketball player
type: ObjectProperty
comment: Relation between Video Game and Basketball Player
domain: video game
sub property of: person
comment: Relazione tra Video Game e Basketball Player @it

links to Astronaut
range: astronaut
comment: Relazione tra Video Game e Astronaut @it
comment: Relation between Video Game and Astronaut
sub property of: person
type: ObjectProperty
domain: video game

links to Newspaper
domain: video game
sub property of: work
comment: Relation between Video Game and Newspaper
range: newspaper
comment: Relazione tra Video Game e Newspaper @it
type: ObjectProperty

Axiom
dbpedia infobox matching weight: 100.0
annotated target: subdivisionName
annotated property: relatedMatch
annotated source: links to City

links to Senator
type: ObjectProperty
domain: video game
comment: Relazione tra Video Game e Senator @it
sub property of: person
range: senator
comment: Relation between Video Game and Senator

links to Olympics
range: olympics
comment: Relazione tra Video Game e Olympics @it
sub property of: event
comment: Relation between Video Game and Olympics
domain: video game
type: ObjectProperty

Axiom
dbpedia infobox matching weight: 100.0
annotated source: links to Military Conflict
annotated property: relatedMatch
annotated target: genre

olympics
label: Jeux Olympiques @fr
type: Class

organisation
label: Organisation @de
label: organização @pt
type: ObjectProperty

baseball league
type: Class
label: ligue de baseball @fr

bridge
type: Class
label: pont @fr

links to Restaurant
comment: Relation between Video Game and Restaurant
sub property of: place
range: restaurant
domain: video game
type: ObjectProperty
comment: Relazione tra Video Game e Restaurant @it

broadcast
label: Émission de télévision @fr
type: Class

links to River
sub property of: place
type: ObjectProperty
domain: video game
range: river
comment: Relazione tra Video Game e River @it
comment: Relation between Video Game and River

mammal
type: Class
label: mammifère @fr

Eurovision song contest entry
type: Class
label: concours Eurovision de la chanson @fr

island
type: Class
label: νησί @el
label: île @fr

Axiom
dbpedia infobox matching weight: 100.0
annotated property: relatedMatch
annotated source: links to Military Unit
annotated target: developer

links to Race
comment: Relazione tra Video Game e Race @it
sub property of: event
range: race
comment: Relation between Video Game and Race
domain: video game
type: ObjectProperty

links to Colour
sub property of: colour
domain: video game
comment: Relation between Video Game and Colour
comment: Relazione tra Video Game e Colour @it
range: colour
type: ObjectProperty

links to American Football Player
range: american football player
type: ObjectProperty
domain: video game
comment: Relazione tra Video Game e American Football Player @it
sub property of: person
comment: Relation between Video Game and American Football Player

links to Game
sub property of: activity
domain: video game
comment: Relation between Video Game and Game
type: ObjectProperty
comment: Relazione tra Video Game e Game @it
range: game

comics character
label: personnage de bandes dessinées @fr
type: Class

event
label: évènement @fr
type: ObjectProperty

Formula One racer
type: Class
label: pilote de formule 1 @fr

links to Protein
range: protein
type: ObjectProperty
comment: Relazione tra Video Game e Protein @it
comment: Relation between Video Game and Protein
sub property of: protein
domain: video game

skyscraper
type: Class
label: gratte-ciel @fr

links to Locomotive
comment: Relazione tra Video Game e Locomotive @it
type: ObjectProperty
range: locomotive
domain: video game
comment: Relation between Video Game and Locomotive
sub property of: mean of transportation

radio station
type: Class
label: station de radio @fr

links to Canadian Football League
range: canadian football league
comment: Relation between Video Game and Canadian Football League
sub property of: organisation
comment: Relazione tra Video Game e Canadian Football League @it
type: ObjectProperty
domain: video game

links to Insect
range: insect
sub property of: species
comment: Relation between Video Game and Insect
type: ObjectProperty
domain: video game
comment: Relazione tra Video Game e Insect @it

bone
type: Class
label: Knochen @de
label: os @fr

member of parliament
label: membre du Parlement @fr
type: Class

links to Wrestling Event
range: wrestling event
sub property of: event
type: ObjectProperty
comment: Relation between Video Game and Wrestling Event
domain: video game
comment: Relazione tra Video Game e Wrestling Event @it

links to Fish
comment: Relazione tra Video Game e Fish @it
range: fish
type: ObjectProperty
sub property of: species
comment: Relation between Video Game and Fish
domain: video game

conifer
label: conifères @fr
type: Class

airport
type: Class
label: Flughafen @de
label: aéroport @fr

links to College Coach
range: college coach
comment: Relazione tra Video Game e College Coach @it
comment: Relation between Video Game and College Coach
domain: video game
sub property of: person
type: ObjectProperty