links to Magazine
sub property of: work
domain: wrestling event
comment: Relazione tra Wrestling Event e Magazine @it
range: magazine
comment: Relation between Wrestling Event and Magazine
type: ObjectProperty

links to Village
type: ObjectProperty
sub property of: place
comment: Relazione tra Wrestling Event e Village @it
comment: Relation between Wrestling Event and Village
domain: wrestling event
range: village

links to Boxer
range: boxer
domain: wrestling event
type: ObjectProperty
comment: Relazione tra Wrestling Event e Boxer @it
comment: Relation between Wrestling Event and Boxer
sub property of: person

links to Shopping Mall
comment: Relation between Wrestling Event and Shopping Mall
sub property of: place
domain: wrestling event
type: ObjectProperty
range: shopping mall
comment: Relazione tra Wrestling Event e Shopping Mall @it

links to Music Genre
type: ObjectProperty
comment: Relazione tra Wrestling Event e Music Genre @it
comment: Relation between Wrestling Event and Music Genre
range: music genre
sub property of: music genre
domain: wrestling event

links to Ship
comment: Relation between Wrestling Event and Ship
sub property of: mean of transportation
range: ship
domain: wrestling event
comment: Relazione tra Wrestling Event e Ship @it
type: ObjectProperty

links to Office Holder
sub property of: person
comment: Relazione tra Wrestling Event e Office Holder @it
type: ObjectProperty
range: office holder
comment: Relation between Wrestling Event and Office Holder
domain: wrestling event

disease
label: maladie @fr
type: Class
type: ObjectProperty

links to Plant
comment: Relazione tra Wrestling Event e Plant @it
domain: wrestling event
type: ObjectProperty
sub property of: species
comment: Relation between Wrestling Event and Plant
range: plant

links to Website
sub property of: website
comment: Relazione tra Wrestling Event e Website @it
type: ObjectProperty
comment: Relation between Wrestling Event and Website
domain: wrestling event
range: website

links to President
comment: Relation between Wrestling Event and President
comment: Relazione tra Wrestling Event e President @it
type: ObjectProperty
range: president
domain: wrestling event
sub property of: person

american football league
type: Class

links to Disease
domain: wrestling event
comment: Relation between Wrestling Event and Disease
comment: Relazione tra Wrestling Event e Disease @it
range: disease
type: ObjectProperty
sub property of: disease

links to Cricketer
type: ObjectProperty
range: cricketer
comment: Relazione tra Wrestling Event e Cricketer @it
domain: wrestling event
sub property of: person
comment: Relation between Wrestling Event and Cricketer

american football player
label: joueur de football américain @fr
type: Class

mean of transportation
label: moyen de transport @fr
type: ObjectProperty

place
type: ObjectProperty
label: περιοχή @el
label: lieu @fr
label: lugar @pt

links to University
comment: Relation between Wrestling Event and University
type: ObjectProperty
domain: wrestling event
sub property of: organização
comment: Relazione tra Wrestling Event e University @it
range: university

wrestling event
type: Class
label: match de catch @fr

basketball league
type: Class
label: ligue de basketball @fr

criminal
type: Class
label: criminel @fr

mayor
label: maire @fr
type: Class

links to Basketball Team
type: ObjectProperty
domain: wrestling event
sub property of: organização
comment: Relazione tra Wrestling Event e Basketball Team @it
range: basketball team
comment: Relation between Wrestling Event and Basketball Team

species
type: Class
type: ObjectProperty
label: espèce @fr

comedian
type: Class
label: comédien @fr

links to Newspaper
comment: Relation between Wrestling Event and Newspaper
sub property of: work
type: ObjectProperty
range: newspaper
domain: wrestling event
comment: Relazione tra Wrestling Event e Newspaper @it

song
type: Class
label: chanson @fr

newspaper
type: Class
label: journal @fr

Playboy Playmate
label: playmate pour Playboy @fr
type: Class

links to Chemical Compound
comment: Relazione tra Wrestling Event e Chemical Compound @it
type: ObjectProperty
sub property of: chemical compound
comment: Relation between Wrestling Event and Chemical Compound
range: chemical compound
domain: wrestling event

links to River
comment: Relazione tra Wrestling Event e River @it
domain: wrestling event
sub property of: place
range: river
type: ObjectProperty
comment: Relation between Wrestling Event and River

links to Soccer Player
domain: wrestling event
sub property of: person
range: soccer player
comment: Relation between Wrestling Event and Soccer Player
comment: Relazione tra Wrestling Event e Soccer Player @it
type: ObjectProperty

links to Beverage
domain: wrestling event
sub property of: beverage
range: beverage
type: ObjectProperty
comment: Relazione tra Wrestling Event e Beverage @it
comment: Relation between Wrestling Event and Beverage

book
type: Class
label: livre @fr
label: βιβλίο @el
label: książka @pl
label: llibre @ca

boxer
type: Class
label: boxeur @fr

links to Model
comment: Relazione tra Wrestling Event e Model @it
sub property of: person
type: ObjectProperty
domain: wrestling event
comment: Relation between Wrestling Event and Model
range: model

device
type: ObjectProperty
label: appareil @fr

shopping mall
type: Class
label: centre commercial @fr

links to School
comment: Relazione tra Wrestling Event e School @it
domain: wrestling event
comment: Relation between Wrestling Event and School
type: ObjectProperty
sub property of: organização
range: school

language
type: ObjectProperty
label: langage @fr
type: Class

links to Mammal
domain: wrestling event
comment: Relation between Wrestling Event and Mammal
comment: Relazione tra Wrestling Event e Mammal @it
type: ObjectProperty
range: mammal
sub property of: species

non-profit organisation
type: Class
label: organisation à but non lucratif @fr

links to Town
range: town
sub property of: place
comment: Relazione tra Wrestling Event e Town @it
comment: Relation between Wrestling Event and Town
type: ObjectProperty
domain: wrestling event

arachnid
type: Class
label: arachnides @fr

weapon
type: Class
label: arme @fr

governor
label: gouverneur @fr
type: Class

administrative region
type: Class
label: région administrative @fr

links to Non- Profit Organisation
range: non-profit organisation
comment: Relazione tra Wrestling Event e Non- Profit Organisation @it
comment: Relation between Wrestling Event and Non- Profit Organisation
type: ObjectProperty
sub property of: organização
domain: wrestling event

links to Olympics
type: ObjectProperty
range: olympics
comment: Relation between Wrestling Event and Olympics
comment: Relazione tra Wrestling Event e Olympics @it
sub property of: event
domain: wrestling event

work
label: obra @pt
label: travail @fr
type: ObjectProperty

river
label: rivière @fr
type: Class

magazine
label: περιοδικό @el
type: Class

links to Album
comment: Relazione tra Wrestling Event e Album @it
sub property of: work
range: album
comment: Relation between Wrestling Event and Album
domain: wrestling event
type: ObjectProperty

school
label: école @fr
type: Class

ship
label: navire @fr
type: Class

video game
label: jeux vidéo @fr
type: Class

links to Nascar Driver
type: ObjectProperty
sub property of: person
comment: Relation between Wrestling Event and Nascar Driver
range: nascar driver
domain: wrestling event
comment: Relazione tra Wrestling Event e Nascar Driver @it

links to British Royalty
domain: wrestling event
type: ObjectProperty
sub property of: person
range: British royalty
comment: Relazione tra Wrestling Event e British Royalty @it
comment: Relation between Wrestling Event and British Royalty

currency
type: ObjectProperty
type: Class
label: devise @fr

British royalty
label: royauté Britannique @fr
type: Class

historic place
label: site historique @fr
type: Class

anatomical structure
label: structure anatomique @fr
type: ObjectProperty

links to Musical Artist
comment: Relazione tra Wrestling Event e Musical Artist @it
domain: wrestling event
type: ObjectProperty
range: musical artist
comment: Relation between Wrestling Event and Musical Artist
sub property of: person

links to Basketball League
domain: wrestling event
type: ObjectProperty
sub property of: organização
comment: Relazione tra Wrestling Event e Basketball League @it
range: basketball league
comment: Relation between Wrestling Event and Basketball League

cricketer
type: Class
label: joueur de cricket @fr

single
type: Class

mixed martial arts event
type: Class
label: évènement d'arts martiaux mixtes @fr

links to Adult Actor
range: adult actor
sub property of: person
comment: Relation between Wrestling Event and Adult Actor
domain: wrestling event
comment: Relazione tra Wrestling Event e Adult Actor @it
type: ObjectProperty

links to College Coach
type: ObjectProperty
domain: wrestling event
sub property of: person
comment: Relation between Wrestling Event and College Coach
comment: Relazione tra Wrestling Event e College Coach @it
range: college coach

town
label: ville @fr
type: Class

links to Skyscraper
comment: Relazione tra Wrestling Event e Skyscraper @it
type: ObjectProperty
comment: Relation between Wrestling Event and Skyscraper
domain: wrestling event
sub property of: place
range: skyscraper

links to Basketball Player
domain: wrestling event
type: ObjectProperty
range: basketball player
sub property of: person
comment: Relazione tra Wrestling Event e Basketball Player @it
comment: Relation between Wrestling Event and Basketball Player

links to Mixed Martial Arts Event
domain: wrestling event
sub property of: event
comment: Relazione tra Wrestling Event e Mixed Martial Arts Event @it
range: mixed martial arts event
type: ObjectProperty
comment: Relation between Wrestling Event and Mixed Martial Arts Event
type: NamedIndividual
related match: nextevent

links to Single
sub property of: work
type: ObjectProperty
comment: Relation between Wrestling Event and Single
comment: Relazione tra Wrestling Event e Single @it
range: single
domain: wrestling event

university
type: Class
label: université @fr
label: πανεπιστήμιο @el

links to Ice Hockey Player
type: ObjectProperty
domain: wrestling event
sub property of: person
range: ice hockey player
comment: Relazione tra Wrestling Event e Ice Hockey Player @it
comment: Relation between Wrestling Event and Ice Hockey Player

continent
type: Class
label: ήπειρος @el

ethnic group
type: Class
type: ObjectProperty
label: groupe ethnique @fr

links to Military Conflict
range: military conflict
type: ObjectProperty
comment: Relation between Wrestling Event and Military Conflict
comment: Relazione tra Wrestling Event e Military Conflict @it
domain: wrestling event
sub property of: event

president
type: Class
label: président @fr

links to Muscle
domain: wrestling event
comment: Relation between Wrestling Event and Muscle
comment: Relazione tra Wrestling Event e Muscle @it
type: ObjectProperty
range: muscle
sub property of: anatomical structure

album
label: Album @de
type: Class

links to Currency
comment: Relation between Wrestling Event and Currency
comment: Relazione tra Wrestling Event e Currency @it
type: ObjectProperty
range: currency
sub property of: currency
domain: wrestling event

links to Historic Place
comment: Relation between Wrestling Event and Historic Place
domain: wrestling event
range: historic place
sub property of: place
type: ObjectProperty
comment: Relazione tra Wrestling Event e Historic Place @it

WrestlingEvent.owl
type: Ontology
extracted from: dbpedia.org
comment: WrestlingEvent Encyclopedic Knowledge Pattern
imports: dbpediainfoboxmatchingweight.owl
has intent: To represent the encyclopedic knowledge expressed by an object typed as WrestlingEvent
extracted from: en.wikipedia.org
has author: Andrea Giovanni Nuzzolese
imports: cpannotationschema.owl
has author: Aldo Gangemi
has author: Valentina Presutti

links to Mayor
comment: Relation between Wrestling Event and Mayor
comment: Relazione tra Wrestling Event e Mayor @it
sub property of: person
type: ObjectProperty
range: mayor
domain: wrestling event

links to Species
range: species
type: ObjectProperty
sub property of: species
comment: Relazione tra Wrestling Event e Species @it
comment: Relation between Wrestling Event and Species
domain: wrestling event

person
label: Person @de
type: ObjectProperty
label: pessoa @pt
label: personne @fr

military unit
label: unité militaire @fr
type: Class

college coach
type: Class
label: entraîneur universitaire @fr

muscle
type: Class

basketball team
type: Class

village
label: χωριό @el
type: Class

links to Comics Creator
range: comics creator
comment: Relazione tra Wrestling Event e Comics Creator @it
domain: wrestling event
type: ObjectProperty
sub property of: person
comment: Relation between Wrestling Event and Comics Creator

links to Hockey Team
comment: Relation between Wrestling Event and Hockey Team
range: hockey team
domain: wrestling event
comment: Relazione tra Wrestling Event e Hockey Team @it
type: ObjectProperty
sub property of: organização

music genre
label: genre musical @fr
type: ObjectProperty
label: género musical @pt
type: Class

links to Comedian
sub property of: person
domain: wrestling event
range: comedian
comment: Relazione tra Wrestling Event e Comedian @it
type: ObjectProperty
comment: Relation between Wrestling Event and Comedian

links to American Football Player
type: ObjectProperty
range: american football player
comment: Relation between Wrestling Event and American Football Player
comment: Relazione tra Wrestling Event e American Football Player @it
domain: wrestling event
sub property of: person

office holder
label: titulaire @fr
label: Amtsinhaber @de
type: Class

baseball player
type: Class
label: joueur de baseball @fr

military conflict
label: conflit militaire @fr
type: Class

website
type: ObjectProperty
type: Class
label: site web @fr
label: Ιστότοπος @el

model
label: mannequin @fr
type: Class

Axiom
dbpedia infobox matching weight: 100.0
annotated target: nextevent
annotated property: relatedMatch
annotated source: links to Mixed Martial Arts Event

basketball player
type: Class
label: joueur de basketball @fr

adult actor
label: acteur adulte @fr
type: Class
label: erwachsener Schauspieler @de

links to Bone
type: ObjectProperty
range: bone
sub property of: anatomical structure
comment: Relation between Wrestling Event and Bone
domain: wrestling event
comment: Relazione tra Wrestling Event e Bone @it

ice hockey player
type: Class
label: joueur de hockey sur glace @fr

links to Song
comment: Relazione tra Wrestling Event e Song @it
type: ObjectProperty
range: song
comment: Relation between Wrestling Event and Song
sub property of: work
domain: wrestling event

links to Continent
domain: wrestling event
comment: Relation between Wrestling Event and Continent
sub property of: place
range: continent
comment: Relazione tra Wrestling Event e Continent @it
type: ObjectProperty

beverage
label: boisson @fr
type: Class
type: ObjectProperty

links to Broadcast
domain: wrestling event
type: ObjectProperty
comment: Relazione tra Wrestling Event e Broadcast @it
range: broadcast
comment: Relation between Wrestling Event and Broadcast
sub property of: organização

links to Military Unit
range: military unit
domain: wrestling event
comment: Relation between Wrestling Event and Military Unit
comment: Relazione tra Wrestling Event e Military Unit @it
sub property of: organização
type: ObjectProperty

comics creator
label: créateur de bandes dessinées @fr
type: Class

links to Ethnic Group
domain: wrestling event
comment: Relazione tra Wrestling Event e Ethnic Group @it
comment: Relation between Wrestling Event and Ethnic Group
range: ethnic group
sub property of: ethnic group
type: ObjectProperty

hockey team
type: Class
label: équipe de hockey @fr

soccer player
label: joueur de football @fr
type: Class

links to Video Game
sub property of: work
range: video game
comment: Relazione tra Wrestling Event e Video Game @it
type: ObjectProperty
comment: Relation between Wrestling Event and Video Game
domain: wrestling event

links to Administrative Region
comment: Relazione tra Wrestling Event e Administrative Region @it
domain: wrestling event
comment: Relation between Wrestling Event and Administrative Region
sub property of: place
range: administrative region
type: ObjectProperty

links to Governor
comment: Relation between Wrestling Event and Governor
type: ObjectProperty
sub property of: person
comment: Relazione tra Wrestling Event e Governor @it
domain: wrestling event
range: governor

links to Arachnid
comment: Relation between Wrestling Event and Arachnid
sub property of: species
domain: wrestling event
range: arachnid
comment: Relazione tra Wrestling Event e Arachnid @it
type: ObjectProperty

links to Baseball Player
comment: Relazione tra Wrestling Event e Baseball Player @it
comment: Relation between Wrestling Event and Baseball Player
range: baseball player
domain: wrestling event
sub property of: person
type: ObjectProperty

olympics
label: Jeux Olympiques @fr
type: Class

links to Weapon
domain: wrestling event
range: weapon
comment: Relazione tra Wrestling Event e Weapon @it
sub property of: device
comment: Relation between Wrestling Event and Weapon
type: ObjectProperty

organização
type: ObjectProperty
label: organisation
label: Organisation @de

links to Language
comment: Relation between Wrestling Event and Language
domain: wrestling event
comment: Relazione tra Wrestling Event e Language @it
type: ObjectProperty
sub property of: language
range: language

baseball league
type: Class
label: ligue de baseball @fr

links to American Football League
sub property of: organização
domain: wrestling event
comment: Relazione tra Wrestling Event e American Football League @it
range: american football league
comment: Relation between Wrestling Event and American Football League
type: ObjectProperty

links to Book
domain: wrestling event
type: ObjectProperty
comment: Relation between Wrestling Event and Book
sub property of: work
comment: Relazione tra Wrestling Event e Book @it
range: book

nascar driver
label: pilote de la nascar @fr
type: Class

links to Baseball League
range: baseball league
comment: Relation between Wrestling Event and Baseball League
type: ObjectProperty
domain: wrestling event
sub property of: organização
comment: Relazione tra Wrestling Event e Baseball League @it

plant
label: plante @fr
type: Class

broadcast
type: Class
label: Émission de télévision @fr

links to Island
range: island
type: ObjectProperty
comment: Relation between Wrestling Event and Island
sub property of: place
domain: wrestling event
comment: Relazione tra Wrestling Event e Island @it

film
type: Class
label: ταινία @el

links to Playboy Playmate
domain: wrestling event
comment: Relazione tra Wrestling Event e Playboy Playmate @it
type: ObjectProperty
sub property of: person
comment: Relation between Wrestling Event and Playboy Playmate
range: Playboy Playmate

mammal
type: Class
label: mammifère @fr

links to Comics Character
range: comics character
comment: Relation between Wrestling Event and Comics Character
comment: Relazione tra Wrestling Event e Comics Character @it
sub property of: person
domain: wrestling event
type: ObjectProperty

american football team
label: équipe américaine de football américain @fr
type: Class

island
type: Class
label: νησί @el
label: île @fr

links to Film
range: film
type: ObjectProperty
comment: Relazione tra Wrestling Event e Film @it
domain: wrestling event
comment: Relation between Wrestling Event and Film
sub property of: work

comics character
type: Class
label: personnage de bandes dessinées @fr

event
type: ObjectProperty
label: évènement @fr

chemical compound
type: Class
type: ObjectProperty
label: produit chimique @fr

skyscraper
type: Class
label: gratte-ciel @fr

bone
type: Class
label: Knochen @de
label: os @fr

musical artist
label: artista musical @pt
type: Class
label: musicien @fr

links to American Football Team
range: american football team
domain: wrestling event
comment: Relation between Wrestling Event and American Football Team
sub property of: organização
type: ObjectProperty
comment: Relazione tra Wrestling Event e American Football Team @it

links to Criminal
sub property of: person
type: ObjectProperty
comment: Relazione tra Wrestling Event e Criminal @it
range: criminal
domain: wrestling event
comment: Relation between Wrestling Event and Criminal