has Comedian
type: ObjectProperty
comment: Relation between Administrative Region and Comedian
range: comedian
domain: administrative region
comment: Relazione tra Administrative Region e Comedian @it

has Website
domain: administrative region
comment: Relation between Administrative Region and Website
comment: Relazione tra Administrative Region e Website @it
range: website
type: ObjectProperty

has Rugby Player
comment: Relazione tra Administrative Region e Rugby Player @it
domain: administrative region
range: rugby player
type: ObjectProperty
comment: Relation between Administrative Region and Rugby Player

television show
label: émission de télévision @fr
type: Class

Axiom
annotated source: has Military Person
annotated target: namedFor
matching quantification: 4

Ontology
extracted from: en.wikipedia.org
has intent: To represent the encyclopedic knowledge expressed by an object typed as AdministrativeRegion
imports: cpannotationschema.owl
comment: AdministrativeRegion Encyclopedic Knowledge Pattern
has author: Andrea Giovanni Nuzzolese
has author: Aldo Gangemi
extracted from: dbpedia.org
has author: Valentina Presutti

has Television Episode
comment: Relazione tra Administrative Region e Television Episode @it
comment: Relation between Administrative Region and Television Episode
domain: administrative region
type: ObjectProperty
range: television episode

colour
type: Class
label: couleur @fr
label: χρώμα @el

automobile
type: Class

Election
type: Class
label: élection @fr

has Military Conflict
range: military conflict
comment: Relazione tra Administrative Region e Military Conflict @it
domain: administrative region
type: ObjectProperty
comment: Relation between Administrative Region and Military Conflict
related match: era

soccer league
type: Class
label: ligue de football @fr

has World Heritage Site
domain: administrative region
type: ObjectProperty
comment: Relazione tra Administrative Region e World Heritage Site @it
comment: Relation between Administrative Region and World Heritage Site
range: World Heritage Site

has Comics Creator
comment: Relazione tra Administrative Region e Comics Creator @it
range: comics creator
comment: Relation between Administrative Region and Comics Creator
domain: administrative region
type: ObjectProperty

Axiom
matching quantification: 1
annotated source: has River
annotated target: east

Axiom
annotated target: namedFor
matching quantification: 3
annotated source: has Office Holder

wrestler
type: Class
label: lutteur @fr

has Christian Bishop
domain: administrative region
comment: Relation between Administrative Region and Christian Bishop
type: ObjectProperty
comment: Relazione tra Administrative Region e Christian Bishop @it
range: Christian Bishop

speedway league
label: ligue de speedway @fr
type: Class

road
label: route @fr
type: Class

has Ginkgo
comment: Relation between Administrative Region and Ginkgo
domain: administrative region
comment: Relazione tra Administrative Region e Ginkgo @it
type: ObjectProperty
range: ginkgo

boxer
label: boxeur @fr
type: Class

judge
type: Class
label: juge @fr

World Heritage Site
label: site du patrimoine mondial @fr
type: Class

Axiom
annotated target: label
annotated source: has Lake
matching quantification: 1

Women's Tennis Association tournament
type: Class
label: Tournoi de la Women's Tennis Association @fr

has Film Festival
type: ObjectProperty
range: film festival
domain: administrative region
comment: Relazione tra Administrative Region e Film Festival @it
comment: Relation between Administrative Region and Film Festival

station
type: Class

has Chemical Compound
range: chemical compound
comment: Relazione tra Administrative Region e Chemical Compound @it
type: ObjectProperty
comment: Relation between Administrative Region and Chemical Compound
domain: administrative region

has Golf League
comment: Relation between Administrative Region and Golf League
type: ObjectProperty
comment: Relazione tra Administrative Region e Golf League @it
domain: administrative region
range: golf league

has Lacrosse League
domain: administrative region
comment: Relazione tra Administrative Region e Lacrosse League @it
range: lacrosse league
comment: Relation between Administrative Region and Lacrosse League
type: ObjectProperty

Axiom
annotated target: emblem
annotated source: has Mammal
matching quantification: 2

lake
label: lac @fr
type: Class

Axiom
annotated source: has Language
annotated target: officiallang
matching quantification: 1

arachnid
label: arachnides @fr
type: Class

governor
type: Class
label: gouverneur @fr

administrative region
label: région administrative @fr
type: Class

has Continent
domain: administrative region
range: continent
comment: Relation between Administrative Region and Continent
type: ObjectProperty
comment: Relazione tra Administrative Region e Continent @it

poker player
label: joueur de poker @fr
type: Class

has Planet
comment: Relazione tra Administrative Region e Planet @it
type: ObjectProperty
comment: Relation between Administrative Region and Planet
range: planet
domain: administrative region

Axiom
annotated source: has Fish
matching quantification: 1
annotated target: fish

fish
label: poisson @fr
type: Class

ship
type: Class
label: navire @fr

tennis player
label: joueur de tennis @fr
type: Class

has Site Of Special Scientific Interest
type: ObjectProperty
comment: Relation between Administrative Region and Site Of Special Scientific Interest
domain: administrative region
range: Site of Special Scientific Interest
comment: Relazione tra Administrative Region e Site Of Special Scientific Interest @it

has Single
domain: administrative region
range: single
comment: Relation between Administrative Region and Single
type: ObjectProperty
comment: Relazione tra Administrative Region e Single @it

Axiom
annotated source: has Language
annotated target: fficialLanguages
matching quantification: 2

prime minister
label: premier ministre @fr
type: Class

race
type: Class
label: course @fr

hospital
type: Class
label: hôpital @fr

has Airport
range: airport
comment: Relation between Administrative Region and Airport
domain: administrative region
type: ObjectProperty
comment: Relazione tra Administrative Region e Airport @it

has Canadian Football League
comment: Relazione tra Administrative Region e Canadian Football League @it
domain: administrative region
range: canadian football league
type: ObjectProperty
comment: Relation between Administrative Region and Canadian Football League

has Olympics
comment: Relazione tra Administrative Region e Olympics @it
comment: Relation between Administrative Region and Olympics
type: ObjectProperty
range: olympics
domain: administrative region

president
type: Class
label: président @fr

album
type: Class
label: Album @de

has Musical
comment: Relation between Administrative Region and Musical
domain: administrative region
comment: Relazione tra Administrative Region e Musical @it
type: ObjectProperty
range: musical

moss
type: Class
label: mousses @fr

military unit
type: Class
label: unité militaire @fr

has Language
domain: administrative region
type: ObjectProperty
related match: officialLanguages
related match: language
comment: Relazione tra Administrative Region e Language @it
related match: officiallang
related match: languages
comment: Relation between Administrative Region and Language
range: language
related match: fficialLanguages

soccer manager
label: entraîneur de football @fr
type: Class

basketball team
type: Class

has Arachnid
comment: Relation between Administrative Region and Arachnid
type: ObjectProperty
domain: administrative region
range: arachnid
comment: Relazione tra Administrative Region e Arachnid @it

has Gaelic Games Player
domain: administrative region
type: ObjectProperty
comment: Relation between Administrative Region and Gaelic Games Player
range: Gaelic games player
comment: Relazione tra Administrative Region e Gaelic Games Player @it

has Member Of Parliament
comment: Relazione tra Administrative Region e Member Of Parliament @it
range: member of parliament
domain: administrative region
comment: Relation between Administrative Region and Member Of Parliament
type: ObjectProperty
related match: mps

has Nascar Driver
domain: administrative region
type: ObjectProperty
comment: Relazione tra Administrative Region e Nascar Driver @it
comment: Relation between Administrative Region and Nascar Driver
range: nascar driver

cycad
type: Class
label: cycadophytes @fr

has Musical Artist
comment: Relation between Administrative Region and Musical Artist
comment: Relazione tra Administrative Region e Musical Artist @it
type: ObjectProperty
range: musical artist
domain: administrative region

has Station
type: ObjectProperty
domain: administrative region
comment: Relazione tra Administrative Region e Station @it
range: station
comment: Relation between Administrative Region and Station

has Non- Profit Organisation
comment: Relation between Administrative Region and Non- Profit Organisation
type: ObjectProperty
range: non-profit organisation
comment: Relazione tra Administrative Region e Non- Profit Organisation @it
domain: administrative region

has Road
type: ObjectProperty
comment: Relation between Administrative Region and Road
range: road
domain: administrative region
comment: Relazione tra Administrative Region e Road @it

crustacean
type: Class
label: crustacés @fr

olympic result
type: Class
label: résultat de Jeux Olympiques @fr

has Figure Skater
comment: Relation between Administrative Region and Figure Skater
comment: Relazione tra Administrative Region e Figure Skater @it
domain: administrative region
range: figure skater
type: ObjectProperty

film festival
label: festival du film @fr
type: Class

has Museum
range: museum
comment: Relation between Administrative Region and Museum
type: ObjectProperty
comment: Relazione tra Administrative Region e Museum @it
domain: administrative region

has Drug
comment: Relazione tra Administrative Region e Drug @it
type: ObjectProperty
comment: Relation between Administrative Region and Drug
domain: administrative region
range: drug

lighthouse
type: Class
label: phare @fr

has Video Game
comment: Relazione tra Administrative Region e Video Game @it
range: video game
domain: administrative region
type: ObjectProperty
comment: Relation between Administrative Region and Video Game

aircraft
label: avion @fr
type: Class
label: αεροσκάφος @el

has American Football League
comment: Relation between Administrative Region and American Football League
type: ObjectProperty
comment: Relazione tra Administrative Region e American Football League @it
range: american football league
domain: administrative region

has Book
range: book
type: ObjectProperty
domain: administrative region
comment: Relazione tra Administrative Region e Book @it
comment: Relation between Administrative Region and Book

has Space Station
type: ObjectProperty
comment: Relazione tra Administrative Region e Space Station @it
range: space station
comment: Relation between Administrative Region and Space Station
domain: administrative region

has Basketball Team
domain: administrative region
comment: Relation between Administrative Region and Basketball Team
type: ObjectProperty
range: basketball team
comment: Relazione tra Administrative Region e Basketball Team @it

legislature
label: pouvoir législatif @fr
type: Class

has Ski Area
type: ObjectProperty
comment: Relazione tra Administrative Region e Ski Area @it
range: ski area
domain: administrative region
comment: Relation between Administrative Region and Ski Area

airline
type: Class
label: compagnie aérienne @fr

monarch
type: Class
label: monarque @fr

has Music Genre
domain: administrative region
range: music genre
type: ObjectProperty
comment: Relazione tra Administrative Region e Music Genre @it
comment: Relation between Administrative Region and Music Genre

golf player
label: golfeur @fr
type: Class

nascar driver
type: Class
label: pilote de la nascar @fr

has Insect
related match: insect
comment: Relation between Administrative Region and Insect
type: ObjectProperty
range: insect
comment: Relazione tra Administrative Region e Insect @it
domain: administrative region

space mission
type: Class
label: διαστημική αποστολή @el
label: mission spatiale @fr

insect
label: insecte @fr
type: Class

film
type: Class
label: ταινία @el

has Space Mission
comment: Relazione tra Administrative Region e Space Mission @it
type: ObjectProperty
comment: Relation between Administrative Region and Space Mission
range: space mission
domain: administrative region

Supreme Court of the United States case
label: cas juridique de la Cour suprême des États-Unis @fr
type: Class

has Hospital
comment: Relation between Administrative Region and Hospital
comment: Relazione tra Administrative Region e Hospital @it
range: hospital
domain: administrative region
type: ObjectProperty

has Bacteria
domain: administrative region
comment: Relation between Administrative Region and Bacteria
range: bacteria
comment: Relazione tra Administrative Region e Bacteria @it
type: ObjectProperty

Gaelic games player
type: Class
label: joueur de sports gaéliques @fr

has Congressman
type: ObjectProperty
range: congressman
domain: administrative region
comment: Relation between Administrative Region and Congressman
comment: Relazione tra Administrative Region e Congressman @it
related match: namedFor
related match: representative

has Supreme Court Of The United States Case
type: ObjectProperty
domain: administrative region
range: Supreme Court of the United States case
comment: Relazione tra Administrative Region e Supreme Court Of The United States Case @it
comment: Relation between Administrative Region and Supreme Court Of The United States Case

has Crustacean
comment: Relazione tra Administrative Region e Crustacean @it
range: crustacean
comment: Relation between Administrative Region and Crustacean
domain: administrative region
type: ObjectProperty

has Magazine
domain: administrative region
range: magazine
type: ObjectProperty
comment: Relazione tra Administrative Region e Magazine @it
comment: Relation between Administrative Region and Magazine

has Ice Hockey Player
range: ice hockey player
domain: administrative region
type: ObjectProperty
comment: Relazione tra Administrative Region e Ice Hockey Player @it
comment: Relation between Administrative Region and Ice Hockey Player

musical artist
label: musicien @fr
type: Class
label: artista musical @pt

fungus
type: Class
label: fungi @fr

has Ethnic Group
domain: administrative region
type: ObjectProperty
range: ethnic group
comment: Relation between Administrative Region and Ethnic Group
comment: Relazione tra Administrative Region e Ethnic Group @it

park
label: parc @fr
type: Class

cardinal
type: Class

rugby player
label: joueur de rugby @fr
type: Class

american football league
type: Class

has Island
domain: administrative region
range: island
comment: Relazione tra Administrative Region e Island @it
comment: Relation between Administrative Region and Island
type: ObjectProperty

has Wine Region
comment: Relazione tra Administrative Region e Wine Region @it
type: ObjectProperty
comment: Relation between Administrative Region and Wine Region
range: wine region
domain: administrative region

has Gnetophytes
domain: administrative region
range: Gnetophytes
type: ObjectProperty
comment: Relation between Administrative Region and Gnetophytes
comment: Relazione tra Administrative Region e Gnetophytes @it

has Office Holder
comment: Relazione tra Administrative Region e Office Holder @it
comment: Relation between Administrative Region and Office Holder
type: ObjectProperty
range: office holder
domain: administrative region
related match: namedFor

has Bird
type: ObjectProperty
domain: administrative region
comment: Relation between Administrative Region and Bird
comment: Relazione tra Administrative Region e Bird @it
range: bird
related match: bird

cyclist
type: Class
label: cycliste @fr

has Shopping Mall
domain: administrative region
comment: Relazione tra Administrative Region e Shopping Mall @it
range: shopping mall
type: ObjectProperty
comment: Relation between Administrative Region and Shopping Mall

has Boxer
domain: administrative region
comment: Relazione tra Administrative Region e Boxer @it
type: ObjectProperty
comment: Relation between Administrative Region and Boxer
range: boxer

has Sport
domain: administrative region
comment: Relation between Administrative Region and Sport
range: sport
type: ObjectProperty
comment: Relazione tra Administrative Region e Sport @it

has Architect
range: architect
domain: administrative region
comment: Relazione tra Administrative Region e Architect @it
comment: Relation between Administrative Region and Architect
type: ObjectProperty

basketball league
label: ligue de basketball @fr
type: Class

saint
type: Class

senator
label: sénateur @fr
type: Class

valley
type: Class
label: vallée @fr

song
label: chanson @fr
type: Class

has Grand Prix
comment: Relation between Administrative Region and Grand Prix
type: ObjectProperty
range: Grand Prix
domain: administrative region
comment: Relazione tra Administrative Region e Grand Prix @it

book
type: Class
label: livre @fr
label: βιβλίο @el
label: llibre @ca
label: książka @pl

has Power Station
comment: Relation between Administrative Region and Power Station
domain: administrative region
comment: Relazione tra Administrative Region e Power Station @it
range: power station
type: ObjectProperty

shopping mall
type: Class
label: centre commercial @fr

has Hotel
type: ObjectProperty
range: hotel
comment: Relation between Administrative Region and Hotel
domain: administrative region
comment: Relazione tra Administrative Region e Hotel @it

ski area
type: Class
label: domaine skiable @fr

non-profit organisation
type: Class
label: organisation à but non lucratif @fr

space station
type: Class
label: station spatiale @fr

canadian football league
type: Class

rugby league
label: ligue de rugby @fr
type: Class

wine region
type: Class
label: région viticole @fr

weapon
label: arme @fr
type: Class

has Playboy Playmate
comment: Relation between Administrative Region and Playboy Playmate
type: ObjectProperty
range: Playboy Playmate
domain: administrative region
comment: Relazione tra Administrative Region e Playboy Playmate @it

has Town
domain: administrative region
type: ObjectProperty
comment: Relation between Administrative Region and Town
related match: muns
range: town
related match: administrativeCenter
comment: Relazione tra Administrative Region e Town @it
related match: capital
related match: largestCity
related match: seat

has Disease
domain: administrative region
comment: Relation between Administrative Region and Disease
range: disease
comment: Relazione tra Administrative Region e Disease @it
type: ObjectProperty

philosopher
label: philosophe @fr
type: Class

has President
comment: Relazione tra Administrative Region e President @it
domain: administrative region
range: president
comment: Relation between Administrative Region and President
type: ObjectProperty

sport
type: Class

has Monarch
range: monarch
comment: Relazione tra Administrative Region e Monarch @it
type: ObjectProperty
comment: Relation between Administrative Region and Monarch
domain: administrative region

automobile engine
label: moteur d'automobile @fr
type: Class

restaurant
type: Class

Band
label: banda @pt
label: Musikgruppe @de
type: Class
label: groupe de musique @fr

town
type: Class
label: ville @fr

has Broadcast
comment: Relation between Administrative Region and Broadcast
domain: administrative region
type: ObjectProperty
comment: Relazione tra Administrative Region e Broadcast @it
range: broadcast

university
type: Class
label: université @fr
label: πανεπιστήμιο @el

has Speedway League
type: ObjectProperty
range: speedway league
comment: Relation between Administrative Region and Speedway League
comment: Relazione tra Administrative Region e Speedway League @it
domain: administrative region

artery
label: Arterie @de
type: Class
label: artère @fr

has Governor
type: ObjectProperty
range: governor
domain: administrative region
comment: Relation between Administrative Region and Governor
comment: Relazione tra Administrative Region e Governor @it
related match: namedFor

hotel
label: hôtel @fr
type: Class

music festival
type: Class
label: festival de musique @fr

has Race
domain: administrative region
range: race
comment: Relazione tra Administrative Region e Race @it
comment: Relation between Administrative Region and Race
type: ObjectProperty

has Beverage
comment: Relazione tra Administrative Region e Beverage @it
comment: Relation between Administrative Region and Beverage
range: beverage
domain: administrative region
type: ObjectProperty

has Basketball Player
range: basketball player
comment: Relazione tra Administrative Region e Basketball Player @it
domain: administrative region
comment: Relation between Administrative Region and Basketball Player
type: ObjectProperty

village
label: χωριό @el
type: Class

ice hockey league
type: Class
label: ligue d'hockey sur glace @fr

has Mammal
related match: emblem
related match: blankValue
comment: Relation between Administrative Region and Mammal
range: mammal
type: ObjectProperty
domain: administrative region
comment: Relazione tra Administrative Region e Mammal @it

has Tennis League
domain: administrative region
comment: Relazione tra Administrative Region e Tennis League @it
comment: Relation between Administrative Region and Tennis League
type: ObjectProperty
range: tennis league

has Fungus
range: fungus
comment: Relation between Administrative Region and Fungus
domain: administrative region
comment: Relazione tra Administrative Region e Fungus @it
type: ObjectProperty

Axiom
matching quantification: 2
annotated source: has Insect
annotated target: insect

office holder
label: titulaire @fr
label: Amtsinhaber @de
type: Class

baseball player
type: Class
label: joueur de baseball @fr

website
label: site web @fr
label: Ιστότοπος @el
type: Class

grape
label: raisin @fr
type: Class

basketball player
label: joueur de basketball @fr
type: Class

adult actor
label: acteur adulte @fr
type: Class
label: erwachsener Schauspieler @de

has Bone
type: ObjectProperty
comment: Relazione tra Administrative Region e Bone @it
comment: Relation between Administrative Region and Bone
domain: administrative region
range: bone

ice hockey player
label: joueur de hockey sur glace @fr
type: Class

Axiom
matching quantification: 14
annotated target: administrativeCenter
annotated source: has Town

has Reptile
related match: reptile
comment: Relation between Administrative Region and Reptile
domain: administrative region
comment: Relazione tra Administrative Region e Reptile @it
range: reptile
type: ObjectProperty

beverage
label: boisson @fr
type: Class

has Adult Actor
domain: administrative region
range: adult actor
type: ObjectProperty
comment: Relation between Administrative Region and Adult Actor
comment: Relazione tra Administrative Region e Adult Actor @it

has British Royalty
comment: Relation between Administrative Region and British Royalty
domain: administrative region
type: ObjectProperty
comment: Relazione tra Administrative Region e British Royalty @it
range: British royalty

planet
label: planète @fr
type: Class

has Formula One Racer
comment: Relation between Administrative Region and Formula One Racer
comment: Relazione tra Administrative Region e Formula One Racer @it
range: Formula One racer
type: ObjectProperty
domain: administrative region

scientist
label: scientifique @fr
type: Class
label: Wissenschaftler @de

has Ambassador
comment: Relation between Administrative Region and Ambassador
type: ObjectProperty
range: ambassador
comment: Relazione tra Administrative Region e Ambassador @it
domain: administrative region

golf league
type: Class
label: ligue de golf @fr

has Cycad
comment: Relation between Administrative Region and Cycad
range: cycad
type: ObjectProperty
comment: Relazione tra Administrative Region e Cycad @it
domain: administrative region

Axiom
matching quantification: 2
annotated source: has Legislature
annotated target: leaderTitle

has Rocket
comment: Relation between Administrative Region and Rocket
range: rocket
domain: administrative region
type: ObjectProperty
comment: Relazione tra Administrative Region e Rocket @it

has Radio Station
domain: administrative region
comment: Relazione tra Administrative Region e Radio Station @it
comment: Relation between Administrative Region and Radio Station
type: ObjectProperty
range: radio station

olympics
label: Jeux Olympiques @fr
type: Class

has Bridge
comment: Relation between Administrative Region and Bridge
domain: administrative region
type: ObjectProperty
comment: Relazione tra Administrative Region e Bridge @it
range: bridge

has American Football Player
domain: administrative region
range: american football player
comment: Relation between Administrative Region and American Football Player
comment: Relazione tra Administrative Region e American Football Player @it
type: ObjectProperty

Axiom
annotated target: representative
matching quantification: 1
annotated source: has Congressman

bridge
label: pont @fr
type: Class

broadcast
type: Class
label: Émission de télévision @fr

has Military Person
related match: namedFor
domain: administrative region
comment: Relation between Administrative Region and Military Person
range: military person
comment: Relazione tra Administrative Region e Military Person @it
type: ObjectProperty

island
label: île @fr
label: νησί @el
type: Class

has Village
range: village
comment: Relation between Administrative Region and Village
comment: Relazione tra Administrative Region e Village @it
domain: administrative region
type: ObjectProperty
related match: administrativeCenter

comics character
label: personnage de bandes dessinées @fr
type: Class

skyscraper
label: gratte-ciel @fr
type: Class

Formula One racer
type: Class
label: pilote de formule 1 @fr

has Fern
comment: Relazione tra Administrative Region e Fern @it
domain: administrative region
type: ObjectProperty
range: fern
comment: Relation between Administrative Region and Fern

radio station
type: Class
label: station de radio @fr

bone
label: os @fr
label: Knochen @de
type: Class

member of parliament
label: membre du Parlement @fr
type: Class

airport
type: Class
label: Flughafen @de
label: aéroport @fr

has Cricketer
domain: administrative region
comment: Relation between Administrative Region and Cricketer
comment: Relazione tra Administrative Region e Cricketer @it
range: cricketer
type: ObjectProperty

conifer
label: conifères @fr
type: Class

rocket
type: Class
label: fusée @fr

disease
label: maladie @fr
type: Class

Axiom
matching quantification: 10
annotated source: has Town
annotated target: seat

has Poker Player
domain: administrative region
comment: Relation between Administrative Region and Poker Player
comment: Relazione tra Administrative Region e Poker Player @it
type: ObjectProperty
range: poker player

american football player
type: Class
label: joueur de football américain @fr

has University
comment: Relation between Administrative Region and University
domain: administrative region
comment: Relazione tra Administrative Region e University @it
type: ObjectProperty
range: university

stadium
label: stade @fr
type: Class

astronaut
label: astronaute @fr
label: Astronaut @de
type: Class

has Criminal
comment: Relation between Administrative Region and Criminal
range: criminal
type: ObjectProperty
domain: administrative region
comment: Relazione tra Administrative Region e Criminal @it

has Judge
comment: Relation between Administrative Region and Judge
comment: Relazione tra Administrative Region e Judge @it
type: ObjectProperty
range: judge
domain: administrative region

has Award
comment: Relazione tra Administrative Region e Award @it
domain: administrative region
range: award
comment: Relation between Administrative Region and Award
type: ObjectProperty

Site of Special Scientific Interest
label: site d'intérêt scientifique particulier @fr
type: Class

mayor
type: Class
label: maire @fr

amphibian
label: amphibien @fr
type: Class

Axiom
matching quantification: 2
annotated source: has Bird
annotated target: bird

pope
type: Class
label: pape @fr

has Wrestler
comment: Relazione tra Administrative Region e Wrestler @it
type: ObjectProperty
domain: administrative region
range: wrestler
comment: Relation between Administrative Region and Wrestler

has Softball League
comment: Relation between Administrative Region and Softball League
comment: Relazione tra Administrative Region e Softball League @it
range: softball league
domain: administrative region
type: ObjectProperty

has Mollusca
comment: Relation between Administrative Region and Mollusca
domain: administrative region
range: mollusca
comment: Relazione tra Administrative Region e Mollusca @it
type: ObjectProperty

newspaper
label: journal @fr
type: Class

protected area
type: Class
label: προστατευμένη περιοχή @el
label: aire protégée @fr

game
type: Class
label: jeu @fr

has Conifer
type: ObjectProperty
domain: administrative region
range: conifer
comment: Relation between Administrative Region and Conifer
comment: Relazione tra Administrative Region e Conifer @it

ginkgo
type: Class

has Womens Tennis Association Tournament
comment: Relazione tra Administrative Region e Womens Tennis Association Tournament @it
range: Women's Tennis Association tournament
comment: Relation between Administrative Region and Womens Tennis Association Tournament
type: ObjectProperty
domain: administrative region

has Stadium
domain: administrative region
comment: Relazione tra Administrative Region e Stadium @it
range: stadium
type: ObjectProperty
comment: Relation between Administrative Region and Stadium

language
label: langage @fr
type: Class

tennis league
label: ligue de tennis @fr
type: Class

has Amphibian
comment: Relazione tra Administrative Region e Amphibian @it
comment: Relation between Administrative Region and Amphibian
domain: administrative region
type: ObjectProperty
range: amphibian

has Soccer Club
domain: administrative region
comment: Relation between Administrative Region and Soccer Club
range: soccer club
comment: Relazione tra Administrative Region e Soccer Club @it
type: ObjectProperty

has Album
comment: Relazione tra Administrative Region e Album @it
range: album
type: ObjectProperty
comment: Relation between Administrative Region and Album
domain: administrative region

has American Football Team
range: american football team
comment: Relazione tra Administrative Region e American Football Team @it
type: ObjectProperty
domain: administrative region
comment: Relation between Administrative Region and American Football Team

Axiom
matching quantification: 5
annotated source: has Member Of Parliament
annotated target: mps

has Mountain Range
related match: highestpoint
range: mountain range
comment: Relation between Administrative Region and Mountain Range
domain: administrative region
type: ObjectProperty
comment: Relazione tra Administrative Region e Mountain Range @it

has College
range: college
domain: administrative region
type: ObjectProperty
comment: Relazione tra Administrative Region e College @it
comment: Relation between Administrative Region and College

river
label: rivière @fr
type: Class

has Club Moss
type: ObjectProperty
range: club moss
comment: Relazione tra Administrative Region e Club Moss @it
comment: Relation between Administrative Region and Club Moss
domain: administrative region

lacrosse league
type: Class
label: ligue de crosse @fr

has Ship
comment: Relazione tra Administrative Region e Ship @it
type: ObjectProperty
domain: administrative region
range: ship
comment: Relation between Administrative Region and Ship

school
label: école @fr
type: Class

museum
type: Class
label: musée @fr

has Cyclist
comment: Relation between Administrative Region and Cyclist
range: cyclist
type: ObjectProperty
domain: administrative region
comment: Relazione tra Administrative Region e Cyclist @it

Axiom
annotated target: east
annotated source: has Lake
matching quantification: 1

video game
label: jeux vidéo @fr
type: Class

trade union
type: Class
label: syndicat professionnel @fr

has Valley
range: valley
domain: administrative region
comment: Relazione tra Administrative Region e Valley @it
type: ObjectProperty
comment: Relation between Administrative Region and Valley

currency
type: Class
label: devise @fr

British royalty
type: Class
label: royauté Britannique @fr

historic place
type: Class
label: site historique @fr

softball league
type: Class
label: ligue de softball @fr

monument
type: Class

has Baseball League
type: ObjectProperty
domain: administrative region
comment: Relation between Administrative Region and Baseball League
comment: Relazione tra Administrative Region e Baseball League @it
range: baseball league

Axiom
matching quantification: 3
annotated source: has Language
annotated target: languages

has Artery
comment: Relazione tra Administrative Region e Artery @it
type: ObjectProperty
comment: Relation between Administrative Region and Artery
range: artery
domain: administrative region

has Trade Union
domain: administrative region
comment: Relazione tra Administrative Region e Trade Union @it
range: trade union
comment: Relation between Administrative Region and Trade Union
type: ObjectProperty

continent
type: Class
label: ήπειρος @el

Axiom
annotated target: namedFor
annotated source: has Senator
matching quantification: 3

figure skater
label: patineur artistique @fr
type: Class

Axiom
annotated source: has Legislature
annotated target: council
matching quantification: 3

cricket league
label: ligue de cricket @fr
type: Class

has Astronaut
type: ObjectProperty
comment: Relation between Administrative Region and Astronaut
domain: administrative region
range: astronaut
comment: Relazione tra Administrative Region e Astronaut @it

canadian football team
label: équipe canadienne de football américain @fr
type: Class

music genre
label: genre musical @fr
label: género musical @pt
type: Class

writer
label: écrivain @fr
type: Class

record label
type: Class
label: label discographique @fr

Axiom
annotated target: source
annotated source: has Writer
matching quantification: 3

architect
type: Class
label: architecte @fr

model
label: mannequin @fr
type: Class

ambassador
type: Class
label: ambassadeur @fr

Axiom
annotated source: has Military Conflict
annotated target: era
matching quantification: 1

has Election
type: ObjectProperty
comment: Relation between Administrative Region and Election
comment: Relazione tra Administrative Region e Election @it
domain: administrative region
range: Election

has Basketball League
range: basketball league
comment: Relazione tra Administrative Region e Basketball League @it
domain: administrative region
comment: Relation between Administrative Region and Basketball League
type: ObjectProperty

has Record Label
type: ObjectProperty
domain: administrative region
comment: Relation between Administrative Region and Record Label
range: record label
comment: Relazione tra Administrative Region e Record Label @it

has Game
comment: Relation between Administrative Region and Game
comment: Relazione tra Administrative Region e Game @it
domain: administrative region
type: ObjectProperty
range: game

has Moss
range: moss
comment: Relazione tra Administrative Region e Moss @it
comment: Relation between Administrative Region and Moss
domain: administrative region
type: ObjectProperty

has Scientist
range: scientist
comment: Relazione tra Administrative Region e Scientist @it
comment: Relation between Administrative Region and Scientist
type: ObjectProperty
domain: administrative region

Grand Prix
type: Class
label: grand prix @fr

has Historic Building
comment: Relation between Administrative Region and Historic Building
type: ObjectProperty
range: historic building
comment: Relazione tra Administrative Region e Historic Building @it
domain: administrative region

chancellor
type: Class
label: chancelier @fr

Axiom
annotated target: muns
annotated source: has Town
matching quantification: 4

comics creator
label: créateur de bandes dessinées @fr
type: Class

has Chancellor
comment: Relazione tra Administrative Region e Chancellor @it
range: chancellor
domain: administrative region
comment: Relation between Administrative Region and Chancellor
type: ObjectProperty

hockey team
type: Class
label: équipe de hockey @fr

has Rugby League
comment: Relazione tra Administrative Region e Rugby League @it
domain: administrative region
comment: Relation between Administrative Region and Rugby League
type: ObjectProperty
range: rugby league

club moss
type: Class
label: lycopodiopsida @fr

soccer player
label: joueur de football @fr
type: Class

reptile
type: Class

cave
label: grotte @fr
type: Class

congressman
type: Class
label: membre du Congrès @fr

Gnetophytes
label: gnétophytes @fr
type: Class

journalist
type: Class
label: journaliste @fr

has Music Festival
comment: Relation between Administrative Region and Music Festival
type: ObjectProperty
range: music festival
domain: administrative region
comment: Relazione tra Administrative Region e Music Festival @it

has Skyscraper
range: skyscraper
comment: Relation between Administrative Region and Skyscraper
comment: Relazione tra Administrative Region e Skyscraper @it
domain: administrative region
type: ObjectProperty

american football team
label: équipe américaine de football américain @fr
type: Class

has Canadian Football Team
domain: administrative region
type: ObjectProperty
comment: Relazione tra Administrative Region e Canadian Football Team @it
range: canadian football team
comment: Relation between Administrative Region and Canadian Football Team

has Historic Place
range: historic place
domain: administrative region
comment: Relation between Administrative Region and Historic Place
type: ObjectProperty
comment: Relazione tra Administrative Region e Historic Place @it

chemical compound
label: produit chimique @fr
type: Class

bird
label: oiseau @fr
type: Class

power station
type: Class

has Protected Area
comment: Relazione tra Administrative Region e Protected Area @it
range: protected area
domain: administrative region
type: ObjectProperty
comment: Relation between Administrative Region and Protected Area

fern
type: Class
label: fougères @fr

has Weapon
type: ObjectProperty
domain: administrative region
range: weapon
comment: Relazione tra Administrative Region e Weapon @it
comment: Relation between Administrative Region and Weapon

Axiom
annotated source: has Language
matching quantification: 2
annotated target: language

has Lighthouse
domain: administrative region
range: lighthouse
type: ObjectProperty
comment: Relation between Administrative Region and Lighthouse
comment: Relazione tra Administrative Region e Lighthouse @it

has Airline
comment: Relation between Administrative Region and Airline
type: ObjectProperty
domain: administrative region
range: airline
comment: Relazione tra Administrative Region e Airline @it

has Saint
range: saint
comment: Relation between Administrative Region and Saint
type: ObjectProperty
domain: administrative region
comment: Relazione tra Administrative Region e Saint @it

has Aircraft
comment: Relazione tra Administrative Region e Aircraft @it
comment: Relation between Administrative Region and Aircraft
type: ObjectProperty
range: aircraft
domain: administrative region

musical
type: Class
label: musique @fr

Axiom
annotated target: capital
annotated source: has Town
matching quantification: 265

has Monument
range: monument
comment: Relazione tra Administrative Region e Monument @it
domain: administrative region
comment: Relation between Administrative Region and Monument
type: ObjectProperty

Axiom
matching quantification: 2
annotated target: administrativeCenter
annotated source: has Village

has Soccer Player
comment: Relation between Administrative Region and Soccer Player
type: ObjectProperty
comment: Relazione tra Administrative Region e Soccer Player @it
domain: administrative region
range: soccer player

has River
comment: Relation between Administrative Region and River
comment: Relazione tra Administrative Region e River @it
range: river
type: ObjectProperty
domain: administrative region
related match: east
related match: namedFor

has Fish
domain: administrative region
comment: Relation between Administrative Region and Fish
range: fish
comment: Relazione tra Administrative Region e Fish @it
type: ObjectProperty
related match: fish
related match: emblem

has Model
comment: Relazione tra Administrative Region e Model @it
range: model
comment: Relation between Administrative Region and Model
type: ObjectProperty
domain: administrative region

mountain
type: Class
label: montagne @fr
label: Βουνό @el

has Legislature
comment: Relation between Administrative Region and Legislature
comment: Relazione tra Administrative Region e Legislature @it
type: ObjectProperty
range: legislature
domain: administrative region
related match: council
related match: leaderTitle

criminal
type: Class
label: criminel @fr

space shuttle
label: navette spatiale @fr
type: Class

has Band
comment: Relazione tra Administrative Region e Band @it
range: Band
type: ObjectProperty
domain: administrative region
comment: Relation between Administrative Region and Band

has Canal
comment: Relazione tra Administrative Region e Canal @it
comment: Relation between Administrative Region and Canal
range: canal
domain: administrative region
type: ObjectProperty

has Television Show
domain: administrative region
range: television show
comment: Relation between Administrative Region and Television Show
comment: Relazione tra Administrative Region e Television Show @it
type: ObjectProperty

has Journalist
comment: Relazione tra Administrative Region e Journalist @it
range: journalist
domain: administrative region
comment: Relation between Administrative Region and Journalist
type: ObjectProperty

comedian
type: Class
label: comédien @fr

Axiom
matching quantification: 2
annotated target: namedFor
annotated source: has Governor

Playboy Playmate
label: playmate pour Playboy @fr
type: Class

has Baseball Player
range: baseball player
comment: Relazione tra Administrative Region e Baseball Player @it
type: ObjectProperty
domain: administrative region
comment: Relation between Administrative Region and Baseball Player

has Ice Hockey League
domain: administrative region
comment: Relazione tra Administrative Region e Ice Hockey League @it
comment: Relation between Administrative Region and Ice Hockey League
range: ice hockey league
type: ObjectProperty

has School
domain: administrative region
comment: Relation between Administrative Region and School
range: school
comment: Relazione tra Administrative Region e School @it
type: ObjectProperty

has Military Unit
domain: administrative region
comment: Relation between Administrative Region and Military Unit
range: military unit
comment: Relazione tra Administrative Region e Military Unit @it
type: ObjectProperty

has Hockey Team
domain: administrative region
type: ObjectProperty
comment: Relation between Administrative Region and Hockey Team
range: hockey team
comment: Relazione tra Administrative Region e Hockey Team @it

bacteria
type: Class
label: bactérie @fr

has Cave
comment: Relation between Administrative Region and Cave
range: cave
domain: administrative region
comment: Relazione tra Administrative Region e Cave @it
type: ObjectProperty

has Olympic Result
range: olympic result
domain: administrative region
type: ObjectProperty
comment: Relation between Administrative Region and Olympic Result
comment: Relazione tra Administrative Region e Olympic Result @it

has College Coach
type: ObjectProperty
comment: Relation between Administrative Region and College Coach
domain: administrative region
comment: Relazione tra Administrative Region e College Coach @it
range: college coach

mollusca
type: Class
label: mollusque @fr

drug
label: médicament @fr
type: Class

has Park
type: ObjectProperty
comment: Relation between Administrative Region and Park
comment: Relazione tra Administrative Region e Park @it
domain: administrative region
range: park

magazine
label: περιοδικό @el
type: Class

canal
type: Class

has Space Shuttle
type: ObjectProperty
comment: Relation between Administrative Region and Space Shuttle
comment: Relazione tra Administrative Region e Space Shuttle @it
range: space shuttle
domain: administrative region

military person
label: militaire @fr
type: Class

award
label: récompense @fr
type: Class

locomotive
type: Class

has Cardinal
type: ObjectProperty
domain: administrative region
range: cardinal
comment: Relation between Administrative Region and Cardinal
comment: Relazione tra Administrative Region e Cardinal @it

college
type: Class

has Senator
comment: Relazione tra Administrative Region e Senator @it
domain: administrative region
range: senator
type: ObjectProperty
comment: Relation between Administrative Region and Senator
related match: namedFor

cricketer
label: joueur de cricket @fr
type: Class

single
type: Class

has Currency
range: currency
type: ObjectProperty
comment: Relazione tra Administrative Region e Currency @it
comment: Relation between Administrative Region and Currency
domain: administrative region

has Soccer League
type: ObjectProperty
comment: Relazione tra Administrative Region e Soccer League @it
range: soccer league
comment: Relation between Administrative Region and Soccer League
domain: administrative region

ethnic group
type: Class
label: groupe ethnique @fr

has Golf Player
comment: Relation between Administrative Region and Golf Player
domain: administrative region
range: golf player
type: ObjectProperty
comment: Relazione tra Administrative Region e Golf Player @it

Axiom
annotated target: namedFor
matching quantification: 1
annotated source: has Congressman

has Automobile Engine
range: automobile engine
comment: Relation between Administrative Region and Automobile Engine
type: ObjectProperty
domain: administrative region
comment: Relazione tra Administrative Region e Automobile Engine @it

has Tennis Player
domain: administrative region
comment: Relation between Administrative Region and Tennis Player
type: ObjectProperty
range: tennis player
comment: Relazione tra Administrative Region e Tennis Player @it

field hockey league
type: Class
label: ligue d'hockey sur gazon @fr

has Grape
type: ObjectProperty
range: grape
comment: Relazione tra Administrative Region e Grape @it
domain: administrative region
comment: Relation between Administrative Region and Grape

college coach
type: Class
label: entraîneur universitaire @fr

television episode
type: Class
label: épisode télévisé @fr

Axiom
annotated target: namedFor
matching quantification: 1
annotated source: has River

has Mayor
range: mayor
domain: administrative region
comment: Relation between Administrative Region and Mayor
comment: Relazione tra Administrative Region e Mayor @it
type: ObjectProperty

has Song
domain: administrative region
type: ObjectProperty
range: song
comment: Relation between Administrative Region and Song
comment: Relazione tra Administrative Region e Song @it

soccer club
label: club de football @fr
type: Class

has Colour
domain: administrative region
type: ObjectProperty
range: colour
comment: Relation between Administrative Region and Colour
comment: Relazione tra Administrative Region e Colour @it

has Restaurant
range: restaurant
comment: Relation between Administrative Region and Restaurant
type: ObjectProperty
domain: administrative region
comment: Relazione tra Administrative Region e Restaurant @it

historic building
label: bâtiment historique @fr
type: Class

has Prime Minister
comment: Relazione tra Administrative Region e Prime Minister @it
type: ObjectProperty
comment: Relation between Administrative Region and Prime Minister
range: prime minister
domain: administrative region

military conflict
label: conflit militaire @fr
type: Class

Axiom
matching quantification: 1
annotated source: has Mountain Range
annotated target: highestpoint

has Lake
related match: label
related match: east
comment: Relazione tra Administrative Region e Lake @it
domain: administrative region
comment: Relation between Administrative Region and Lake
range: lake
type: ObjectProperty

has Badminton Player
range: badminton player
domain: administrative region
comment: Relation between Administrative Region and Badminton Player
type: ObjectProperty
comment: Relazione tra Administrative Region e Badminton Player @it

has Philosopher
type: ObjectProperty
comment: Relation between Administrative Region and Philosopher
comment: Relazione tra Administrative Region e Philosopher @it
range: philosopher
domain: administrative region

has Mountain
comment: Relation between Administrative Region and Mountain
comment: Relazione tra Administrative Region e Mountain @it
type: ObjectProperty
domain: administrative region
range: mountain

Axiom
annotated source: has Fish
annotated target: emblem
matching quantification: 1

mountain range
type: Class
label: chaîne de montagne @fr

Christian Bishop
label: évêque chrétien @fr
type: Class

has Film
comment: Relation between Administrative Region and Film
type: ObjectProperty
comment: Relazione tra Administrative Region e Film @it
domain: administrative region
range: film

Axiom
matching quantification: 1
annotated target: largestCity
annotated source: has Town

has Locomotive
type: ObjectProperty
comment: Relazione tra Administrative Region e Locomotive @it
comment: Relation between Administrative Region and Locomotive
domain: administrative region
range: locomotive

has Cricket League
comment: Relation between Administrative Region and Cricket League
type: ObjectProperty
range: cricket league
domain: administrative region
comment: Relazione tra Administrative Region e Cricket League @it

badminton player
label: joueur de badminton @fr
type: Class

has Soccer Manager
comment: Relation between Administrative Region and Soccer Manager
domain: administrative region
range: soccer manager
comment: Relazione tra Administrative Region e Soccer Manager @it
type: ObjectProperty

baseball league
label: ligue de baseball @fr
type: Class

Axiom
annotated target: reptile
annotated source: has Reptile
matching quantification: 1

has Pope
range: pope
comment: Relation between Administrative Region and Pope
type: ObjectProperty
domain: administrative region
comment: Relazione tra Administrative Region e Pope @it

mammal
type: Class
label: mammifère @fr

has Writer
related match: source
type: ObjectProperty
range: writer
comment: Relation between Administrative Region and Writer
domain: administrative region
comment: Relazione tra Administrative Region e Writer @it

Axiom
matching quantification: 17
annotated source: has Language
annotated target: officialLanguages

has Newspaper
domain: administrative region
comment: Relazione tra Administrative Region e Newspaper @it
type: ObjectProperty
comment: Relation between Administrative Region and Newspaper
range: newspaper

has Comics Character
comment: Relation between Administrative Region and Comics Character
domain: administrative region
comment: Relazione tra Administrative Region e Comics Character @it
range: comics character
type: ObjectProperty

has Field Hockey League
comment: Relation between Administrative Region and Field Hockey League
comment: Relazione tra Administrative Region e Field Hockey League @it
type: ObjectProperty
range: field hockey league
domain: administrative region

Axiom
annotated source: has Mammal
matching quantification: 1
annotated target: blankValue

has Automobile
comment: Relazione tra Administrative Region e Automobile @it
range: automobile
type: ObjectProperty
comment: Relation between Administrative Region and Automobile
domain: administrative region