has President
domain: adult actor
comment: Relation between Adult Actor and President
type: ObjectProperty
range: president
comment: Relazione tra Adult Actor e President @it

has University
comment: Relation between Adult Actor and University
domain: adult actor
type: ObjectProperty
comment: Relazione tra Adult Actor e University @it
range: university

disease
type: Class
label: maladie @fr

has Airport
domain: adult actor
range: airport
comment: Relazione tra Adult Actor e Airport @it
comment: Relation between Adult Actor and Airport
type: ObjectProperty

has Town
type: ObjectProperty
range: town
comment: Relation between Adult Actor and Town
domain: adult actor
comment: Relazione tra Adult Actor e Town @it

colour
label: χρώμα @el
label: couleur @fr
type: Class

automobile
type: Class

Election
label: élection @fr
type: Class

has American Football Team
domain: adult actor
type: ObjectProperty
comment: Relazione tra Adult Actor e American Football Team @it
comment: Relation between Adult Actor and American Football Team
range: american football team

american football player
type: Class
label: joueur de football américain @fr

stadium
type: Class
label: stade @fr

has Convention
type: ObjectProperty
domain: adult actor
comment: Relazione tra Adult Actor e Convention @it
range: convention
comment: Relation between Adult Actor and Convention

wrestler
type: Class
label: lutteur @fr

has American Football Player
comment: Relation between Adult Actor and American Football Player
type: ObjectProperty
domain: adult actor
range: american football player
comment: Relazione tra Adult Actor e American Football Player @it

mayor
type: Class
label: maire @fr

species
label: espèce @fr
type: Class

has Music Festival
range: music festival
type: ObjectProperty
comment: Relation between Adult Actor and Music Festival
comment: Relazione tra Adult Actor e Music Festival @it
domain: adult actor

newspaper
type: Class
label: journal @fr

has Musical Artist
domain: adult actor
comment: Relation between Adult Actor and Musical Artist
comment: Relazione tra Adult Actor e Musical Artist @it
type: ObjectProperty
range: musical artist

game
type: Class
label: jeu @fr

road
label: route @fr
type: Class

boxer
label: boxeur @fr
type: Class

has Prime Minister
comment: Relation between Adult Actor and Prime Minister
range: prime minister
domain: adult actor
comment: Relazione tra Adult Actor e Prime Minister @it
type: ObjectProperty

has Cricketer
comment: Relation between Adult Actor and Cricketer
comment: Relazione tra Adult Actor e Cricketer @it
type: ObjectProperty
range: cricketer
domain: adult actor

has Automobile
comment: Relation between Adult Actor and Automobile
domain: adult actor
comment: Relazione tra Adult Actor e Automobile @it
range: automobile
type: ObjectProperty

has Scientist
range: scientist
comment: Relazione tra Adult Actor e Scientist @it
domain: adult actor
comment: Relation between Adult Actor and Scientist
type: ObjectProperty

language
label: langage @fr
type: Class

has Basketball Team
domain: adult actor
comment: Relation between Adult Actor and Basketball Team
comment: Relazione tra Adult Actor e Basketball Team @it
type: ObjectProperty
range: basketball team

lake
label: lac @fr
type: Class

has Soccer Player
domain: adult actor
type: ObjectProperty
range: soccer player
comment: Relation between Adult Actor and Soccer Player
comment: Relazione tra Adult Actor e Soccer Player @it

has Colour
comment: Relazione tra Adult Actor e Colour @it
type: ObjectProperty
comment: Relation between Adult Actor and Colour
range: colour
domain: adult actor

governor
label: gouverneur @fr
type: Class

poker player
label: joueur de poker @fr
type: Class

school
type: Class
label: école @fr

museum
type: Class
label: musée @fr

ship
type: Class
label: navire @fr

tennis player
type: Class
label: joueur de tennis @fr

has Wrestler
type: ObjectProperty
range: wrestler
domain: adult actor
comment: Relation between Adult Actor and Wrestler
comment: Relazione tra Adult Actor e Wrestler @it

video game
type: Class
label: jeux vidéo @fr

has Insect
domain: adult actor
comment: Relazione tra Adult Actor e Insect @it
type: ObjectProperty
comment: Relation between Adult Actor and Insect
range: insect

trade union
label: syndicat professionnel @fr
type: Class

has Soccer Manager
domain: adult actor
comment: Relation between Adult Actor and Soccer Manager
range: soccer manager
type: ObjectProperty
comment: Relazione tra Adult Actor e Soccer Manager @it

currency
type: Class
label: devise @fr

British royalty
label: royauté Britannique @fr
type: Class

prime minister
type: Class
label: premier ministre @fr

historic place
type: Class
label: site historique @fr

hospital
label: hôpital @fr
type: Class

has Shopping Mall
comment: Relazione tra Adult Actor e Shopping Mall @it
comment: Relation between Adult Actor and Shopping Mall
type: ObjectProperty
domain: adult actor
range: shopping mall

has Figure Skater
type: ObjectProperty
comment: Relazione tra Adult Actor e Figure Skater @it
domain: adult actor
range: figure skater
comment: Relation between Adult Actor and Figure Skater

continent
label: ήπειρος @el
type: Class

has Musical
domain: adult actor
range: musical
type: ObjectProperty
comment: Relation between Adult Actor and Musical
comment: Relazione tra Adult Actor e Musical @it

has Museum
comment: Relazione tra Adult Actor e Museum @it
range: museum
comment: Relation between Adult Actor and Museum
type: ObjectProperty
domain: adult actor

president
type: Class
label: président @fr

album
type: Class
label: Album @de

figure skater
type: Class
label: patineur artistique @fr

has Reptile
range: reptile
type: ObjectProperty
comment: Relazione tra Adult Actor e Reptile @it
domain: adult actor
comment: Relation between Adult Actor and Reptile

has Olympics
type: ObjectProperty
range: olympics
domain: adult actor
comment: Relazione tra Adult Actor e Olympics @it
comment: Relation between Adult Actor and Olympics

has Election
domain: adult actor
comment: Relation between Adult Actor and Election
comment: Relazione tra Adult Actor e Election @it
type: ObjectProperty
range: Election

has Mayor
type: ObjectProperty
domain: adult actor
comment: Relation between Adult Actor and Mayor
range: mayor
comment: Relazione tra Adult Actor e Mayor @it

has Hospital
comment: Relation between Adult Actor and Hospital
domain: adult actor
range: hospital
comment: Relazione tra Adult Actor e Hospital @it
type: ObjectProperty

military unit
type: Class
label: unité militaire @fr

soccer manager
type: Class
label: entraîneur de football @fr

has Website
type: ObjectProperty
comment: Relazione tra Adult Actor e Website @it
domain: adult actor
range: website
comment: Relation between Adult Actor and Website

basketball team
type: Class

has Continent
comment: Relazione tra Adult Actor e Continent @it
domain: adult actor
range: continent
type: ObjectProperty
comment: Relation between Adult Actor and Continent

has Aircraft
range: aircraft
comment: Relazione tra Adult Actor e Aircraft @it
comment: Relation between Adult Actor and Aircraft
type: ObjectProperty
domain: adult actor

music genre
label: genre musical @fr
label: género musical @pt
type: Class

has Single
comment: Relazione tra Adult Actor e Single @it
range: single
domain: adult actor
type: ObjectProperty
comment: Relation between Adult Actor and Single

writer
type: Class
label: écrivain @fr

record label
label: label discographique @fr
type: Class

has Hockey Team
range: hockey team
domain: adult actor
comment: Relation between Adult Actor and Hockey Team
comment: Relazione tra Adult Actor e Hockey Team @it
type: ObjectProperty

model
label: mannequin @fr
type: Class

has Soccer Club
type: ObjectProperty
comment: Relazione tra Adult Actor e Soccer Club @it
comment: Relation between Adult Actor and Soccer Club
domain: adult actor
range: soccer club

film festival
type: Class
label: festival du film @fr

has Legislature
comment: Relazione tra Adult Actor e Legislature @it
type: ObjectProperty
range: legislature
comment: Relation between Adult Actor and Legislature
domain: adult actor

has Airline
comment: Relazione tra Adult Actor e Airline @it
domain: adult actor
type: ObjectProperty
range: airline
comment: Relation between Adult Actor and Airline

comics creator
type: Class
label: créateur de bandes dessinées @fr

has Disease
comment: Relazione tra Adult Actor e Disease @it
range: disease
type: ObjectProperty
domain: adult actor
comment: Relation between Adult Actor and Disease

has Village
comment: Relation between Adult Actor and Village
range: village
comment: Relazione tra Adult Actor e Village @it
type: ObjectProperty
domain: adult actor

aircraft
label: αεροσκάφος @el
type: Class
label: avion @fr

has Mountain
range: mountain
comment: Relation between Adult Actor and Mountain
domain: adult actor
type: ObjectProperty
comment: Relazione tra Adult Actor e Mountain @it

hockey team
type: Class
label: équipe de hockey @fr

has School
comment: Relazione tra Adult Actor e School @it
type: ObjectProperty
range: school
comment: Relation between Adult Actor and School
domain: adult actor

soccer player
type: Class
label: joueur de football @fr

has Member Of Parliament
domain: adult actor
comment: Relation between Adult Actor and Member Of Parliament
comment: Relazione tra Adult Actor e Member Of Parliament @it
type: ObjectProperty
range: member of parliament

has Non- Profit Organisation
comment: Relation between Adult Actor and Non- Profit Organisation
range: non-profit organisation
comment: Relazione tra Adult Actor e Non- Profit Organisation @it
domain: adult actor
type: ObjectProperty

reptile
type: Class

legislature
type: Class
label: pouvoir législatif @fr

has Model
type: ObjectProperty
domain: adult actor
range: model
comment: Relation between Adult Actor and Model
comment: Relazione tra Adult Actor e Model @it

airline
type: Class
label: compagnie aérienne @fr

has Skyscraper
range: skyscraper
comment: Relation between Adult Actor and Skyscraper
domain: adult actor
type: ObjectProperty
comment: Relazione tra Adult Actor e Skyscraper @it

has Congressman
domain: adult actor
comment: Relazione tra Adult Actor e Congressman @it
type: ObjectProperty
comment: Relation between Adult Actor and Congressman
range: congressman

congressman
type: Class
label: membre du Congrès @fr

has Military Unit
type: ObjectProperty
comment: Relation between Adult Actor and Military Unit
domain: adult actor
comment: Relazione tra Adult Actor e Military Unit @it
range: military unit

golf player
type: Class
label: golfeur @fr

has Species
type: ObjectProperty
comment: Relazione tra Adult Actor e Species @it
domain: adult actor
range: species
comment: Relation between Adult Actor and Species

journalist
label: journaliste @fr
type: Class

has Language
domain: adult actor
range: language
comment: Relazione tra Adult Actor e Language @it
comment: Relation between Adult Actor and Language
type: ObjectProperty

has Stadium
range: stadium
comment: Relation between Adult Actor and Stadium
domain: adult actor
comment: Relazione tra Adult Actor e Stadium @it
type: ObjectProperty

insect
type: Class
label: insecte @fr

has Album
domain: adult actor
range: album
type: ObjectProperty
comment: Relation between Adult Actor and Album
comment: Relazione tra Adult Actor e Album @it

has Video Game
comment: Relation between Adult Actor and Video Game
range: video game
type: ObjectProperty
domain: adult actor
comment: Relazione tra Adult Actor e Video Game @it

american football team
label: équipe américaine de football américain @fr
type: Class

has Comics Creator
range: comics creator
domain: adult actor
type: ObjectProperty
comment: Relation between Adult Actor and Comics Creator
comment: Relazione tra Adult Actor e Comics Creator @it

Supreme Court of the United States case
label: cas juridique de la Cour suprême des États-Unis @fr
type: Class

chemical compound
type: Class
label: produit chimique @fr

has Drug
type: ObjectProperty
domain: adult actor
range: drug
comment: Relazione tra Adult Actor e Drug @it
comment: Relation between Adult Actor and Drug

has Game
comment: Relazione tra Adult Actor e Game @it
domain: adult actor
type: ObjectProperty
comment: Relation between Adult Actor and Game
range: game

Axiom
annotated target: genre
annotated source: has Music Genre
matching quantification: 2

has Mammal
comment: Relation between Adult Actor and Mammal
type: ObjectProperty
range: mammal
domain: adult actor
comment: Relazione tra Adult Actor e Mammal @it

musical artist
label: artista musical @pt
type: Class
label: musicien @fr

park
label: parc @fr
type: Class

has Tennis Player
comment: Relation between Adult Actor and Tennis Player
domain: adult actor
comment: Relazione tra Adult Actor e Tennis Player @it
range: tennis player
type: ObjectProperty

rugby player
label: joueur de rugby @fr
type: Class

american football league
type: Class

has Supreme Court Of The United States Case
range: Supreme Court of the United States case
type: ObjectProperty
domain: adult actor
comment: Relazione tra Adult Actor e Supreme Court Of The United States Case @it
comment: Relation between Adult Actor and Supreme Court Of The United States Case

musical
label: musique @fr
type: Class

has Office Holder
comment: Relation between Adult Actor and Office Holder
comment: Relazione tra Adult Actor e Office Holder @it
domain: adult actor
range: office holder
type: ObjectProperty

has Road
domain: adult actor
type: ObjectProperty
comment: Relazione tra Adult Actor e Road @it
range: road
comment: Relation between Adult Actor and Road

has Grape
range: grape
domain: adult actor
comment: Relazione tra Adult Actor e Grape @it
comment: Relation between Adult Actor and Grape
type: ObjectProperty

wrestling event
type: Class
label: match de catch @fr

has Saint
domain: adult actor
type: ObjectProperty
range: saint
comment: Relation between Adult Actor and Saint
comment: Relazione tra Adult Actor e Saint @it

mountain
type: Class
label: montagne @fr
label: Βουνό @el

criminal
label: criminel @fr
type: Class

has Sport
comment: Relation between Adult Actor and Sport
domain: adult actor
range: sport
comment: Relazione tra Adult Actor e Sport @it
type: ObjectProperty

saint
type: Class

senator
label: sénateur @fr
type: Class

comedian
label: comédien @fr
type: Class

song
label: chanson @fr
type: Class

has Radio Station
comment: Relation between Adult Actor and Radio Station
type: ObjectProperty
domain: adult actor
range: radio station
comment: Relazione tra Adult Actor e Radio Station @it

Playboy Playmate
label: playmate pour Playboy @fr
type: Class

convention
type: Class
label: congrès @fr

book
label: książka @pl
label: livre @fr
type: Class
label: llibre @ca
label: βιβλίο @el

has Award
type: ObjectProperty
comment: Relation between Adult Actor and Award
domain: adult actor
comment: Relazione tra Adult Actor e Award @it
range: award

shopping mall
label: centre commercial @fr
type: Class

has Governor
comment: Relazione tra Adult Actor e Governor @it
domain: adult actor
range: governor
type: ObjectProperty
comment: Relation between Adult Actor and Governor

has Island
range: island
domain: adult actor
comment: Relazione tra Adult Actor e Island @it
type: ObjectProperty
comment: Relation between Adult Actor and Island

non-profit organisation
type: Class
label: organisation à but non lucratif @fr

has Weapon
domain: adult actor
type: ObjectProperty
range: weapon
comment: Relazione tra Adult Actor e Weapon @it
comment: Relation between Adult Actor and Weapon

has Comedian
range: comedian
domain: adult actor
type: ObjectProperty
comment: Relazione tra Adult Actor e Comedian @it
comment: Relation between Adult Actor and Comedian

weapon
label: arme @fr
type: Class

has Golf Player
type: ObjectProperty
comment: Relazione tra Adult Actor e Golf Player @it
comment: Relation between Adult Actor and Golf Player
domain: adult actor
range: golf player

has Band
type: ObjectProperty
comment: Relazione tra Adult Actor e Band @it
comment: Relation between Adult Actor and Band
domain: adult actor
range: Band

drug
label: médicament @fr
type: Class

has Senator
range: senator
comment: Relazione tra Adult Actor e Senator @it
type: ObjectProperty
domain: adult actor
comment: Relation between Adult Actor and Senator

military person
label: militaire @fr
type: Class

has Military Conflict
type: ObjectProperty
comment: Relazione tra Adult Actor e Military Conflict @it
comment: Relation between Adult Actor and Military Conflict
domain: adult actor
range: military conflict

award
type: Class
label: récompense @fr

has Criminal
comment: Relazione tra Adult Actor e Criminal @it
comment: Relation between Adult Actor and Criminal
domain: adult actor
type: ObjectProperty
range: criminal

has Record Label
domain: adult actor
range: record label
type: ObjectProperty
comment: Relation between Adult Actor and Record Label
comment: Relazione tra Adult Actor e Record Label @it

sport
type: Class

has Planet
comment: Relation between Adult Actor and Planet
type: ObjectProperty
range: planet
comment: Relazione tra Adult Actor e Planet @it
domain: adult actor

cricketer
type: Class
label: joueur de cricket @fr

single
type: Class

Band
label: groupe de musique @fr
type: Class
label: Musikgruppe @de
label: banda @pt

town
label: ville @fr
type: Class

has Baseball League
range: baseball league
comment: Relazione tra Adult Actor e Baseball League @it
domain: adult actor
comment: Relation between Adult Actor and Baseball League
type: ObjectProperty

university
label: πανεπιστήμιο @el
label: université @fr
type: Class

has Park
comment: Relazione tra Adult Actor e Park @it
range: park
type: ObjectProperty
domain: adult actor
comment: Relation between Adult Actor and Park

has British Royalty
comment: Relation between Adult Actor and British Royalty
domain: adult actor
range: British royalty
comment: Relazione tra Adult Actor e British Royalty @it
type: ObjectProperty

has Historic Place
comment: Relation between Adult Actor and Historic Place
type: ObjectProperty
domain: adult actor
comment: Relazione tra Adult Actor e Historic Place @it
range: historic place

has Ship
domain: adult actor
type: ObjectProperty
range: ship
comment: Relation between Adult Actor and Ship
comment: Relazione tra Adult Actor e Ship @it

music festival
label: festival de musique @fr
type: Class

has Baseball Player
comment: Relazione tra Adult Actor e Baseball Player @it
range: baseball player
type: ObjectProperty
comment: Relation between Adult Actor and Baseball Player
domain: adult actor

has Boxer
comment: Relation between Adult Actor and Boxer
range: boxer
domain: adult actor
type: ObjectProperty
comment: Relazione tra Adult Actor e Boxer @it

has Television Episode
domain: adult actor
type: ObjectProperty
range: television episode
comment: Relazione tra Adult Actor e Television Episode @it
comment: Relation between Adult Actor and Television Episode

television episode
label: épisode télévisé @fr
type: Class

muscle
type: Class

village
type: Class
label: χωριό @el

has Beverage
type: ObjectProperty
range: beverage
domain: adult actor
comment: Relation between Adult Actor and Beverage
comment: Relazione tra Adult Actor e Beverage @it

soccer club
label: club de football @fr
type: Class

office holder
label: Amtsinhaber @de
type: Class
label: titulaire @fr

baseball player
type: Class
label: joueur de baseball @fr

military conflict
type: Class
label: conflit militaire @fr

grape
label: raisin @fr
type: Class

website
label: site web @fr
label: Ιστότοπος @el
type: Class

has Rugby Player
range: rugby player
domain: adult actor
comment: Relazione tra Adult Actor e Rugby Player @it
type: ObjectProperty
comment: Relation between Adult Actor and Rugby Player

basketball player
label: joueur de basketball @fr
type: Class

has Wrestling Event
type: ObjectProperty
comment: Relation between Adult Actor and Wrestling Event
comment: Relazione tra Adult Actor e Wrestling Event @it
domain: adult actor
range: wrestling event

adult actor
label: acteur adulte @fr
label: erwachsener Schauspieler @de
type: Class

has American Football League
comment: Relazione tra Adult Actor e American Football League @it
type: ObjectProperty
comment: Relation between Adult Actor and American Football League
domain: adult actor
range: american football league

has Writer
type: ObjectProperty
range: writer
comment: Relation between Adult Actor and Writer
domain: adult actor
comment: Relazione tra Adult Actor e Writer @it

has Muscle
type: ObjectProperty
domain: adult actor
comment: Relation between Adult Actor and Muscle
comment: Relazione tra Adult Actor e Muscle @it
range: muscle

has Music Genre
type: ObjectProperty
range: music genre
domain: adult actor
comment: Relation between Adult Actor and Music Genre
comment: Relazione tra Adult Actor e Music Genre @it
related match: genre

has Newspaper
range: newspaper
comment: Relation between Adult Actor and Newspaper
comment: Relazione tra Adult Actor e Newspaper @it
type: ObjectProperty
domain: adult actor

Ontology
has intent: To represent the encyclopedic knowledge expressed by an object typed as AdultActor
comment: AdultActor Encyclopedic Knowledge Pattern
has author: Andrea Giovanni Nuzzolese
has author: Valentina Presutti
extracted from: en.wikipedia.org
has author: Aldo Gangemi
imports: cpannotationschema.owl
extracted from: dbpedia.org

beverage
type: Class
label: boisson @fr

has Comics Character
range: comics character
comment: Relazione tra Adult Actor e Comics Character @it
comment: Relation between Adult Actor and Comics Character
domain: adult actor
type: ObjectProperty

planet
label: planète @fr
type: Class

has Military Person
range: military person
comment: Relation between Adult Actor and Military Person
type: ObjectProperty
comment: Relazione tra Adult Actor e Military Person @it
domain: adult actor

scientist
label: scientifique @fr
type: Class
label: Wissenschaftler @de

olympics
type: Class
label: Jeux Olympiques @fr

baseball league
type: Class
label: ligue de baseball @fr

has Trade Union
domain: adult actor
type: ObjectProperty
range: trade union
comment: Relazione tra Adult Actor e Trade Union @it
comment: Relation between Adult Actor and Trade Union

has Chemical Compound
comment: Relazione tra Adult Actor e Chemical Compound @it
domain: adult actor
comment: Relation between Adult Actor and Chemical Compound
range: chemical compound
type: ObjectProperty

has Basketball Player
range: basketball player
comment: Relation between Adult Actor and Basketball Player
type: ObjectProperty
comment: Relazione tra Adult Actor e Basketball Player @it
domain: adult actor

has Playboy Playmate
type: ObjectProperty
comment: Relazione tra Adult Actor e Playboy Playmate @it
range: Playboy Playmate
domain: adult actor
comment: Relation between Adult Actor and Playboy Playmate

has Film Festival
domain: adult actor
comment: Relazione tra Adult Actor e Film Festival @it
range: film festival
type: ObjectProperty
comment: Relation between Adult Actor and Film Festival

has Poker Player
domain: adult actor
type: ObjectProperty
comment: Relation between Adult Actor and Poker Player
comment: Relazione tra Adult Actor e Poker Player @it
range: poker player

mammal
type: Class
label: mammifère @fr

island
label: île @fr
label: νησί @el
type: Class

comics character
label: personnage de bandes dessinées @fr
type: Class

has Journalist
comment: Relation between Adult Actor and Journalist
range: journalist
type: ObjectProperty
comment: Relazione tra Adult Actor e Journalist @it
domain: adult actor

skyscraper
label: gratte-ciel @fr
type: Class

radio station
type: Class
label: station de radio @fr

has Song
comment: Relazione tra Adult Actor e Song @it
range: song
comment: Relation between Adult Actor and Song
type: ObjectProperty
domain: adult actor

has Book
type: ObjectProperty
comment: Relazione tra Adult Actor e Book @it
range: book
domain: adult actor
comment: Relation between Adult Actor and Book

member of parliament
type: Class
label: membre du Parlement @fr

has Currency
type: ObjectProperty
domain: adult actor
comment: Relation between Adult Actor and Currency
comment: Relazione tra Adult Actor e Currency @it
range: currency

has Lake
comment: Relazione tra Adult Actor e Lake @it
range: lake
domain: adult actor
comment: Relation between Adult Actor and Lake
type: ObjectProperty

airport
label: aéroport @fr
label: Flughafen @de
type: Class