has Artery
range: artery
comment: Relazione tra Baseball Player e Artery @it
type: ObjectProperty
comment: Relation between Baseball Player and Artery
domain: baseball player

has Non- Profit Organisation
domain: baseball player
type: ObjectProperty
range: non-profit organisation
comment: Relation between Baseball Player and Non- Profit Organisation
comment: Relazione tra Baseball Player e Non- Profit Organisation @it

television show
label: émission de télévision @fr
type: Class

has Currency
comment: Relazione tra Baseball Player e Currency @it
range: currency
comment: Relation between Baseball Player and Currency
domain: baseball player
type: ObjectProperty

disease
type: Class
label: maladie @fr

has Song
comment: Relation between Baseball Player and Song
type: ObjectProperty
domain: baseball player
range: song
comment: Relazione tra Baseball Player e Song @it

has Fungus
comment: Relazione tra Baseball Player e Fungus @it
range: fungus
type: ObjectProperty
domain: baseball player
comment: Relation between Baseball Player and Fungus

colour
type: Class
label: couleur @fr
label: χρώμα @el

automobile
type: Class

Election
type: Class
label: élection @fr

has American Football Team
related match: teams
range: american football team
comment: Relazione tra Baseball Player e American Football Team @it
comment: Relation between Baseball Player and American Football Team
type: ObjectProperty
domain: baseball player

has Historic Place
range: historic place
type: ObjectProperty
comment: Relation between Baseball Player and Historic Place
comment: Relazione tra Baseball Player e Historic Place @it
domain: baseball player

american football player
type: Class
label: joueur de football américain @fr

has Video Game
comment: Relazione tra Baseball Player e Video Game @it
comment: Relation between Baseball Player and Video Game
type: ObjectProperty
domain: baseball player
range: video game

soccer league
type: Class
label: ligue de football @fr

astronaut
type: Class
label: Astronaut @de
label: astronaute @fr

Axiom
matching quantification: 13
annotated source: has American Football Player
annotated target: after

has Magazine
related match: title
comment: Relazione tra Baseball Player e Magazine @it
comment: Relation between Baseball Player and Magazine
range: magazine
type: ObjectProperty
domain: baseball player

Axiom
matching quantification: 1
annotated target: after
annotated source: has Military Person

has Wrestler
comment: Relazione tra Baseball Player e Wrestler @it
domain: baseball player
range: wrestler
comment: Relation between Baseball Player and Wrestler
type: ObjectProperty

wrestler
label: lutteur @fr
type: Class

has Adult Actor
comment: Relation between Baseball Player and Adult Actor
type: ObjectProperty
comment: Relazione tra Baseball Player e Adult Actor @it
domain: baseball player
range: adult actor

has Television Show
type: ObjectProperty
range: television show
domain: baseball player
comment: Relation between Baseball Player and Television Show
comment: Relazione tra Baseball Player e Television Show @it

mayor
label: maire @fr
type: Class

pope
type: Class
label: pape @fr

species
label: espèce @fr
type: Class

has Park
domain: baseball player
type: ObjectProperty
comment: Relation between Baseball Player and Park
comment: Relazione tra Baseball Player e Park @it
range: park

newspaper
label: journal @fr
type: Class

game
label: jeu @fr
type: Class

protected area
label: aire protégée @fr
label: προστατευμένη περιοχή @el
type: Class

has Airport
range: airport
comment: Relazione tra Baseball Player e Airport @it
comment: Relation between Baseball Player and Airport
type: ObjectProperty
domain: baseball player
related match: birthplace

road
type: Class
label: route @fr

has Trade Union
range: trade union
comment: Relazione tra Baseball Player e Trade Union @it
comment: Relation between Baseball Player and Trade Union
domain: baseball player
type: ObjectProperty

Axiom
annotated source: has American Football Team
matching quantification: 1
annotated target: teams

has Ice Hockey League
domain: baseball player
type: ObjectProperty
range: ice hockey league
comment: Relazione tra Baseball Player e Ice Hockey League @it
comment: Relation between Baseball Player and Ice Hockey League

boxer
label: boxeur @fr
type: Class

judge
type: Class
label: juge @fr

has Pope
type: ObjectProperty
comment: Relation between Baseball Player and Pope
range: pope
domain: baseball player
comment: Relazione tra Baseball Player e Pope @it

has Mammal
comment: Relation between Baseball Player and Mammal
range: mammal
domain: baseball player
comment: Relazione tra Baseball Player e Mammal @it
type: ObjectProperty

World Heritage Site
label: site du patrimoine mondial @fr
type: Class

has Cyclist
comment: Relazione tra Baseball Player e Cyclist @it
domain: baseball player
comment: Relation between Baseball Player and Cyclist
type: ObjectProperty
range: cyclist

has Saint
range: saint
type: ObjectProperty
domain: baseball player
comment: Relazione tra Baseball Player e Saint @it
comment: Relation between Baseball Player and Saint

has Vein
comment: Relation between Baseball Player and Vein
range: vein
domain: baseball player
type: ObjectProperty
comment: Relazione tra Baseball Player e Vein @it

station
type: Class

language
type: Class
label: langage @fr

has Road
comment: Relazione tra Baseball Player e Road @it
range: road
comment: Relation between Baseball Player and Road
type: ObjectProperty
domain: baseball player

has Ethnic Group
range: ethnic group
comment: Relation between Baseball Player and Ethnic Group
domain: baseball player
comment: Relazione tra Baseball Player e Ethnic Group @it
type: ObjectProperty

lake
type: Class
label: lac @fr

has Cricketer
comment: Relation between Baseball Player and Cricketer
comment: Relazione tra Baseball Player e Cricketer @it
type: ObjectProperty
domain: baseball player
range: cricketer

has Album
comment: Relazione tra Baseball Player e Album @it
domain: baseball player
comment: Relation between Baseball Player and Album
type: ObjectProperty
range: album

has Olympics
comment: Relazione tra Baseball Player e Olympics @it
range: olympics
domain: baseball player
comment: Relation between Baseball Player and Olympics
type: ObjectProperty

has Bridge
range: bridge
comment: Relazione tra Baseball Player e Bridge @it
domain: baseball player
comment: Relation between Baseball Player and Bridge
type: ObjectProperty

governor
label: gouverneur @fr
type: Class

has Single
range: single
comment: Relation between Baseball Player and Single
domain: baseball player
comment: Relazione tra Baseball Player e Single @it
type: ObjectProperty

Axiom
annotated target: years
matching quantification: 1
annotated source: has American Football Player

poker player
label: joueur de poker @fr
type: Class

has Soccer Player
type: ObjectProperty
comment: Relazione tra Baseball Player e Soccer Player @it
range: soccer player
domain: baseball player
comment: Relation between Baseball Player and Soccer Player

river
type: Class
label: rivière @fr

has Prime Minister
comment: Relation between Baseball Player and Prime Minister
comment: Relazione tra Baseball Player e Prime Minister @it
type: ObjectProperty
range: prime minister
domain: baseball player

ship
label: navire @fr
type: Class

fish
type: Class
label: poisson @fr

museum
label: musée @fr
type: Class

tennis player
type: Class
label: joueur de tennis @fr

video game
label: jeux vidéo @fr
type: Class

trade union
label: syndicat professionnel @fr
type: Class

currency
type: Class
label: devise @fr

prime minister
label: premier ministre @fr
type: Class

British royalty
type: Class
label: royauté Britannique @fr

has Band
comment: Relazione tra Baseball Player e Band @it
range: Band
domain: baseball player
type: ObjectProperty
comment: Relation between Baseball Player and Band

historic place
label: site historique @fr
type: Class

hospital
type: Class
label: hôpital @fr

has Language
range: language
type: ObjectProperty
comment: Relation between Baseball Player and Language
domain: baseball player
comment: Relazione tra Baseball Player e Language @it

Axiom
matching quantification: 3
annotated source: has Ice Hockey Player
annotated target: after

has Judge
range: judge
comment: Relazione tra Baseball Player e Judge @it
type: ObjectProperty
comment: Relation between Baseball Player and Judge
domain: baseball player

continent
label: ήπειρος @el
type: Class

president
label: président @fr
type: Class

album
type: Class
label: Album @de

has Muscle
domain: baseball player
comment: Relation between Baseball Player and Muscle
range: muscle
comment: Relazione tra Baseball Player e Muscle @it
type: ObjectProperty

figure skater
type: Class
label: patineur artistique @fr

has World Heritage Site
type: ObjectProperty
domain: baseball player
comment: Relation between Baseball Player and World Heritage Site
comment: Relazione tra Baseball Player e World Heritage Site @it
range: World Heritage Site

has Senator
comment: Relation between Baseball Player and Senator
range: senator
domain: baseball player
type: ObjectProperty
comment: Relazione tra Baseball Player e Senator @it
related match: before
related match: after

military unit
label: unité militaire @fr
type: Class

soccer manager
type: Class
label: entraîneur de football @fr

basketball team
type: Class

has Record Label
comment: Relation between Baseball Player and Record Label
type: ObjectProperty
range: record label
domain: baseball player
comment: Relazione tra Baseball Player e Record Label @it

has Boxer
related match: after
domain: baseball player
range: boxer
type: ObjectProperty
comment: Relation between Baseball Player and Boxer
comment: Relazione tra Baseball Player e Boxer @it

music genre
type: Class
label: género musical @pt
label: genre musical @fr

has Mountain Range
type: ObjectProperty
range: mountain range
comment: Relazione tra Baseball Player e Mountain Range @it
domain: baseball player
comment: Relation between Baseball Player and Mountain Range

Axiom
annotated source: has Award
annotated target: title
matching quantification: 44

has Philosopher
range: philosopher
domain: baseball player
comment: Relation between Baseball Player and Philosopher
comment: Relazione tra Baseball Player e Philosopher @it
type: ObjectProperty

has Website
range: website
comment: Relazione tra Baseball Player e Website @it
type: ObjectProperty
comment: Relation between Baseball Player and Website
domain: baseball player

writer
type: Class
label: écrivain @fr

has American Football Player
related match: after
related match: before
related match: years
domain: baseball player
comment: Relation between Baseball Player and American Football Player
range: american football player
comment: Relazione tra Baseball Player e American Football Player @it
type: ObjectProperty

record label
label: label discographique @fr
type: Class

Axiom
matching quantification: 1
annotated source: has Airport
annotated target: birthplace

architect
label: architecte @fr
type: Class

has Weapon
range: weapon
comment: Relation between Baseball Player and Weapon
domain: baseball player
type: ObjectProperty
comment: Relazione tra Baseball Player e Weapon @it

model
label: mannequin @fr
type: Class

ambassador
type: Class
label: ambassadeur @fr

crustacean
label: crustacés @fr
type: Class

olympic result
type: Class
label: résultat de Jeux Olympiques @fr

has Congressman
comment: Relazione tra Baseball Player e Congressman @it
domain: baseball player
type: ObjectProperty
range: congressman
comment: Relation between Baseball Player and Congressman

has Mixed Martial Arts Event
domain: baseball player
comment: Relation between Baseball Player and Mixed Martial Arts Event
comment: Relazione tra Baseball Player e Mixed Martial Arts Event @it
range: mixed martial arts event
type: ObjectProperty

film festival
type: Class
label: festival du film @fr

has Cardinal
comment: Relation between Baseball Player and Cardinal
domain: baseball player
type: ObjectProperty
comment: Relazione tra Baseball Player e Cardinal @it
range: cardinal

has Tennis Player
type: ObjectProperty
comment: Relation between Baseball Player and Tennis Player
comment: Relazione tra Baseball Player e Tennis Player @it
range: tennis player
domain: baseball player
related match: after

has Protected Area
comment: Relazione tra Baseball Player e Protected Area @it
type: ObjectProperty
range: protected area
domain: baseball player
comment: Relation between Baseball Player and Protected Area

has Village
domain: baseball player
type: ObjectProperty
range: village
comment: Relation between Baseball Player and Village
comment: Relazione tra Baseball Player e Village @it

has Town
range: town
type: ObjectProperty
comment: Relation between Baseball Player and Town
comment: Relazione tra Baseball Player e Town @it
domain: baseball player
related match: birthplace

has Shopping Mall
comment: Relation between Baseball Player and Shopping Mall
type: ObjectProperty
range: shopping mall
domain: baseball player
comment: Relazione tra Baseball Player e Shopping Mall @it

comics creator
label: créateur de bandes dessinées @fr
type: Class

has Golf Player
related match: after
range: golf player
domain: baseball player
comment: Relation between Baseball Player and Golf Player
comment: Relazione tra Baseball Player e Golf Player @it
type: ObjectProperty

aircraft
label: αεροσκάφος @el
type: Class
label: avion @fr

has Military Conflict
type: ObjectProperty
domain: baseball player
range: military conflict
comment: Relazione tra Baseball Player e Military Conflict @it
comment: Relation between Baseball Player and Military Conflict

has Drug
domain: baseball player
type: ObjectProperty
range: drug
comment: Relation between Baseball Player and Drug
comment: Relazione tra Baseball Player e Drug @it

has Scientist
comment: Relation between Baseball Player and Scientist
comment: Relazione tra Baseball Player e Scientist @it
range: scientist
domain: baseball player
type: ObjectProperty

Axiom
annotated target: after
matching quantification: 3
annotated source: has College Coach

has Species
range: species
type: ObjectProperty
comment: Relation between Baseball Player and Species
domain: baseball player
comment: Relazione tra Baseball Player e Species @it

hockey team
label: équipe de hockey @fr
type: Class

has Architect
comment: Relazione tra Baseball Player e Architect @it
comment: Relation between Baseball Player and Architect
domain: baseball player
type: ObjectProperty
range: architect

Axiom
annotated source: has Basketball Player
matching quantification: 1
annotated target: after

soccer player
type: Class
label: joueur de football @fr

has Figure Skater
type: ObjectProperty
comment: Relazione tra Baseball Player e Figure Skater @it
comment: Relation between Baseball Player and Figure Skater
domain: baseball player
range: figure skater

reptile
type: Class

legislature
type: Class
label: pouvoir législatif @fr

has Basketball Team
range: basketball team
comment: Relation between Baseball Player and Basketball Team
type: ObjectProperty
comment: Relazione tra Baseball Player e Basketball Team @it
domain: baseball player

airline
label: compagnie aérienne @fr
type: Class

has Astronaut
comment: Relation between Baseball Player and Astronaut
range: astronaut
comment: Relazione tra Baseball Player e Astronaut @it
domain: baseball player
type: ObjectProperty

monarch
label: monarque @fr
type: Class

congressman
label: membre du Congrès @fr
type: Class

has Radio Station
type: ObjectProperty
range: radio station
domain: baseball player
comment: Relazione tra Baseball Player e Radio Station @it
comment: Relation between Baseball Player and Radio Station

golf player
label: golfeur @fr
type: Class

nascar driver
label: pilote de la nascar @fr
type: Class

space mission
label: mission spatiale @fr
label: διαστημική αποστολή @el
type: Class

journalist
label: journaliste @fr
type: Class

has Playboy Playmate
comment: Relazione tra Baseball Player e Playboy Playmate @it
type: ObjectProperty
domain: baseball player
comment: Relation between Baseball Player and Playboy Playmate
range: Playboy Playmate

has Olympic Result
comment: Relazione tra Baseball Player e Olympic Result @it
comment: Relation between Baseball Player and Olympic Result
domain: baseball player
range: olympic result
type: ObjectProperty

has Ice Hockey Player
related match: after
comment: Relazione tra Baseball Player e Ice Hockey Player @it
type: ObjectProperty
range: ice hockey player
comment: Relation between Baseball Player and Ice Hockey Player
domain: baseball player

Axiom
matching quantification: 3
annotated target: birthplace
annotated source: has Island

insect
type: Class
label: insecte @fr

film
type: Class
label: ταινία @el

american football team
type: Class
label: équipe américaine de football américain @fr

Supreme Court of the United States case
label: cas juridique de la Cour suprême des États-Unis @fr
type: Class

bird
type: Class
label: oiseau @fr

chemical compound
label: produit chimique @fr
type: Class

has Station
comment: Relation between Baseball Player and Station
range: station
type: ObjectProperty
comment: Relazione tra Baseball Player e Station @it
domain: baseball player

has Ship
range: ship
domain: baseball player
type: ObjectProperty
comment: Relazione tra Baseball Player e Ship @it
comment: Relation between Baseball Player and Ship

has American Football League
range: american football league
comment: Relazione tra Baseball Player e American Football League @it
comment: Relation between Baseball Player and American Football League
domain: baseball player
type: ObjectProperty

fungus
type: Class
label: fungi @fr

musical artist
label: musicien @fr
type: Class
label: artista musical @pt

has River
comment: Relation between Baseball Player and River
domain: baseball player
comment: Relazione tra Baseball Player e River @it
range: river
type: ObjectProperty

has Formula One Racer
type: ObjectProperty
comment: Relazione tra Baseball Player e Formula One Racer @it
comment: Relation between Baseball Player and Formula One Racer
domain: baseball player
range: Formula One racer

has Airline
range: airline
comment: Relation between Baseball Player and Airline
type: ObjectProperty
comment: Relazione tra Baseball Player e Airline @it
domain: baseball player

park
label: parc @fr
type: Class

cardinal
type: Class

rugby player
label: joueur de rugby @fr
type: Class

has Comics Character
type: ObjectProperty
range: comics character
comment: Relazione tra Baseball Player e Comics Character @it
comment: Relation between Baseball Player and Comics Character
domain: baseball player

american football league
type: Class

musical
label: musique @fr
type: Class

has Hockey Team
comment: Relazione tra Baseball Player e Hockey Team @it
domain: baseball player
comment: Relation between Baseball Player and Hockey Team
range: hockey team
type: ObjectProperty

has Wrestling Event
comment: Relazione tra Baseball Player e Wrestling Event @it
range: wrestling event
type: ObjectProperty
comment: Relation between Baseball Player and Wrestling Event
domain: baseball player

has Lake
type: ObjectProperty
domain: baseball player
comment: Relazione tra Baseball Player e Lake @it
range: lake
comment: Relation between Baseball Player and Lake

has Chemical Compound
domain: baseball player
range: chemical compound
type: ObjectProperty
comment: Relazione tra Baseball Player e Chemical Compound @it
comment: Relation between Baseball Player and Chemical Compound

cyclist
type: Class
label: cycliste @fr

has Nascar Driver
range: nascar driver
domain: baseball player
type: ObjectProperty
comment: Relation between Baseball Player and Nascar Driver
comment: Relazione tra Baseball Player e Nascar Driver @it

national collegiate athletic association athlete
type: Class
label: athlète de la national collegiate athletic association @fr

has Space Mission
comment: Relation between Baseball Player and Space Mission
comment: Relazione tra Baseball Player e Space Mission @it
domain: baseball player
range: space mission
type: ObjectProperty

wrestling event
type: Class
label: match de catch @fr

has Colour
type: ObjectProperty
comment: Relazione tra Baseball Player e Colour @it
domain: baseball player
comment: Relation between Baseball Player and Colour
range: colour

basketball league
type: Class
label: ligue de basketball @fr

has Bird
range: bird
type: ObjectProperty
comment: Relazione tra Baseball Player e Bird @it
comment: Relation between Baseball Player and Bird
domain: baseball player

has Skyscraper
range: skyscraper
comment: Relazione tra Baseball Player e Skyscraper @it
type: ObjectProperty
comment: Relation between Baseball Player and Skyscraper
domain: baseball player

criminal
type: Class
label: criminel @fr

has Music Genre
range: music genre
type: ObjectProperty
comment: Relazione tra Baseball Player e Music Genre @it
domain: baseball player
comment: Relation between Baseball Player and Music Genre

has Military Person
related match: after
comment: Relazione tra Baseball Player e Military Person @it
range: military person
comment: Relation between Baseball Player and Military Person
domain: baseball player
type: ObjectProperty

has Film Festival
comment: Relazione tra Baseball Player e Film Festival @it
range: film festival
comment: Relation between Baseball Player and Film Festival
domain: baseball player
type: ObjectProperty

senator
type: Class
label: sénateur @fr

saint
type: Class

has Disease
type: ObjectProperty
comment: Relazione tra Baseball Player e Disease @it
range: disease
domain: baseball player
comment: Relation between Baseball Player and Disease

comedian
label: comédien @fr
type: Class

has Golf League
comment: Relation between Baseball Player and Golf League
range: golf league
comment: Relazione tra Baseball Player e Golf League @it
type: ObjectProperty
domain: baseball player

song
label: chanson @fr
type: Class

has Award
domain: baseball player
comment: Relazione tra Baseball Player e Award @it
comment: Relation between Baseball Player and Award
range: award
type: ObjectProperty
related match: title

Playboy Playmate
label: playmate pour Playboy @fr
type: Class

book
type: Class
label: livre @fr
label: βιβλίο @el
label: llibre @ca
label: książka @pl

has Bone
comment: Relation between Baseball Player and Bone
range: bone
type: ObjectProperty
domain: baseball player
comment: Relazione tra Baseball Player e Bone @it

has Musical Artist
comment: Relazione tra Baseball Player e Musical Artist @it
domain: baseball player
type: ObjectProperty
range: musical artist
comment: Relation between Baseball Player and Musical Artist

has Military Unit
related match: branch
related match: unit
type: ObjectProperty
comment: Relazione tra Baseball Player e Military Unit @it
range: military unit
domain: baseball player
comment: Relation between Baseball Player and Military Unit

shopping mall
type: Class
label: centre commercial @fr

Axiom
annotated target: title
annotated source: has Magazine
matching quantification: 2

has Island
related match: birthplace
type: ObjectProperty
comment: Relation between Baseball Player and Island
range: island
domain: baseball player
comment: Relazione tra Baseball Player e Island @it

has Newspaper
range: newspaper
domain: baseball player
comment: Relation between Baseball Player and Newspaper
type: ObjectProperty
comment: Relazione tra Baseball Player e Newspaper @it

non-profit organisation
type: Class
label: organisation à but non lucratif @fr

has Automobile
type: ObjectProperty
range: automobile
comment: Relation between Baseball Player and Automobile
domain: baseball player
comment: Relazione tra Baseball Player e Automobile @it

canadian football league
type: Class

has Planet
type: ObjectProperty
comment: Relation between Baseball Player and Planet
domain: baseball player
comment: Relazione tra Baseball Player e Planet @it
range: planet

has Poker Player
domain: baseball player
comment: Relazione tra Baseball Player e Poker Player @it
range: poker player
comment: Relation between Baseball Player and Poker Player
type: ObjectProperty

has Soccer League
type: ObjectProperty
domain: baseball player
range: soccer league
comment: Relazione tra Baseball Player e Soccer League @it
comment: Relation between Baseball Player and Soccer League

has Grape
comment: Relation between Baseball Player and Grape
domain: baseball player
type: ObjectProperty
comment: Relazione tra Baseball Player e Grape @it
range: grape

weapon
label: arme @fr
type: Class

has Broadcast
comment: Relazione tra Baseball Player e Broadcast @it
domain: baseball player
type: ObjectProperty
range: broadcast
comment: Relation between Baseball Player and Broadcast

drug
type: Class
label: médicament @fr

has Ambassador
range: ambassador
type: ObjectProperty
comment: Relation between Baseball Player and Ambassador
comment: Relazione tra Baseball Player e Ambassador @it
domain: baseball player

magazine
label: περιοδικό @el
type: Class

Axiom
annotated target: before
annotated source: has College Coach
matching quantification: 1

has Television Episode
comment: Relation between Baseball Player and Television Episode
comment: Relazione tra Baseball Player e Television Episode @it
type: ObjectProperty
range: television episode
domain: baseball player

has Comedian
domain: baseball player
comment: Relazione tra Baseball Player e Comedian @it
range: comedian
type: ObjectProperty
comment: Relation between Baseball Player and Comedian

Axiom
annotated source: has Town
matching quantification: 2
annotated target: birthplace

has Book
type: ObjectProperty
range: book
comment: Relation between Baseball Player and Book
comment: Relazione tra Baseball Player e Book @it
domain: baseball player

military person
label: militaire @fr
type: Class

has Writer
comment: Relazione tra Baseball Player e Writer @it
range: writer
domain: baseball player
comment: Relation between Baseball Player and Writer
type: ObjectProperty

philosopher
type: Class
label: philosophe @fr

award
label: récompense @fr
type: Class

has Historic Building
range: historic building
type: ObjectProperty
comment: Relation between Baseball Player and Historic Building
comment: Relazione tra Baseball Player e Historic Building @it
domain: baseball player

cricketer
type: Class
label: joueur de cricket @fr

nerve
label: nerf @fr
type: Class

single
type: Class

mixed martial arts event
type: Class
label: évènement d'arts martiaux mixtes @fr

has Museum
domain: baseball player
comment: Relazione tra Baseball Player e Museum @it
comment: Relation between Baseball Player and Museum
range: museum
type: ObjectProperty

Band
label: groupe de musique @fr
type: Class
label: Musikgruppe @de
label: banda @pt

town
label: ville @fr
type: Class

has Mayor
domain: baseball player
range: mayor
comment: Relazione tra Baseball Player e Mayor @it
type: ObjectProperty
comment: Relation between Baseball Player and Mayor

protein
label: protéine @fr
type: Class

ethnic group
type: Class
label: groupe ethnique @fr

artery
label: artère @fr
type: Class
label: Arterie @de

Axiom
matching quantification: 1
annotated source: has Senator
annotated target: before

Axiom
annotated target: branch
annotated source: has Military Unit
matching quantification: 2

has Monarch
comment: Relation between Baseball Player and Monarch
type: ObjectProperty
comment: Relazione tra Baseball Player e Monarch @it
range: monarch
domain: baseball player

has Governor
comment: Relation between Baseball Player and Governor
comment: Relazione tra Baseball Player e Governor @it
domain: baseball player
type: ObjectProperty
range: governor

college coach
label: entraîneur universitaire @fr
type: Class

television episode
label: épisode télévisé @fr
type: Class

has Fish
comment: Relation between Baseball Player and Fish
domain: baseball player
range: fish
type: ObjectProperty
comment: Relazione tra Baseball Player e Fish @it

has Comics Creator
domain: baseball player
comment: Relazione tra Baseball Player e Comics Creator @it
type: ObjectProperty
comment: Relation between Baseball Player and Comics Creator
range: comics creator

muscle
type: Class

village
type: Class
label: χωριό @el

has Insect
range: insect
domain: baseball player
type: ObjectProperty
comment: Relazione tra Baseball Player e Insect @it
comment: Relation between Baseball Player and Insect

ice hockey league
type: Class
label: ligue d'hockey sur glace @fr

has National Collegiate Athletic Association Athlete
type: ObjectProperty
comment: Relazione tra Baseball Player e National Collegiate Athletic Association Athlete @it
comment: Relation between Baseball Player and National Collegiate Athletic Association Athlete
range: national collegiate athletic association athlete
domain: baseball player

has Basketball League
comment: Relazione tra Baseball Player e Basketball League @it
type: ObjectProperty
comment: Relation between Baseball Player and Basketball League
range: basketball league
domain: baseball player

has Journalist
comment: Relazione tra Baseball Player e Journalist @it
comment: Relation between Baseball Player and Journalist
range: journalist
type: ObjectProperty
domain: baseball player

has Canadian Football League
range: canadian football league
type: ObjectProperty
comment: Relazione tra Baseball Player e Canadian Football League @it
comment: Relation between Baseball Player and Canadian Football League
domain: baseball player

has Continent
type: ObjectProperty
comment: Relation between Baseball Player and Continent
comment: Relazione tra Baseball Player e Continent @it
domain: baseball player
range: continent

soccer club
type: Class
label: club de football @fr

has Beverage
comment: Relation between Baseball Player and Beverage
range: beverage
type: ObjectProperty
domain: baseball player
comment: Relazione tra Baseball Player e Beverage @it

has Aircraft
type: ObjectProperty
domain: baseball player
comment: Relation between Baseball Player and Aircraft
comment: Relazione tra Baseball Player e Aircraft @it
range: aircraft

has Rugby Player
range: rugby player
comment: Relation between Baseball Player and Rugby Player
domain: baseball player
type: ObjectProperty
comment: Relazione tra Baseball Player e Rugby Player @it

historic building
label: bâtiment historique @fr
type: Class

has Election
domain: baseball player
comment: Relation between Baseball Player and Election
type: ObjectProperty
comment: Relazione tra Baseball Player e Election @it
range: Election

Axiom
matching quantification: 1
annotated source: has Office Holder
annotated target: after

baseball player
type: Class
label: joueur de baseball @fr

office holder
label: titulaire @fr
label: Amtsinhaber @de
type: Class

military conflict
label: conflit militaire @fr
type: Class

website
label: site web @fr
label: Ιστότοπος @el
type: Class

grape
label: raisin @fr
type: Class

has College Coach
related match: before
related match: after
type: ObjectProperty
range: college coach
domain: baseball player
comment: Relation between Baseball Player and College Coach
comment: Relazione tra Baseball Player e College Coach @it

has Legislature
type: ObjectProperty
domain: baseball player
comment: Relation between Baseball Player and Legislature
comment: Relazione tra Baseball Player e Legislature @it
range: legislature

has Film
type: ObjectProperty
domain: baseball player
comment: Relazione tra Baseball Player e Film @it
range: film
comment: Relation between Baseball Player and Film

Axiom
annotated target: after
matching quantification: 1
annotated source: has Tennis Player

has Model
range: model
comment: Relazione tra Baseball Player e Model @it
comment: Relation between Baseball Player and Model
domain: baseball player
type: ObjectProperty

basketball player
type: Class
label: joueur de basketball @fr

adult actor
label: acteur adulte @fr
type: Class
label: erwachsener Schauspieler @de

ice hockey player
type: Class
label: joueur de hockey sur glace @fr

has Supreme Court Of The United States Case
comment: Relazione tra Baseball Player e Supreme Court Of The United States Case @it
type: ObjectProperty
comment: Relation between Baseball Player and Supreme Court Of The United States Case
range: Supreme Court of the United States case
domain: baseball player

has Crustacean
range: crustacean
domain: baseball player
comment: Relazione tra Baseball Player e Crustacean @it
type: ObjectProperty
comment: Relation between Baseball Player and Crustacean

mountain range
label: chaîne de montagne @fr
type: Class

beverage
type: Class
label: boisson @fr

Axiom
annotated source: has Military Unit
annotated target: unit
matching quantification: 1

Axiom
annotated target: before
annotated source: has American Football Player
matching quantification: 4

Axiom
annotated target: after
annotated source: has Golf Player
matching quantification: 3

planet
type: Class
label: planète @fr

has Basketball Player
range: basketball player
comment: Relazione tra Baseball Player e Basketball Player @it
domain: baseball player
comment: Relation between Baseball Player and Basketball Player
type: ObjectProperty
related match: after

scientist
label: scientifique @fr
type: Class
label: Wissenschaftler @de

has Nerve
comment: Relation between Baseball Player and Nerve
type: ObjectProperty
domain: baseball player
range: nerve
comment: Relazione tra Baseball Player e Nerve @it

golf league
label: ligue de golf @fr
type: Class

has Criminal
domain: baseball player
comment: Relazione tra Baseball Player e Criminal @it
comment: Relation between Baseball Player and Criminal
type: ObjectProperty
range: criminal

has Soccer Manager
range: soccer manager
domain: baseball player
comment: Relazione tra Baseball Player e Soccer Manager @it
comment: Relation between Baseball Player and Soccer Manager
type: ObjectProperty

olympics
label: Jeux Olympiques @fr
type: Class

has Hospital
domain: baseball player
range: hospital
comment: Relation between Baseball Player and Hospital
type: ObjectProperty
comment: Relazione tra Baseball Player e Hospital @it

bridge
label: pont @fr
type: Class

has Protein
type: ObjectProperty
range: protein
domain: baseball player
comment: Relation between Baseball Player and Protein
comment: Relazione tra Baseball Player e Protein @it

Axiom
annotated source: has Boxer
matching quantification: 3
annotated target: after

Axiom
annotated target: after
annotated source: has Senator
matching quantification: 4

broadcast
label: Émission de télévision @fr
type: Class

has Game
type: ObjectProperty
comment: Relazione tra Baseball Player e Game @it
comment: Relation between Baseball Player and Game
domain: baseball player
range: game

vein
label: veine @fr
type: Class

mammal
label: mammifère @fr
type: Class

island
label: île @fr
label: νησί @el
type: Class

comics character
label: personnage de bandes dessinées @fr
type: Class

has British Royalty
comment: Relazione tra Baseball Player e British Royalty @it
domain: baseball player
range: British royalty
type: ObjectProperty
comment: Relation between Baseball Player and British Royalty

skyscraper
label: gratte-ciel @fr
type: Class

Formula One racer
type: Class
label: pilote de formule 1 @fr

has Soccer Club
range: soccer club
comment: Relation between Baseball Player and Soccer Club
comment: Relazione tra Baseball Player e Soccer Club @it
type: ObjectProperty
domain: baseball player

has Musical
comment: Relazione tra Baseball Player e Musical @it
range: musical
comment: Relation between Baseball Player and Musical
domain: baseball player
type: ObjectProperty

Ontology
has intent: To represent the encyclopedic knowledge expressed by an object typed as BaseballPlayer
has author: Valentina Presutti
has author: Aldo Gangemi
comment: BaseballPlayer Encyclopedic Knowledge Pattern
extracted from: en.wikipedia.org
has author: Andrea Giovanni Nuzzolese
extracted from: dbpedia.org
imports: cpannotationschema.owl

has Office Holder
comment: Relation between Baseball Player and Office Holder
domain: baseball player
comment: Relazione tra Baseball Player e Office Holder @it
type: ObjectProperty
range: office holder
related match: after

radio station
label: station de radio @fr
type: Class

bone
type: Class
label: Knochen @de
label: os @fr

has President
domain: baseball player
range: president
comment: Relazione tra Baseball Player e President @it
type: ObjectProperty
comment: Relation between Baseball Player and President

airport
type: Class
label: Flughafen @de
label: aéroport @fr

has Reptile
range: reptile
comment: Relation between Baseball Player and Reptile
domain: baseball player
type: ObjectProperty
comment: Relazione tra Baseball Player e Reptile @it