has Judge
range: judge
type: ObjectProperty
comment: Relazione tra Basketball Team e Judge @it
comment: Relation between Basketball Team and Judge
domain: basketball team

has Bone
domain: basketball team
range: bone
comment: Relation between Basketball Team and Bone
comment: Relazione tra Basketball Team e Bone @it
type: ObjectProperty

television show
type: Class
label: émission de télévision @fr

disease
label: maladie @fr
type: Class

rugby player
type: Class
label: joueur de rugby @fr

has Music Genre
type: ObjectProperty
range: music genre
comment: Relation between Basketball Team and Music Genre
domain: basketball team
comment: Relazione tra Basketball Team e Music Genre @it

american football league
type: Class

colour
label: χρώμα @el
label: couleur @fr
type: Class

has Soccer Player
comment: Relation between Basketball Team and Soccer Player
domain: basketball team
comment: Relazione tra Basketball Team e Soccer Player @it
type: ObjectProperty
range: soccer player

has Film
range: film
domain: basketball team
type: ObjectProperty
comment: Relation between Basketball Team and Film
comment: Relazione tra Basketball Team e Film @it

has Baseball Player
range: baseball player
type: ObjectProperty
domain: basketball team
comment: Relation between Basketball Team and Baseball Player
comment: Relazione tra Basketball Team e Baseball Player @it

has Band
type: ObjectProperty
comment: Relazione tra Basketball Team e Band @it
domain: basketball team
comment: Relation between Basketball Team and Band
range: Band

has Software
comment: Relazione tra Basketball Team e Software @it
domain: basketball team
type: ObjectProperty
range: software
comment: Relation between Basketball Team and Software

actor
label: Schauspieler @de
type: Class
label: acteur @fr

american football player
type: Class
label: joueur de football américain @fr

has President
type: ObjectProperty
comment: Relation between Basketball Team and President
range: president
domain: basketball team
comment: Relazione tra Basketball Team e President @it

soccer league
label: ligue de football @fr
type: Class

national collegiate athletic association athlete
type: Class
label: athlète de la national collegiate athletic association @fr

has Military Person
comment: Relazione tra Basketball Team e Military Person @it
domain: basketball team
comment: Relation between Basketball Team and Military Person
range: military person
type: ObjectProperty

has Senator
comment: Relation between Basketball Team and Senator
comment: Relazione tra Basketball Team e Senator @it
type: ObjectProperty
domain: basketball team
range: senator

has Rugby Player
comment: Relazione tra Basketball Team e Rugby Player @it
range: rugby player
comment: Relation between Basketball Team and Rugby Player
type: ObjectProperty
domain: basketball team

has Scientist
domain: basketball team
comment: Relation between Basketball Team and Scientist
comment: Relazione tra Basketball Team e Scientist @it
range: scientist
type: ObjectProperty

has River
range: river
domain: basketball team
comment: Relazione tra Basketball Team e River @it
type: ObjectProperty
comment: Relation between Basketball Team and River

has Award
domain: basketball team
comment: Relation between Basketball Team and Award
comment: Relazione tra Basketball Team e Award @it
type: ObjectProperty
range: award

has Colour
related match: colors
comment: Relazione tra Basketball Team e Colour @it
comment: Relation between Basketball Team and Colour
type: ObjectProperty
domain: basketball team
range: colour

has School
related match: arena
comment: Relation between Basketball Team and School
range: school
domain: basketball team
comment: Relazione tra Basketball Team e School @it
type: ObjectProperty

has Currency
range: currency
type: ObjectProperty
domain: basketball team
comment: Relation between Basketball Team and Currency
comment: Relazione tra Basketball Team e Currency @it

mayor
label: maire @fr
type: Class

Ontology
has intent: To represent the encyclopedic knowledge expressed by an object typed as BasketballTeam
has author: Andrea Giovanni Nuzzolese
extracted from: dbpedia.org
has author: Valentina Presutti
extracted from: en.wikipedia.org
comment: BasketballTeam Encyclopedic Knowledge Pattern
imports: cpannotationschema.owl
has author: Aldo Gangemi

has Island
comment: Relation between Basketball Team and Island
type: ObjectProperty
range: island
domain: basketball team
comment: Relazione tra Basketball Team e Island @it

pope
type: Class
label: pape @fr

has Mammal
domain: basketball team
range: mammal
comment: Relation between Basketball Team and Mammal
comment: Relazione tra Basketball Team e Mammal @it
type: ObjectProperty

has Journalist
comment: Relation between Basketball Team and Journalist
domain: basketball team
range: journalist
comment: Relazione tra Basketball Team e Journalist @it
type: ObjectProperty

senator
type: Class
label: sénateur @fr

comedian
label: comédien @fr
type: Class

has Non- Profit Organisation
type: ObjectProperty
domain: basketball team
comment: Relation between Basketball Team and Non- Profit Organisation
range: non-profit organisation
comment: Relazione tra Basketball Team e Non- Profit Organisation @it

has Formula One Racer
range: Formula One racer
type: ObjectProperty
comment: Relazione tra Basketball Team e Formula One Racer @it
comment: Relation between Basketball Team and Formula One Racer
domain: basketball team

song
label: chanson @fr
type: Class

newspaper
label: journal @fr
type: Class

game
label: jeu @fr
type: Class

protected area
label: aire protégée @fr
label: προστατευμένη περιοχή @el
type: Class

road
label: route @fr
type: Class

has Airline
comment: Relation between Basketball Team and Airline
type: ObjectProperty
comment: Relazione tra Basketball Team e Airline @it
domain: basketball team
range: airline

has Musical Artist
domain: basketball team
type: ObjectProperty
comment: Relazione tra Basketball Team e Musical Artist @it
comment: Relation between Basketball Team and Musical Artist
range: musical artist
related match: owner

has Writer
comment: Relazione tra Basketball Team e Writer @it
domain: basketball team
comment: Relation between Basketball Team and Writer
range: writer
type: ObjectProperty

judge
label: juge @fr
type: Class

has Soccer Club
range: soccer club
comment: Relation between Basketball Team and Soccer Club
type: ObjectProperty
comment: Relazione tra Basketball Team e Soccer Club @it
domain: basketball team

World Heritage Site
type: Class
label: site du patrimoine mondial @fr

has World Heritage Site
type: ObjectProperty
comment: Relation between Basketball Team and World Heritage Site
range: World Heritage Site
domain: basketball team
comment: Relazione tra Basketball Team e World Heritage Site @it

has American Football Team
domain: basketball team
comment: Relazione tra Basketball Team e American Football Team @it
comment: Relation between Basketball Team and American Football Team
type: ObjectProperty
range: american football team

has American Football League
comment: Relazione tra Basketball Team e American Football League @it
domain: basketball team
range: american football league
comment: Relation between Basketball Team and American Football League
type: ObjectProperty

language
type: Class
label: langage @fr

non-profit organisation
label: organisation à but non lucratif @fr
type: Class

has Hockey Team
range: hockey team
comment: Relazione tra Basketball Team e Hockey Team @it
comment: Relation between Basketball Team and Hockey Team
domain: basketball team
type: ObjectProperty

lake
label: lac @fr
type: Class

Axiom
matching quantification: 1
annotated source: has Musical Artist
annotated target: owner

has Pope
comment: Relation between Basketball Team and Pope
type: ObjectProperty
range: pope
comment: Relazione tra Basketball Team e Pope @it
domain: basketball team

software
type: Class
label: logiciel @fr

has Radio Station
type: ObjectProperty
comment: Relazione tra Basketball Team e Radio Station @it
domain: basketball team
comment: Relation between Basketball Team and Radio Station
range: radio station

has Cricketer
comment: Relation between Basketball Team and Cricketer
type: ObjectProperty
range: cricketer
comment: Relazione tra Basketball Team e Cricketer @it
domain: basketball team

has Beverage
type: ObjectProperty
domain: basketball team
comment: Relazione tra Basketball Team e Beverage @it
range: beverage
comment: Relation between Basketball Team and Beverage

has Disease
type: ObjectProperty
comment: Relazione tra Basketball Team e Disease @it
comment: Relation between Basketball Team and Disease
range: disease
domain: basketball team

river
label: rivière @fr
type: Class

has College Coach
comment: Relazione tra Basketball Team e College Coach @it
range: college coach
domain: basketball team
type: ObjectProperty
comment: Relation between Basketball Team and College Coach

has Protected Area
comment: Relazione tra Basketball Team e Protected Area @it
type: ObjectProperty
comment: Relation between Basketball Team and Protected Area
range: protected area
domain: basketball team

magazine
type: Class
label: περιοδικό @el

school
label: école @fr
type: Class

museum
label: musée @fr
type: Class

has Game
comment: Relazione tra Basketball Team e Game @it
domain: basketball team
type: ObjectProperty
comment: Relation between Basketball Team and Game
range: game

has Language
domain: basketball team
comment: Relazione tra Basketball Team e Language @it
comment: Relation between Basketball Team and Language
range: language
type: ObjectProperty

trade union
type: Class
label: syndicat professionnel @fr

military person
type: Class
label: militaire @fr

has Museum
comment: Relazione tra Basketball Team e Museum @it
comment: Relation between Basketball Team and Museum
range: museum
domain: basketball team
type: ObjectProperty

award
type: Class
label: récompense @fr

currency
label: devise @fr
type: Class

has Continent
domain: basketball team
range: continent
comment: Relazione tra Basketball Team e Continent @it
comment: Relation between Basketball Team and Continent
type: ObjectProperty

Axiom
matching quantification: 2
annotated source: has Town
annotated target: location

prime minister
type: Class
label: premier ministre @fr

historic place
type: Class
label: site historique @fr

cricketer
type: Class
label: joueur de cricket @fr

Axiom
matching quantification: 4
annotated target: colors
annotated source: has Colour

Band
label: groupe de musique @fr
type: Class
label: Musikgruppe @de
label: banda @pt

town
label: ville @fr
type: Class

has Town
type: ObjectProperty
comment: Relazione tra Basketball Team e Town @it
comment: Relation between Basketball Team and Town
domain: basketball team
range: town
related match: location

university
label: πανεπιστήμιο @el
label: université @fr
type: Class

has Baseball League
domain: basketball team
range: baseball league
type: ObjectProperty
comment: Relazione tra Basketball Team e Baseball League @it
comment: Relation between Basketball Team and Baseball League

has Prime Minister
type: ObjectProperty
range: prime minister
comment: Relation between Basketball Team and Prime Minister
domain: basketball team
comment: Relazione tra Basketball Team e Prime Minister @it

continent
type: Class
label: ήπειρος @el

has University
range: university
comment: Relation between Basketball Team and University
comment: Relazione tra Basketball Team e University @it
domain: basketball team
type: ObjectProperty

ethnic group
type: Class
label: groupe ethnique @fr

president
label: président @fr
type: Class

album
type: Class
label: Album @de

has American Football Player
range: american football player
comment: Relation between Basketball Team and American Football Player
domain: basketball team
type: ObjectProperty
comment: Relazione tra Basketball Team e American Football Player @it

has Newspaper
range: newspaper
type: ObjectProperty
domain: basketball team
comment: Relazione tra Basketball Team e Newspaper @it
comment: Relation between Basketball Team and Newspaper

military unit
label: unité militaire @fr
type: Class

college coach
type: Class
label: entraîneur universitaire @fr

has Lake
comment: Relazione tra Basketball Team e Lake @it
domain: basketball team
comment: Relation between Basketball Team and Lake
range: lake
type: ObjectProperty

has National Collegiate Athletic Association Athlete
comment: Relazione tra Basketball Team e National Collegiate Athletic Association Athlete @it
comment: Relation between Basketball Team and National Collegiate Athletic Association Athlete
range: national collegiate athletic association athlete
type: ObjectProperty
domain: basketball team

basketball team
type: Class

has Military Unit
range: military unit
comment: Relazione tra Basketball Team e Military Unit @it
domain: basketball team
comment: Relation between Basketball Team and Military Unit
type: ObjectProperty

ice hockey league
type: Class
label: ligue d'hockey sur glace @fr

has Song
range: song
comment: Relazione tra Basketball Team e Song @it
domain: basketball team
type: ObjectProperty
comment: Relation between Basketball Team and Song

has Plant
range: plant
comment: Relation between Basketball Team and Plant
domain: basketball team
comment: Relazione tra Basketball Team e Plant @it
type: ObjectProperty

soccer club
type: Class
label: club de football @fr

music genre
label: genre musical @fr
label: género musical @pt
type: Class

writer
label: écrivain @fr
type: Class

has Historic Place
comment: Relazione tra Basketball Team e Historic Place @it
comment: Relation between Basketball Team and Historic Place
type: ObjectProperty
range: historic place
domain: basketball team

has Military Conflict
comment: Relation between Basketball Team and Military Conflict
domain: basketball team
comment: Relazione tra Basketball Team e Military Conflict @it
type: ObjectProperty
range: military conflict

baseball player
label: joueur de baseball @fr
type: Class

office holder
label: titulaire @fr
type: Class
label: Amtsinhaber @de

military conflict
label: conflit militaire @fr
type: Class

has Aircraft
range: aircraft
comment: Relazione tra Basketball Team e Aircraft @it
type: ObjectProperty
domain: basketball team
comment: Relation between Basketball Team and Aircraft

has Olympics
range: olympics
type: ObjectProperty
domain: basketball team
comment: Relazione tra Basketball Team e Olympics @it
comment: Relation between Basketball Team and Olympics

has Mountain Range
range: mountain range
domain: basketball team
comment: Relazione tra Basketball Team e Mountain Range @it
type: ObjectProperty
comment: Relation between Basketball Team and Mountain Range

ice hockey player
label: joueur de hockey sur glace @fr
type: Class

has Ethnic Group
comment: Relazione tra Basketball Team e Ethnic Group @it
type: ObjectProperty
range: ethnic group
domain: basketball team
comment: Relation between Basketball Team and Ethnic Group

has Ice Hockey League
domain: basketball team
comment: Relation between Basketball Team and Ice Hockey League
type: ObjectProperty
comment: Relazione tra Basketball Team e Ice Hockey League @it
range: ice hockey league

mountain range
label: chaîne de montagne @fr
type: Class

has Actor
comment: Relazione tra Basketball Team e Actor @it
comment: Relation between Basketball Team and Actor
domain: basketball team
range: actor
type: ObjectProperty

beverage
label: boisson @fr
type: Class

has Magazine
comment: Relazione tra Basketball Team e Magazine @it
type: ObjectProperty
range: magazine
domain: basketball team
comment: Relation between Basketball Team and Magazine

comics creator
label: créateur de bandes dessinées @fr
type: Class

has Soccer League
comment: Relazione tra Basketball Team e Soccer League @it
domain: basketball team
comment: Relation between Basketball Team and Soccer League
range: soccer league
type: ObjectProperty

aircraft
label: avion @fr
type: Class
label: αεροσκάφος @el

has Office Holder
comment: Relazione tra Basketball Team e Office Holder @it
type: ObjectProperty
range: office holder
domain: basketball team
comment: Relation between Basketball Team and Office Holder

hockey team
label: équipe de hockey @fr
type: Class

soccer player
label: joueur de football @fr
type: Class

scientist
label: scientifique @fr
type: Class
label: Wissenschaftler @de

legislature
type: Class
label: pouvoir législatif @fr

has Road
type: ObjectProperty
comment: Relation between Basketball Team and Road
domain: basketball team
range: road
comment: Relazione tra Basketball Team e Road @it

has Nascar Driver
range: nascar driver
comment: Relazione tra Basketball Team e Nascar Driver @it
comment: Relation between Basketball Team and Nascar Driver
type: ObjectProperty
domain: basketball team

airline
type: Class
label: compagnie aérienne @fr

olympics
type: Class
label: Jeux Olympiques @fr

has Legislature
type: ObjectProperty
comment: Relazione tra Basketball Team e Legislature @it
domain: basketball team
range: legislature
comment: Relation between Basketball Team and Legislature

baseball league
label: ligue de baseball @fr
type: Class

nascar driver
type: Class
label: pilote de la nascar @fr

journalist
label: journaliste @fr
type: Class

plant
label: plante @fr
type: Class

broadcast
label: Émission de télévision @fr
type: Class

film
label: ταινία @el
type: Class

mammal
label: mammifère @fr
type: Class

has Trade Union
range: trade union
comment: Relazione tra Basketball Team e Trade Union @it
domain: basketball team
comment: Relation between Basketball Team and Trade Union
type: ObjectProperty

american football team
type: Class
label: équipe américaine de football américain @fr

island
type: Class
label: νησί @el
label: île @fr

has Broadcast
domain: basketball team
comment: Relazione tra Basketball Team e Broadcast @it
range: broadcast
comment: Relation between Basketball Team and Broadcast
type: ObjectProperty

has Mayor
type: ObjectProperty
domain: basketball team
range: mayor
comment: Relation between Basketball Team and Mayor
comment: Relazione tra Basketball Team e Mayor @it

Formula One racer
type: Class
label: pilote de formule 1 @fr

has Album
domain: basketball team
comment: Relation between Basketball Team and Album
type: ObjectProperty
comment: Relazione tra Basketball Team e Album @it
range: album

has Comics Creator
comment: Relation between Basketball Team and Comics Creator
range: comics creator
comment: Relazione tra Basketball Team e Comics Creator @it
domain: basketball team
type: ObjectProperty

radio station
label: station de radio @fr
type: Class

bone
label: os @fr
label: Knochen @de
type: Class

has Television Show
range: television show
comment: Relation between Basketball Team and Television Show
comment: Relazione tra Basketball Team e Television Show @it
domain: basketball team
type: ObjectProperty

has Comedian
type: ObjectProperty
comment: Relazione tra Basketball Team e Comedian @it
comment: Relation between Basketball Team and Comedian
domain: basketball team
range: comedian

has Ice Hockey Player
range: ice hockey player
comment: Relation between Basketball Team and Ice Hockey Player
domain: basketball team
comment: Relazione tra Basketball Team e Ice Hockey Player @it
type: ObjectProperty

musical artist
label: musicien @fr
type: Class
label: artista musical @pt

Axiom
matching quantification: 1
annotated target: arena
annotated source: has School