has World Heritage Site
related match: placeOfBurial
range: World Heritage Site
type: ObjectProperty
comment: Relazione tra British Royalty e World Heritage Site @it
comment: Relation between British Royalty and World Heritage Site
domain: British royalty

television show
type: Class
label: émission de télévision @fr

has Insect
type: ObjectProperty
range: insect
domain: British royalty
comment: Relazione tra British Royalty e Insect @it
comment: Relation between British Royalty and Insect

has Prime Minister
related match: before
related match: predecessor
comment: Relation between British Royalty and Prime Minister
type: ObjectProperty
domain: British royalty
related match: successor
related match: after
range: prime minister
comment: Relazione tra British Royalty e Prime Minister @it

has River
comment: Relation between British Royalty and River
domain: British royalty
type: ObjectProperty
comment: Relazione tra British Royalty e River @it
range: river

colour
label: χρώμα @el
label: couleur @fr
type: Class

automobile
type: Class

Election
label: élection @fr
type: Class

has Model
range: model
type: ObjectProperty
comment: Relazione tra British Royalty e Model @it
comment: Relation between British Royalty and Model
domain: British royalty

stadium
type: Class
label: stade @fr

soccer league
label: ligue de football @fr
type: Class

has Website
range: website
comment: Relazione tra British Royalty e Website @it
domain: British royalty
comment: Relation between British Royalty and Website
type: ObjectProperty

Axiom
annotated source: has Military Person
annotated target: spouse
matching quantification: 2

has Journalist
type: ObjectProperty
comment: Relation between British Royalty and Journalist
domain: British royalty
comment: Relazione tra British Royalty e Journalist @it
range: journalist

has Beverage
comment: Relazione tra British Royalty e Beverage @it
comment: Relation between British Royalty and Beverage
range: beverage
domain: British royalty
type: ObjectProperty

has Broadcast
domain: British royalty
type: ObjectProperty
comment: Relazione tra British Royalty e Broadcast @it
range: broadcast
comment: Relation between British Royalty and Broadcast

has Historic Building
comment: Relation between British Royalty and Historic Building
domain: British royalty
range: historic building
type: ObjectProperty
comment: Relazione tra British Royalty e Historic Building @it

has College
domain: British royalty
type: ObjectProperty
comment: Relation between British Royalty and College
comment: Relazione tra British Royalty e College @it
range: college

Site of Special Scientific Interest
type: Class
label: site d'intérêt scientifique particulier @fr

mayor
label: maire @fr
type: Class

pope
type: Class
label: pape @fr

species
label: espèce @fr
type: Class

has Ship
type: ObjectProperty
domain: British royalty
comment: Relation between British Royalty and Ship
range: ship
comment: Relazione tra British Royalty e Ship @it

has Christian Bishop
comment: Relazione tra British Royalty e Christian Bishop @it
comment: Relation between British Royalty and Christian Bishop
type: ObjectProperty
range: Christian Bishop
domain: British royalty
related match: issue

has Television Episode
comment: Relation between British Royalty and Television Episode
comment: Relazione tra British Royalty e Television Episode @it
range: television episode
type: ObjectProperty
domain: British royalty

has Book
range: book
domain: British royalty
comment: Relation between British Royalty and Book
comment: Relazione tra British Royalty e Book @it
type: ObjectProperty
related match: novels

has Military Unit
domain: British royalty
range: military unit
type: ObjectProperty
comment: Relation between British Royalty and Military Unit
comment: Relazione tra British Royalty e Military Unit @it
related match: title

newspaper
label: journal @fr
type: Class

Axiom
annotated target: next
matching quantification: 1
annotated source: has President

game
label: jeu @fr
type: Class

protected area
type: Class
label: προστατευμένη περιοχή @el
label: aire protégée @fr

has Cricketer
type: ObjectProperty
range: cricketer
comment: Relazione tra British Royalty e Cricketer @it
comment: Relation between British Royalty and Cricketer
domain: British royalty

has Musical Artist
comment: Relazione tra British Royalty e Musical Artist @it
domain: British royalty
type: ObjectProperty
range: musical artist
comment: Relation between British Royalty and Musical Artist

road
type: Class
label: route @fr

ginkgo
type: Class

judge
type: Class
label: juge @fr

has Radio Station
comment: Relazione tra British Royalty e Radio Station @it
type: ObjectProperty
comment: Relation between British Royalty and Radio Station
domain: British royalty
range: radio station

has Weapon
comment: Relation between British Royalty and Weapon
comment: Relazione tra British Royalty e Weapon @it
range: weapon
domain: British royalty
type: ObjectProperty

World Heritage Site
label: site du patrimoine mondial @fr
type: Class

has Skyscraper
comment: Relation between British Royalty and Skyscraper
domain: British royalty
range: skyscraper
comment: Relazione tra British Royalty e Skyscraper @it
type: ObjectProperty

Axiom
annotated target: issue
matching quantification: 8
annotated source: has Saint

station
type: Class

has Mountain Range
comment: Relation between British Royalty and Mountain Range
comment: Relazione tra British Royalty e Mountain Range @it
domain: British royalty
range: mountain range
type: ObjectProperty

has Drug
comment: Relazione tra British Royalty e Drug @it
range: drug
type: ObjectProperty
comment: Relation between British Royalty and Drug
domain: British royalty

lake
label: lac @fr
type: Class

has Island
comment: Relazione tra British Royalty e Island @it
range: island
comment: Relation between British Royalty and Island
type: ObjectProperty
domain: British royalty

has Music Genre
type: ObjectProperty
domain: British royalty
comment: Relazione tra British Royalty e Music Genre @it
comment: Relation between British Royalty and Music Genre
range: music genre

governor
label: gouverneur @fr
type: Class

has Ski Area
type: ObjectProperty
comment: Relation between British Royalty and Ski Area
comment: Relazione tra British Royalty e Ski Area @it
domain: British royalty
range: ski area

Axiom
matching quantification: 1
annotated target: after
annotated source: has Scientist

river
type: Class
label: rivière @fr

has Bone
comment: Relazione tra British Royalty e Bone @it
type: ObjectProperty
comment: Relation between British Royalty and Bone
range: bone
domain: British royalty

Ontology
has author: Andrea Giovanni Nuzzolese
extracted from: dbpedia.org
extracted from: en.wikipedia.org
has author: Valentina Presutti
comment: BritishRoyalty Encyclopedic Knowledge Pattern
has intent: To represent the encyclopedic knowledge expressed by an object typed as BritishRoyalty
imports: cpannotationschema.owl
has author: Aldo Gangemi

school
type: Class
label: école @fr

ship
label: navire @fr
type: Class

museum
label: musée @fr
type: Class

fish
type: Class
label: poisson @fr

tennis player
type: Class
label: joueur de tennis @fr

Axiom
annotated source: has Saint
annotated target: before
matching quantification: 3

has Soccer Manager
type: ObjectProperty
comment: Relation between British Royalty and Soccer Manager
domain: British royalty
comment: Relazione tra British Royalty e Soccer Manager @it
range: soccer manager

video game
type: Class
label: jeux vidéo @fr

has Ambassador
type: ObjectProperty
domain: British royalty
comment: Relazione tra British Royalty e Ambassador @it
range: ambassador
comment: Relation between British Royalty and Ambassador

has Shopping Mall
type: ObjectProperty
range: shopping mall
domain: British royalty
comment: Relazione tra British Royalty e Shopping Mall @it
comment: Relation between British Royalty and Shopping Mall

trade union
type: Class
label: syndicat professionnel @fr

currency
label: devise @fr
type: Class

has Adult Actor
type: ObjectProperty
comment: Relazione tra British Royalty e Adult Actor @it
domain: British royalty
range: adult actor
comment: Relation between British Royalty and Adult Actor

prime minister
label: premier ministre @fr
type: Class

British royalty
label: royauté Britannique @fr
type: Class

has Historic Place
domain: British royalty
comment: Relation between British Royalty and Historic Place
type: ObjectProperty
range: historic place
comment: Relazione tra British Royalty e Historic Place @it

historic place
type: Class
label: site historique @fr

hospital
type: Class
label: hôpital @fr

lunar crater
label: cratère lunaire @fr
type: Class

Axiom
annotated source: has Saint
matching quantification: 2
annotated target: regent

continent
type: Class
label: ήπειρος @el

has Baseball Player
type: ObjectProperty
comment: Relation between British Royalty and Baseball Player
range: baseball player
domain: British royalty
comment: Relazione tra British Royalty e Baseball Player @it

president
label: président @fr
type: Class

album
type: Class
label: Album @de

figure skater
type: Class
label: patineur artistique @fr

has Game
comment: Relazione tra British Royalty e Game @it
comment: Relation between British Royalty and Game
domain: British royalty
range: game
type: ObjectProperty

has Criminal
type: ObjectProperty
comment: Relazione tra British Royalty e Criminal @it
comment: Relation between British Royalty and Criminal
domain: British royalty
range: criminal

has Lake
domain: British royalty
comment: Relation between British Royalty and Lake
comment: Relazione tra British Royalty e Lake @it
type: ObjectProperty
range: lake

military unit
type: Class
label: unité militaire @fr

has Chancellor
domain: British royalty
comment: Relazione tra British Royalty e Chancellor @it
type: ObjectProperty
comment: Relation between British Royalty and Chancellor
range: chancellor

has Video Game
comment: Relation between British Royalty and Video Game
range: video game
domain: British royalty
type: ObjectProperty
comment: Relazione tra British Royalty e Video Game @it

soccer manager
label: entraîneur de football @fr
type: Class

Axiom
matching quantification: 1
annotated target: issue
annotated source: has Christian Bishop

has Architect
comment: Relazione tra British Royalty e Architect @it
comment: Relation between British Royalty and Architect
type: ObjectProperty
range: architect
domain: British royalty

music genre
type: Class
label: género musical @pt
label: genre musical @fr

has Member Of Parliament
comment: Relation between British Royalty and Member Of Parliament
range: member of parliament
type: ObjectProperty
comment: Relazione tra British Royalty e Member Of Parliament @it
domain: British royalty

Axiom
annotated source: has Prime Minister
matching quantification: 2
annotated target: before

has Fern
type: ObjectProperty
domain: British royalty
range: fern
comment: Relazione tra British Royalty e Fern @it
comment: Relation between British Royalty and Fern

writer
label: écrivain @fr
type: Class

has Comics Character
comment: Relation between British Royalty and Comics Character
comment: Relazione tra British Royalty e Comics Character @it
type: ObjectProperty
range: comics character
domain: British royalty

has Space Station
comment: Relazione tra British Royalty e Space Station @it
comment: Relation between British Royalty and Space Station
range: space station
type: ObjectProperty
domain: British royalty

architect
type: Class
label: architecte @fr

has Award
comment: Relazione tra British Royalty e Award @it
comment: Relation between British Royalty and Award
type: ObjectProperty
range: award
domain: British royalty

has Mammal
type: ObjectProperty
comment: Relation between British Royalty and Mammal
domain: British royalty
range: mammal
comment: Relazione tra British Royalty e Mammal @it

model
label: mannequin @fr
type: Class

ambassador
label: ambassadeur @fr
type: Class

has Non- Profit Organisation
domain: British royalty
range: non-profit organisation
comment: Relazione tra British Royalty e Non- Profit Organisation @it
type: ObjectProperty
comment: Relation between British Royalty and Non- Profit Organisation

crustacean
label: crustacés @fr
type: Class

olympic result
type: Class
label: résultat de Jeux Olympiques @fr

has Rugby Player
range: rugby player
type: ObjectProperty
domain: British royalty
comment: Relazione tra British Royalty e Rugby Player @it
comment: Relation between British Royalty and Rugby Player

film festival
label: festival du film @fr
type: Class

has Chemical Compound
domain: British royalty
comment: Relation between British Royalty and Chemical Compound
type: ObjectProperty
range: chemical compound
comment: Relazione tra British Royalty e Chemical Compound @it

has Airline
comment: Relazione tra British Royalty e Airline @it
range: airline
comment: Relation between British Royalty and Airline
type: ObjectProperty
domain: British royalty

has Colour
range: colour
comment: Relazione tra British Royalty e Colour @it
domain: British royalty
type: ObjectProperty
comment: Relation between British Royalty and Colour

Axiom
annotated target: placeOfBurial
annotated source: has World Heritage Site
matching quantification: 2

Grand Prix
type: Class
label: grand prix @fr

has Currency
type: ObjectProperty
comment: Relation between British Royalty and Currency
domain: British royalty
range: currency
comment: Relazione tra British Royalty e Currency @it

has Park
range: park
comment: Relation between British Royalty and Park
comment: Relazione tra British Royalty e Park @it
domain: British royalty
type: ObjectProperty

chancellor
type: Class
label: chancelier @fr

comics creator
label: créateur de bandes dessinées @fr
type: Class

aircraft
label: αεροσκάφος @el
type: Class
label: avion @fr

has Musical
domain: British royalty
comment: Relation between British Royalty and Musical
type: ObjectProperty
range: musical
comment: Relazione tra British Royalty e Musical @it

has Film
comment: Relation between British Royalty and Film
range: film
comment: Relazione tra British Royalty e Film @it
domain: British royalty
type: ObjectProperty

soccer player
label: joueur de football @fr
type: Class

reptile
type: Class

legislature
label: pouvoir législatif @fr
type: Class

airline
label: compagnie aérienne @fr
type: Class

has Ice Hockey League
range: ice hockey league
type: ObjectProperty
comment: Relazione tra British Royalty e Ice Hockey League @it
domain: British royalty
comment: Relation between British Royalty and Ice Hockey League

congressman
type: Class
label: membre du Congrès @fr

nascar driver
label: pilote de la nascar @fr
type: Class

has Comedian
type: ObjectProperty
range: comedian
domain: British royalty
comment: Relazione tra British Royalty e Comedian @it
comment: Relation between British Royalty and Comedian

journalist
label: journaliste @fr
type: Class

has Site Of Special Scientific Interest
type: ObjectProperty
domain: British royalty
comment: Relation between British Royalty and Site Of Special Scientific Interest
range: Site of Special Scientific Interest
comment: Relazione tra British Royalty e Site Of Special Scientific Interest @it

insect
label: insecte @fr
type: Class

has Road
comment: Relazione tra British Royalty e Road @it
type: ObjectProperty
range: road
comment: Relation between British Royalty and Road
domain: British royalty

film
type: Class
label: ταινία @el

bird
label: oiseau @fr
type: Class

chemical compound
type: Class
label: produit chimique @fr

has Aircraft
domain: British royalty
range: aircraft
type: ObjectProperty
comment: Relation between British Royalty and Aircraft
comment: Relazione tra British Royalty e Aircraft @it

has Sport
comment: Relazione tra British Royalty e Sport @it
range: sport
comment: Relation between British Royalty and Sport
type: ObjectProperty
domain: British royalty

has Grape
range: grape
comment: Relation between British Royalty and Grape
type: ObjectProperty
domain: British royalty
comment: Relazione tra British Royalty e Grape @it

has Olympics
related match: years
comment: Relazione tra British Royalty e Olympics @it
domain: British royalty
type: ObjectProperty
range: olympics
comment: Relation between British Royalty and Olympics

has Planet
range: planet
domain: British royalty
comment: Relation between British Royalty and Planet
type: ObjectProperty
comment: Relazione tra British Royalty e Planet @it

fern
type: Class
label: fougères @fr

musical artist
label: musicien @fr
type: Class
label: artista musical @pt

has Pope
comment: Relazione tra British Royalty e Pope @it
comment: Relation between British Royalty and Pope
domain: British royalty
range: pope
type: ObjectProperty

has Magazine
comment: Relation between British Royalty and Magazine
comment: Relazione tra British Royalty e Magazine @it
domain: British royalty
type: ObjectProperty
range: magazine

has Soccer League
range: soccer league
comment: Relation between British Royalty and Soccer League
comment: Relazione tra British Royalty e Soccer League @it
type: ObjectProperty
domain: British royalty

has Continent
domain: British royalty
comment: Relation between British Royalty and Continent
range: continent
comment: Relazione tra British Royalty e Continent @it
type: ObjectProperty

has Governor
related match: before
related match: issue
type: ObjectProperty
domain: British royalty
range: governor
comment: Relation between British Royalty and Governor
comment: Relazione tra British Royalty e Governor @it

has Village
type: ObjectProperty
comment: Relazione tra British Royalty e Village @it
comment: Relation between British Royalty and Village
domain: British royalty
range: village

has Writer
related match: spouse
comment: Relation between British Royalty and Writer
range: writer
domain: British royalty
comment: Relazione tra British Royalty e Writer @it
type: ObjectProperty

has Ethnic Group
comment: Relation between British Royalty and Ethnic Group
domain: British royalty
type: ObjectProperty
comment: Relazione tra British Royalty e Ethnic Group @it
range: ethnic group

has Music Festival
type: ObjectProperty
domain: British royalty
comment: Relation between British Royalty and Music Festival
comment: Relazione tra British Royalty e Music Festival @it
range: music festival

has Stadium
type: ObjectProperty
comment: Relation between British Royalty and Stadium
range: stadium
domain: British royalty
comment: Relazione tra British Royalty e Stadium @it

park
label: parc @fr
type: Class

Axiom
annotated target: title
matching quantification: 5
annotated source: has University

cardinal
type: Class

rugby player
label: joueur de rugby @fr
type: Class

has University
range: university
comment: Relazione tra British Royalty e University @it
type: ObjectProperty
comment: Relation between British Royalty and University
domain: British royalty
related match: title

has Hotel
range: hotel
comment: Relazione tra British Royalty e Hotel @it
type: ObjectProperty
domain: British royalty
comment: Relation between British Royalty and Hotel

musical
label: musique @fr
type: Class

has Formula One Racer
comment: Relation between British Royalty and Formula One Racer
type: ObjectProperty
domain: British royalty
comment: Relazione tra British Royalty e Formula One Racer @it
range: Formula One racer

Axiom
annotated target: after
annotated source: has Saint
matching quantification: 5

has Cardinal
domain: British royalty
range: cardinal
type: ObjectProperty
comment: Relazione tra British Royalty e Cardinal @it
comment: Relation between British Royalty and Cardinal

has Museum
range: museum
comment: Relazione tra British Royalty e Museum @it
comment: Relation between British Royalty and Museum
type: ObjectProperty
domain: British royalty

has Figure Skater
range: figure skater
comment: Relation between British Royalty and Figure Skater
comment: Relazione tra British Royalty e Figure Skater @it
domain: British royalty
type: ObjectProperty

has Canal
range: canal
type: ObjectProperty
comment: Relation between British Royalty and Canal
domain: British royalty
comment: Relazione tra British Royalty e Canal @it

has Mayor
comment: Relazione tra British Royalty e Mayor @it
range: mayor
domain: British royalty
type: ObjectProperty
comment: Relation between British Royalty and Mayor

has Tennis Player
comment: Relation between British Royalty and Tennis Player
domain: British royalty
type: ObjectProperty
range: tennis player
comment: Relazione tra British Royalty e Tennis Player @it

Axiom
matching quantification: 8
annotated target: after
annotated source: has President

mountain
label: Βουνό @el
label: montagne @fr
type: Class

criminal
type: Class
label: criminel @fr

senator
label: sénateur @fr
type: Class

has Senator
comment: Relazione tra British Royalty e Senator @it
type: ObjectProperty
domain: British royalty
comment: Relation between British Royalty and Senator
range: senator

saint
type: Class

has Band
comment: Relazione tra British Royalty e Band @it
domain: British royalty
range: Band
comment: Relation between British Royalty and Band
type: ObjectProperty

has Mollusca
domain: British royalty
type: ObjectProperty
comment: Relazione tra British Royalty e Mollusca @it
comment: Relation between British Royalty and Mollusca
range: mollusca

comedian
label: comédien @fr
type: Class

valley
label: vallée @fr
type: Class

has Valley
comment: Relation between British Royalty and Valley
comment: Relazione tra British Royalty e Valley @it
type: ObjectProperty
range: valley
domain: British royalty

has School
comment: Relazione tra British Royalty e School @it
domain: British royalty
type: ObjectProperty
comment: Relation between British Royalty and School
range: school

has Trade Union
comment: Relation between British Royalty and Trade Union
range: trade union
type: ObjectProperty
comment: Relazione tra British Royalty e Trade Union @it
domain: British royalty

has Crustacean
comment: Relation between British Royalty and Crustacean
comment: Relazione tra British Royalty e Crustacean @it
range: crustacean
domain: British royalty
type: ObjectProperty

book
type: Class
label: livre @fr
label: βιβλίο @el
label: książka @pl
label: llibre @ca

shopping mall
label: centre commercial @fr
type: Class

has Fish
domain: British royalty
range: fish
comment: Relation between British Royalty and Fish
type: ObjectProperty
comment: Relazione tra British Royalty e Fish @it

Axiom
matching quantification: 1
annotated source: has Olympics
annotated target: years

ski area
label: domaine skiable @fr
type: Class

non-profit organisation
label: organisation à but non lucratif @fr
type: Class

has Automobile
type: ObjectProperty
range: automobile
comment: Relazione tra British Royalty e Automobile @it
domain: British royalty
comment: Relation between British Royalty and Automobile

space station
label: station spatiale @fr
type: Class

Axiom
matching quantification: 1
annotated target: reason
annotated source: has President

mollusca
type: Class
label: mollusque @fr

has Congressman
comment: Relazione tra British Royalty e Congressman @it
type: ObjectProperty
comment: Relation between British Royalty and Congressman
domain: British royalty
range: congressman

has Television Show
range: television show
comment: Relazione tra British Royalty e Television Show @it
type: ObjectProperty
comment: Relation between British Royalty and Television Show
domain: British royalty

wine region
type: Class
label: région viticole @fr

weapon
label: arme @fr
type: Class

has Mountain
comment: Relation between British Royalty and Mountain
range: mountain
comment: Relazione tra British Royalty e Mountain @it
type: ObjectProperty
domain: British royalty

drug
type: Class
label: médicament @fr

has Single
comment: Relazione tra British Royalty e Single @it
domain: British royalty
range: single
comment: Relation between British Royalty and Single
type: ObjectProperty

magazine
label: περιοδικό @el
type: Class

has Album
comment: Relazione tra British Royalty e Album @it
range: album
type: ObjectProperty
comment: Relation between British Royalty and Album
domain: British royalty

canal
type: Class

military person
type: Class
label: militaire @fr

has Protected Area
range: protected area
comment: Relazione tra British Royalty e Protected Area @it
type: ObjectProperty
comment: Relation between British Royalty and Protected Area
domain: British royalty

philosopher
type: Class
label: philosophe @fr

award
type: Class
label: récompense @fr

Axiom
annotated target: predecessor
matching quantification: 2
annotated source: has Prime Minister

college
type: Class

sport
type: Class

Axiom
annotated target: novels
annotated source: has Book
matching quantification: 1

cricketer
type: Class
label: joueur de cricket @fr

single
type: Class

Band
label: banda @pt
label: Musikgruppe @de
type: Class
label: groupe de musique @fr

has Ginkgo
domain: British royalty
type: ObjectProperty
range: ginkgo
comment: Relation between British Royalty and Ginkgo
comment: Relazione tra British Royalty e Ginkgo @it

has Legislature
range: legislature
domain: British royalty
comment: Relazione tra British Royalty e Legislature @it
comment: Relation between British Royalty and Legislature
type: ObjectProperty

has Scientist
comment: Relazione tra British Royalty e Scientist @it
range: scientist
domain: British royalty
comment: Relation between British Royalty and Scientist
type: ObjectProperty
related match: after
related match: issue

Axiom
matching quantification: 5
annotated source: has Military Person
annotated target: before

has Reptile
domain: British royalty
comment: Relazione tra British Royalty e Reptile @it
comment: Relation between British Royalty and Reptile
type: ObjectProperty
range: reptile

university
label: πανεπιστήμιο @el
label: université @fr
type: Class

Axiom
annotated target: primeMinisters
matching quantification: 1
annotated source: has President

ethnic group
label: groupe ethnique @fr
type: Class

artery
label: Arterie @de
type: Class
label: artère @fr

has Grand Prix
range: Grand Prix
domain: British royalty
comment: Relazione tra British Royalty e Grand Prix @it
comment: Relation between British Royalty and Grand Prix
type: ObjectProperty

hotel
label: hôtel @fr
type: Class

music festival
type: Class
label: festival de musique @fr

has Hospital
type: ObjectProperty
domain: British royalty
comment: Relazione tra British Royalty e Hospital @it
range: hospital
comment: Relation between British Royalty and Hospital

television episode
label: épisode télévisé @fr
type: Class

Axiom
annotated target: title
matching quantification: 3
annotated source: has Military Unit

village
type: Class
label: χωριό @el

ice hockey league
label: ligue d'hockey sur glace @fr
type: Class

Axiom
annotated target: father
matching quantification: 1
annotated source: has Military Person

has Nascar Driver
comment: Relation between British Royalty and Nascar Driver
range: nascar driver
type: ObjectProperty
comment: Relazione tra British Royalty e Nascar Driver @it
domain: British royalty

soccer club
type: Class
label: club de football @fr

has Lunar Crater
domain: British royalty
type: ObjectProperty
comment: Relazione tra British Royalty e Lunar Crater @it
comment: Relation between British Royalty and Lunar Crater
range: lunar crater

historic building
type: Class
label: bâtiment historique @fr

Axiom
annotated source: has Governor
annotated target: before
matching quantification: 1

has Bridge
comment: Relation between British Royalty and Bridge
range: bridge
type: ObjectProperty
comment: Relazione tra British Royalty e Bridge @it
domain: British royalty

baseball player
type: Class
label: joueur de baseball @fr

Axiom
annotated source: has President
annotated target: before
matching quantification: 1

website
type: Class
label: Ιστότοπος @el
label: site web @fr

grape
type: Class
label: raisin @fr

has Olympic Result
comment: Relazione tra British Royalty e Olympic Result @it
range: olympic result
type: ObjectProperty
comment: Relation between British Royalty and Olympic Result
domain: British royalty

has Saint
related match: spouses
comment: Relazione tra British Royalty e Saint @it
related match: regent
related match: before
range: saint
type: ObjectProperty
related match: after
related match: issue
domain: British royalty
comment: Relation between British Royalty and Saint

adult actor
label: erwachsener Schauspieler @de
type: Class
label: acteur adulte @fr

Axiom
annotated target: issue
matching quantification: 1
annotated source: has Scientist

Axiom
matching quantification: 2
annotated target: issue
annotated source: has President

has Conifer
comment: Relation between British Royalty and Conifer
range: conifer
type: ObjectProperty
comment: Relazione tra British Royalty e Conifer @it
domain: British royalty

mountain range
label: chaîne de montagne @fr
type: Class

Christian Bishop
type: Class
label: évêque chrétien @fr

beverage
type: Class
label: boisson @fr

has President
related match: after
related match: reason
related match: before
related match: next
range: president
type: ObjectProperty
comment: Relazione tra British Royalty e President @it
domain: British royalty
related match: primeMinisters
comment: Relation between British Royalty and President
related match: issue

has Military Person
comment: Relation between British Royalty and Military Person
related match: after
related match: father
related match: issue
range: military person
comment: Relazione tra British Royalty e Military Person @it
type: ObjectProperty
related match: spouse
related match: before
domain: British royalty

Axiom
matching quantification: 9
annotated target: after
annotated source: has Military Person

Axiom
annotated source: has Governor
annotated target: issue
matching quantification: 1

Axiom
annotated source: has Saint
matching quantification: 1
annotated target: spouses

planet
label: planète @fr
type: Class

has Philosopher
range: philosopher
comment: Relation between British Royalty and Philosopher
comment: Relazione tra British Royalty e Philosopher @it
type: ObjectProperty
domain: British royalty

has Film Festival
domain: British royalty
comment: Relation between British Royalty and Film Festival
range: film festival
comment: Relazione tra British Royalty e Film Festival @it
type: ObjectProperty

scientist
label: Wissenschaftler @de
type: Class
label: scientifique @fr

has Airport
comment: Relazione tra British Royalty e Airport @it
type: ObjectProperty
domain: British royalty
comment: Relation between British Royalty and Airport
range: airport

has Judge
domain: British royalty
comment: Relazione tra British Royalty e Judge @it
comment: Relation between British Royalty and Judge
type: ObjectProperty
range: judge

Axiom
matching quantification: 1
annotated target: successor
annotated source: has Prime Minister

olympics
type: Class
label: Jeux Olympiques @fr

bridge
type: Class
label: pont @fr

has Newspaper
comment: Relation between British Royalty and Newspaper
domain: British royalty
comment: Relazione tra British Royalty e Newspaper @it
type: ObjectProperty
range: newspaper

Axiom
matching quantification: 1
annotated target: spouse
annotated source: has Writer

broadcast
type: Class
label: Émission de télévision @fr

Axiom
matching quantification: 9
annotated target: issue
annotated source: has Military Person

mammal
type: Class
label: mammifère @fr

has Comics Creator
range: comics creator
comment: Relazione tra British Royalty e Comics Creator @it
type: ObjectProperty
domain: British royalty
comment: Relation between British Royalty and Comics Creator

has Election
range: Election
type: ObjectProperty
comment: Relation between British Royalty and Election
comment: Relazione tra British Royalty e Election @it
domain: British royalty

island
type: Class
label: νησί @el
label: île @fr

comics character
type: Class
label: personnage de bandes dessinées @fr

has Soccer Player
comment: Relazione tra British Royalty e Soccer Player @it
comment: Relation between British Royalty and Soccer Player
range: soccer player
domain: British royalty
type: ObjectProperty

has Artery
comment: Relation between British Royalty and Artery
range: artery
comment: Relazione tra British Royalty e Artery @it
domain: British royalty
type: ObjectProperty

skyscraper
label: gratte-ciel @fr
type: Class

Formula One racer
label: pilote de formule 1 @fr
type: Class

has Station
domain: British royalty
type: ObjectProperty
comment: Relation between British Royalty and Station
range: station
comment: Relazione tra British Royalty e Station @it

has Bird
domain: British royalty
type: ObjectProperty
range: bird
comment: Relation between British Royalty and Bird
comment: Relazione tra British Royalty e Bird @it

radio station
label: station de radio @fr
type: Class

bone
label: os @fr
label: Knochen @de
type: Class

member of parliament
type: Class
label: membre du Parlement @fr

has Soccer Club
type: ObjectProperty
comment: Relazione tra British Royalty e Soccer Club @it
comment: Relation between British Royalty and Soccer Club
domain: British royalty
range: soccer club

has Wine Region
type: ObjectProperty
comment: Relation between British Royalty and Wine Region
comment: Relazione tra British Royalty e Wine Region @it
domain: British royalty
range: wine region

has Species
comment: Relation between British Royalty and Species
range: species
domain: British royalty
comment: Relazione tra British Royalty e Species @it
type: ObjectProperty

Axiom
annotated target: after
matching quantification: 1
annotated source: has Prime Minister

conifer
type: Class
label: conifères @fr

airport
label: aéroport @fr
label: Flughafen @de
type: Class