rocket
type: Class
label: fusée @fr

television show
label: émission de télévision @fr
type: Class

has Musical Artist
comment: Relazione tra Chemical Compound e Musical Artist @it
type: ObjectProperty
range: musical artist
domain: chemical compound
comment: Relation between Chemical Compound and Musical Artist

has Club Moss
range: club moss
type: ObjectProperty
comment: Relazione tra Chemical Compound e Club Moss @it
comment: Relation between Chemical Compound and Club Moss
domain: chemical compound

automobile
type: Class

colour
label: χρώμα @el
label: couleur @fr
type: Class

has Green Alga
type: ObjectProperty
comment: Relation between Chemical Compound and Green Alga
comment: Relazione tra Chemical Compound e Green Alga @it
range: green alga
domain: chemical compound

Election
label: élection @fr
type: Class

has Mollusca
range: mollusca
domain: chemical compound
comment: Relazione tra Chemical Compound e Mollusca @it
comment: Relation between Chemical Compound and Mollusca
type: ObjectProperty

stadium
type: Class
label: stade @fr

has Stadium
comment: Relation between Chemical Compound and Stadium
range: stadium
domain: chemical compound
type: ObjectProperty
comment: Relazione tra Chemical Compound e Stadium @it

has Election
type: ObjectProperty
comment: Relation between Chemical Compound and Election
comment: Relazione tra Chemical Compound e Election @it
range: Election
domain: chemical compound

has British Royalty
type: ObjectProperty
range: British royalty
comment: Relation between Chemical Compound and British Royalty
comment: Relazione tra Chemical Compound e British Royalty @it
domain: chemical compound

has World Heritage Site
comment: Relazione tra Chemical Compound e World Heritage Site @it
type: ObjectProperty
domain: chemical compound
range: World Heritage Site
comment: Relation between Chemical Compound and World Heritage Site

amphibian
type: Class
label: amphibien @fr

pope
type: Class
label: pape @fr

has Crustacean
comment: Relazione tra Chemical Compound e Crustacean @it
range: crustacean
type: ObjectProperty
domain: chemical compound
comment: Relation between Chemical Compound and Crustacean

newspaper
label: journal @fr
type: Class

protected area
type: Class
label: προστατευμένη περιοχή @el
label: aire protégée @fr

ginkgo
type: Class

has Colour
type: ObjectProperty
range: colour
comment: Relation between Chemical Compound and Colour
comment: Relazione tra Chemical Compound e Colour @it
domain: chemical compound

World Heritage Site
label: site du patrimoine mondial @fr
type: Class

has Book
comment: Relation between Chemical Compound and Book
comment: Relazione tra Chemical Compound e Book @it
domain: chemical compound
range: book
type: ObjectProperty

has Artery
type: ObjectProperty
domain: chemical compound
comment: Relation between Chemical Compound and Artery
range: artery
comment: Relazione tra Chemical Compound e Artery @it

has Skyscraper
range: skyscraper
type: ObjectProperty
comment: Relation between Chemical Compound and Skyscraper
domain: chemical compound
comment: Relazione tra Chemical Compound e Skyscraper @it

has Ethnic Group
range: ethnic group
domain: chemical compound
comment: Relation between Chemical Compound and Ethnic Group
type: ObjectProperty
comment: Relazione tra Chemical Compound e Ethnic Group @it

language
label: langage @fr
type: Class

station
type: Class

has Mountain Range
domain: chemical compound
comment: Relazione tra Chemical Compound e Mountain Range @it
type: ObjectProperty
comment: Relation between Chemical Compound and Mountain Range
range: mountain range

has Office Holder
comment: Relazione tra Chemical Compound e Office Holder @it
type: ObjectProperty
range: office holder
comment: Relation between Chemical Compound and Office Holder
domain: chemical compound

has Formula One Racer
comment: Relation between Chemical Compound and Formula One Racer
type: ObjectProperty
comment: Relazione tra Chemical Compound e Formula One Racer @it
domain: chemical compound
range: Formula One racer

has Comics Character
range: comics character
comment: Relazione tra Chemical Compound e Comics Character @it
comment: Relation between Chemical Compound and Comics Character
type: ObjectProperty
domain: chemical compound

lake
type: Class
label: lac @fr

Ontology
extracted from: en.wikipedia.org
imports: cpannotationschema.owl
has author: Andrea Giovanni Nuzzolese
has author: Aldo Gangemi
has intent: To represent the encyclopedic knowledge expressed by an object typed as ChemicalCompound
extracted from: dbpedia.org
has author: Valentina Presutti
comment: ChemicalCompound Encyclopedic Knowledge Pattern

arachnid
label: arachnides @fr
type: Class

has Saint
type: ObjectProperty
range: saint
comment: Relazione tra Chemical Compound e Saint @it
comment: Relation between Chemical Compound and Saint
domain: chemical compound

has Video Game
type: ObjectProperty
range: video game
comment: Relation between Chemical Compound and Video Game
domain: chemical compound
comment: Relazione tra Chemical Compound e Video Game @it

has Scientist
type: ObjectProperty
range: scientist
domain: chemical compound
comment: Relazione tra Chemical Compound e Scientist @it
comment: Relation between Chemical Compound and Scientist

has Race
type: ObjectProperty
range: race
domain: chemical compound
comment: Relation between Chemical Compound and Race
comment: Relazione tra Chemical Compound e Race @it

has Journalist
comment: Relazione tra Chemical Compound e Journalist @it
type: ObjectProperty
comment: Relation between Chemical Compound and Journalist
range: journalist
domain: chemical compound

governor
label: gouverneur @fr
type: Class

administrative region
type: Class
label: région administrative @fr

river
label: rivière @fr
type: Class

has President
comment: Relazione tra Chemical Compound e President @it
domain: chemical compound
range: president
comment: Relation between Chemical Compound and President
type: ObjectProperty

country
type: Class
label: χώρα @el
label: Staat @de
label: pays @fr

school
label: école @fr
type: Class

fish
type: Class
label: poisson @fr

museum
type: Class
label: musée @fr

ship
label: navire @fr
type: Class

has Supreme Court Of The United States Case
comment: Relation between Chemical Compound and Supreme Court Of The United States Case
domain: chemical compound
type: ObjectProperty
comment: Relazione tra Chemical Compound e Supreme Court Of The United States Case @it
range: Supreme Court of the United States case

has Embryology
type: ObjectProperty
domain: chemical compound
range: embryology
comment: Relazione tra Chemical Compound e Embryology @it
comment: Relation between Chemical Compound and Embryology

video game
type: Class
label: jeux vidéo @fr

trade union
type: Class
label: syndicat professionnel @fr

has Language
domain: chemical compound
comment: Relazione tra Chemical Compound e Language @it
comment: Relation between Chemical Compound and Language
range: language
type: ObjectProperty

currency
type: Class
label: devise @fr

British royalty
type: Class
label: royauté Britannique @fr

race
label: course @fr
type: Class

historic place
type: Class
label: site historique @fr

has Aircraft
comment: Relazione tra Chemical Compound e Aircraft @it
comment: Relation between Chemical Compound and Aircraft
range: aircraft
type: ObjectProperty
domain: chemical compound

hospital
type: Class
label: hôpital @fr

has Space Mission
comment: Relazione tra Chemical Compound e Space Mission @it
range: space mission
domain: chemical compound
type: ObjectProperty
comment: Relation between Chemical Compound and Space Mission

continent
type: Class
label: ήπειρος @el

president
type: Class
label: président @fr

album
type: Class
label: Album @de

moss
type: Class
label: mousses @fr

has Town
domain: chemical compound
comment: Relazione tra Chemical Compound e Town @it
comment: Relation between Chemical Compound and Town
type: ObjectProperty
range: town

military unit
type: Class
label: unité militaire @fr

has Locomotive
comment: Relation between Chemical Compound and Locomotive
domain: chemical compound
type: ObjectProperty
comment: Relazione tra Chemical Compound e Locomotive @it
range: locomotive

has Protein
type: ObjectProperty
domain: chemical compound
range: protein
comment: Relazione tra Chemical Compound e Protein @it
comment: Relation between Chemical Compound and Protein

has University
comment: Relazione tra Chemical Compound e University @it
range: university
comment: Relation between Chemical Compound and University
domain: chemical compound
type: ObjectProperty

has Military Conflict
type: ObjectProperty
comment: Relazione tra Chemical Compound e Military Conflict @it
comment: Relation between Chemical Compound and Military Conflict
domain: chemical compound
range: military conflict

cycad
label: cycadophytes @fr
type: Class

writer
label: écrivain @fr
type: Class

city
label: cité @fr
type: Class

crustacean
type: Class
label: crustacés @fr

has Station
domain: chemical compound
range: station
type: ObjectProperty
comment: Relazione tra Chemical Compound e Station @it
comment: Relation between Chemical Compound and Station

has Moss
comment: Relazione tra Chemical Compound e Moss @it
type: ObjectProperty
comment: Relation between Chemical Compound and Moss
domain: chemical compound
range: moss

has Space Station
comment: Relation between Chemical Compound and Space Station
comment: Relazione tra Chemical Compound e Space Station @it
type: ObjectProperty
range: space station
domain: chemical compound

has Military Unit
type: ObjectProperty
range: military unit
comment: Relation between Chemical Compound and Military Unit
domain: chemical compound
comment: Relazione tra Chemical Compound e Military Unit @it

has Insect
domain: chemical compound
comment: Relazione tra Chemical Compound e Insect @it
range: insect
comment: Relation between Chemical Compound and Insect
type: ObjectProperty

has Fern
comment: Relation between Chemical Compound and Fern
range: fern
domain: chemical compound
type: ObjectProperty
comment: Relazione tra Chemical Compound e Fern @it

has Sport
range: sport
comment: Relazione tra Chemical Compound e Sport @it
comment: Relation between Chemical Compound and Sport
domain: chemical compound
type: ObjectProperty

has Gnetophytes
range: Gnetophytes
type: ObjectProperty
domain: chemical compound
comment: Relazione tra Chemical Compound e Gnetophytes @it
comment: Relation between Chemical Compound and Gnetophytes

aircraft
label: αεροσκάφος @el
type: Class
label: avion @fr

has Vein
domain: chemical compound
comment: Relazione tra Chemical Compound e Vein @it
type: ObjectProperty
range: vein
comment: Relation between Chemical Compound and Vein

has Fungus
comment: Relazione tra Chemical Compound e Fungus @it
range: fungus
type: ObjectProperty
comment: Relation between Chemical Compound and Fungus
domain: chemical compound

archaea
type: Class
label: archées @fr

club moss
label: lycopodiopsida @fr
type: Class

has Trade Union
range: trade union
type: ObjectProperty
domain: chemical compound
comment: Relation between Chemical Compound and Trade Union
comment: Relazione tra Chemical Compound e Trade Union @it

reptile
type: Class

legislature
label: pouvoir législatif @fr
type: Class

airline
label: compagnie aérienne @fr
type: Class

monarch
type: Class
label: monarque @fr

congressman
label: membre du Congrès @fr
type: Class

has Writer
type: ObjectProperty
domain: chemical compound
comment: Relazione tra Chemical Compound e Writer @it
range: writer
comment: Relation between Chemical Compound and Writer

Gnetophytes
type: Class
label: gnétophytes @fr

journalist
label: journaliste @fr
type: Class

space mission
label: mission spatiale @fr
label: διαστημική αποστολή @el
type: Class

has Bone
range: bone
comment: Relation between Chemical Compound and Bone
type: ObjectProperty
comment: Relazione tra Chemical Compound e Bone @it
domain: chemical compound

has Historic Place
comment: Relation between Chemical Compound and Historic Place
range: historic place
type: ObjectProperty
domain: chemical compound
comment: Relazione tra Chemical Compound e Historic Place @it

has Archaea
type: ObjectProperty
comment: Relazione tra Chemical Compound e Archaea @it
domain: chemical compound
comment: Relation between Chemical Compound and Archaea
range: archaea

has Single
comment: Relation between Chemical Compound and Single
comment: Relazione tra Chemical Compound e Single @it
type: ObjectProperty
domain: chemical compound
range: single

insect
type: Class
label: insecte @fr

has Pope
comment: Relation between Chemical Compound and Pope
range: pope
domain: chemical compound
comment: Relazione tra Chemical Compound e Pope @it
type: ObjectProperty

film
type: Class
label: ταινία @el

has Fish
range: fish
domain: chemical compound
type: ObjectProperty
comment: Relazione tra Chemical Compound e Fish @it
comment: Relation between Chemical Compound and Fish

has Film
type: ObjectProperty
comment: Relazione tra Chemical Compound e Film @it
comment: Relation between Chemical Compound and Film
range: film
domain: chemical compound

Supreme Court of the United States case
label: cas juridique de la Cour suprême des États-Unis @fr
type: Class

has Lake
comment: Relation between Chemical Compound and Lake
comment: Relazione tra Chemical Compound e Lake @it
type: ObjectProperty
range: lake
domain: chemical compound

bird
label: oiseau @fr
type: Class

chemical compound
label: produit chimique @fr
type: Class

power station
type: Class

has Mountain
comment: Relazione tra Chemical Compound e Mountain @it
type: ObjectProperty
domain: chemical compound
range: mountain
comment: Relation between Chemical Compound and Mountain

has Military Person
domain: chemical compound
type: ObjectProperty
comment: Relation between Chemical Compound and Military Person
comment: Relazione tra Chemical Compound e Military Person @it
range: military person

musical artist
label: musicien @fr
type: Class
label: artista musical @pt

fungus
label: fungi @fr
type: Class

fern
label: fougères @fr
type: Class

has Bacteria
type: ObjectProperty
comment: Relation between Chemical Compound and Bacteria
domain: chemical compound
comment: Relazione tra Chemical Compound e Bacteria @it
range: bacteria

has Beverage
range: beverage
comment: Relazione tra Chemical Compound e Beverage @it
domain: chemical compound
type: ObjectProperty
comment: Relation between Chemical Compound and Beverage

has River
comment: Relazione tra Chemical Compound e River @it
domain: chemical compound
comment: Relation between Chemical Compound and River
range: river
type: ObjectProperty

brain
label: cerveau @fr
type: Class

has Restaurant
comment: Relation between Chemical Compound and Restaurant
domain: chemical compound
type: ObjectProperty
comment: Relazione tra Chemical Compound e Restaurant @it
range: restaurant

actor
label: acteur @fr
type: Class
label: Schauspieler @de

has Airport
comment: Relazione tra Chemical Compound e Airport @it
range: airport
comment: Relation between Chemical Compound and Airport
type: ObjectProperty
domain: chemical compound

has Award
comment: Relazione tra Chemical Compound e Award @it
comment: Relation between Chemical Compound and Award
range: award
domain: chemical compound
type: ObjectProperty

has Bridge
range: bridge
comment: Relazione tra Chemical Compound e Bridge @it
domain: chemical compound
type: ObjectProperty
comment: Relation between Chemical Compound and Bridge

mountain
label: Βουνό @el
label: montagne @fr
type: Class

criminal
label: criminel @fr
type: Class

has Grape
range: grape
comment: Relazione tra Chemical Compound e Grape @it
type: ObjectProperty
domain: chemical compound
comment: Relation between Chemical Compound and Grape

has Arachnid
comment: Relazione tra Chemical Compound e Arachnid @it
range: arachnid
domain: chemical compound
type: ObjectProperty
comment: Relation between Chemical Compound and Arachnid

has Mammal
type: ObjectProperty
comment: Relazione tra Chemical Compound e Mammal @it
range: mammal
comment: Relation between Chemical Compound and Mammal
domain: chemical compound

saint
type: Class

has Governor
type: ObjectProperty
domain: chemical compound
comment: Relation between Chemical Compound and Governor
comment: Relazione tra Chemical Compound e Governor @it
range: governor

green alga
type: Class
label: algue verte @fr

has Non- Profit Organisation
comment: Relazione tra Chemical Compound e Non- Profit Organisation @it
comment: Relation between Chemical Compound and Non- Profit Organisation
range: non-profit organisation
domain: chemical compound
type: ObjectProperty

has Rocket
comment: Relation between Chemical Compound and Rocket
range: rocket
type: ObjectProperty
comment: Relazione tra Chemical Compound e Rocket @it
domain: chemical compound

book
type: Class
label: livre @fr
label: βιβλίο @el
label: llibre @ca
label: książka @pl

has City
domain: chemical compound
comment: Relation between Chemical Compound and City
comment: Relazione tra Chemical Compound e City @it
range: city
type: ObjectProperty

shopping mall
type: Class
label: centre commercial @fr

has Actor
domain: chemical compound
comment: Relation between Chemical Compound and Actor
comment: Relazione tra Chemical Compound e Actor @it
type: ObjectProperty
range: actor

has Hospital
comment: Relazione tra Chemical Compound e Hospital @it
type: ObjectProperty
comment: Relation between Chemical Compound and Hospital
domain: chemical compound
range: hospital

bacteria
label: bactérie @fr
type: Class

has Bird
type: ObjectProperty
comment: Relation between Chemical Compound and Bird
range: bird
comment: Relazione tra Chemical Compound e Bird @it
domain: chemical compound

has Continent
range: continent
type: ObjectProperty
domain: chemical compound
comment: Relation between Chemical Compound and Continent
comment: Relazione tra Chemical Compound e Continent @it

non-profit organisation
label: organisation à but non lucratif @fr
type: Class

space station
type: Class
label: station spatiale @fr

has Island
range: island
comment: Relation between Chemical Compound and Island
domain: chemical compound
type: ObjectProperty
comment: Relazione tra Chemical Compound e Island @it

mollusca
type: Class
label: mollusque @fr

has Automobile
type: ObjectProperty
comment: Relazione tra Chemical Compound e Automobile @it
domain: chemical compound
range: automobile
comment: Relation between Chemical Compound and Automobile

has Amphibian
comment: Relazione tra Chemical Compound e Amphibian @it
domain: chemical compound
type: ObjectProperty
range: amphibian
comment: Relation between Chemical Compound and Amphibian

has Television Show
domain: chemical compound
type: ObjectProperty
comment: Relation between Chemical Compound and Television Show
range: television show
comment: Relazione tra Chemical Compound e Television Show @it

weapon
label: arme @fr
type: Class

has Legislature
comment: Relation between Chemical Compound and Legislature
comment: Relazione tra Chemical Compound e Legislature @it
range: legislature
domain: chemical compound
type: ObjectProperty

has Shopping Mall
domain: chemical compound
comment: Relazione tra Chemical Compound e Shopping Mall @it
type: ObjectProperty
comment: Relation between Chemical Compound and Shopping Mall
range: shopping mall

magazine
type: Class
label: περιοδικό @el

military person
type: Class
label: militaire @fr

philosopher
type: Class
label: philosophe @fr

award
label: récompense @fr
type: Class

has Ginkgo
comment: Relation between Chemical Compound and Ginkgo
domain: chemical compound
range: ginkgo
type: ObjectProperty
comment: Relazione tra Chemical Compound e Ginkgo @it

locomotive
type: Class

has Ship
comment: Relazione tra Chemical Compound e Ship @it
domain: chemical compound
comment: Relation between Chemical Compound and Ship
type: ObjectProperty
range: ship

has Website
type: ObjectProperty
comment: Relazione tra Chemical Compound e Website @it
comment: Relation between Chemical Compound and Website
range: website
domain: chemical compound

college
type: Class

sport
type: Class

restaurant
type: Class

nerve
label: nerf @fr
type: Class

single
type: Class

has Olympics
range: olympics
comment: Relazione tra Chemical Compound e Olympics @it
comment: Relation between Chemical Compound and Olympics
type: ObjectProperty
domain: chemical compound

has Power Station
domain: chemical compound
type: ObjectProperty
comment: Relazione tra Chemical Compound e Power Station @it
comment: Relation between Chemical Compound and Power Station
range: power station

Band
label: groupe de musique @fr
type: Class
label: Musikgruppe @de
label: banda @pt

town
label: ville @fr
type: Class

has Museum
type: ObjectProperty
comment: Relazione tra Chemical Compound e Museum @it
domain: chemical compound
comment: Relation between Chemical Compound and Museum
range: museum

university
label: πανεπιστήμιο @el
label: université @fr
type: Class

has Cycad
type: ObjectProperty
comment: Relation between Chemical Compound and Cycad
range: cycad
domain: chemical compound
comment: Relazione tra Chemical Compound e Cycad @it

protein
type: Class
label: protéine @fr

has Reptile
range: reptile
domain: chemical compound
comment: Relazione tra Chemical Compound e Reptile @it
type: ObjectProperty
comment: Relation between Chemical Compound and Reptile

ethnic group
label: groupe ethnique @fr
type: Class

artery
label: Arterie @de
type: Class
label: artère @fr

embryology
label: embryologie @fr
type: Class

muscle
type: Class

village
label: χωριό @el
type: Class

office holder
label: titulaire @fr
label: Amtsinhaber @de
type: Class

has College
comment: Relazione tra Chemical Compound e College @it
domain: chemical compound
range: college
comment: Relation between Chemical Compound and College
type: ObjectProperty

has Muscle
type: ObjectProperty
comment: Relation between Chemical Compound and Muscle
range: muscle
domain: chemical compound
comment: Relazione tra Chemical Compound e Muscle @it

military conflict
type: Class
label: conflit militaire @fr

grape
type: Class
label: raisin @fr

has Member Of Parliament
type: ObjectProperty
comment: Relation between Chemical Compound and Member Of Parliament
range: member of parliament
domain: chemical compound
comment: Relazione tra Chemical Compound e Member Of Parliament @it

website
type: Class
label: Ιστότοπος @el
label: site web @fr

has Congressman
range: congressman
domain: chemical compound
comment: Relation between Chemical Compound and Congressman
comment: Relazione tra Chemical Compound e Congressman @it
type: ObjectProperty

has Brain
comment: Relation between Chemical Compound and Brain
comment: Relazione tra Chemical Compound e Brain @it
type: ObjectProperty
range: brain
domain: chemical compound

has Village
range: village
domain: chemical compound
comment: Relazione tra Chemical Compound e Village @it
type: ObjectProperty
comment: Relation between Chemical Compound and Village

has Planet
type: ObjectProperty
range: planet
comment: Relation between Chemical Compound and Planet
domain: chemical compound
comment: Relazione tra Chemical Compound e Planet @it

mountain range
label: chaîne de montagne @fr
type: Class

beverage
label: boisson @fr
type: Class

has Country
comment: Relation between Chemical Compound and Country
range: country
domain: chemical compound
comment: Relazione tra Chemical Compound e Country @it
type: ObjectProperty

has Administrative Region
comment: Relation between Chemical Compound and Administrative Region
comment: Relazione tra Chemical Compound e Administrative Region @it
domain: chemical compound
range: administrative region
type: ObjectProperty

has Nerve
domain: chemical compound
comment: Relazione tra Chemical Compound e Nerve @it
range: nerve
comment: Relation between Chemical Compound and Nerve
type: ObjectProperty

planet
type: Class
label: planète @fr

has Protected Area
comment: Relation between Chemical Compound and Protected Area
comment: Relazione tra Chemical Compound e Protected Area @it
range: protected area
type: ObjectProperty
domain: chemical compound

has Magazine
type: ObjectProperty
comment: Relation between Chemical Compound and Magazine
range: magazine
comment: Relazione tra Chemical Compound e Magazine @it
domain: chemical compound

scientist
label: Wissenschaftler @de
type: Class
label: scientifique @fr

has Broadcast
comment: Relation between Chemical Compound and Broadcast
comment: Relazione tra Chemical Compound e Broadcast @it
domain: chemical compound
range: broadcast
type: ObjectProperty

has Band
range: Band
comment: Relation between Chemical Compound and Band
type: ObjectProperty
domain: chemical compound
comment: Relazione tra Chemical Compound e Band @it

olympics
label: Jeux Olympiques @fr
type: Class

has Airline
domain: chemical compound
comment: Relazione tra Chemical Compound e Airline @it
range: airline
type: ObjectProperty
comment: Relation between Chemical Compound and Airline

has Currency
comment: Relazione tra Chemical Compound e Currency @it
range: currency
type: ObjectProperty
domain: chemical compound
comment: Relation between Chemical Compound and Currency

has Philosopher
range: philosopher
comment: Relation between Chemical Compound and Philosopher
domain: chemical compound
type: ObjectProperty
comment: Relazione tra Chemical Compound e Philosopher @it

bridge
type: Class
label: pont @fr

has Criminal
range: criminal
comment: Relation between Chemical Compound and Criminal
type: ObjectProperty
domain: chemical compound
comment: Relazione tra Chemical Compound e Criminal @it

broadcast
label: Émission de télévision @fr
type: Class

vein
label: veine @fr
type: Class

mammal
label: mammifère @fr
type: Class

island
label: île @fr
label: νησί @el
type: Class

has Monarch
domain: chemical compound
range: monarch
type: ObjectProperty
comment: Relation between Chemical Compound and Monarch
comment: Relazione tra Chemical Compound e Monarch @it

comics character
type: Class
label: personnage de bandes dessinées @fr

has Weapon
comment: Relazione tra Chemical Compound e Weapon @it
type: ObjectProperty
domain: chemical compound
comment: Relation between Chemical Compound and Weapon
range: weapon

Formula One racer
label: pilote de formule 1 @fr
type: Class

skyscraper
label: gratte-ciel @fr
type: Class

has Conifer
type: ObjectProperty
range: conifer
comment: Relation between Chemical Compound and Conifer
comment: Relazione tra Chemical Compound e Conifer @it
domain: chemical compound

bone
type: Class
label: Knochen @de
label: os @fr

member of parliament
label: membre du Parlement @fr
type: Class

has Album
comment: Relazione tra Chemical Compound e Album @it
domain: chemical compound
type: ObjectProperty
comment: Relation between Chemical Compound and Album
range: album

has School
domain: chemical compound
comment: Relation between Chemical Compound and School
range: school
comment: Relazione tra Chemical Compound e School @it
type: ObjectProperty

has Newspaper
comment: Relazione tra Chemical Compound e Newspaper @it
type: ObjectProperty
domain: chemical compound
range: newspaper
comment: Relation between Chemical Compound and Newspaper

conifer
type: Class
label: conifères @fr

airport
type: Class
label: Flughafen @de
label: aéroport @fr