has Video Game
range: video game
comment: Relazione tra College Coach e Video Game @it
domain: college coach
type: ObjectProperty
comment: Relation between College Coach and Video Game

television show
type: Class
label: émission de télévision @fr

has River
comment: Relation between College Coach and River
type: ObjectProperty
range: river
comment: Relazione tra College Coach e River @it
domain: college coach

disease
label: maladie @fr
type: Class

colour
label: χρώμα @el
label: couleur @fr
type: Class

automobile
type: Class

Election
label: élection @fr
type: Class

has Olympic Result
range: olympic result
comment: Relazione tra College Coach e Olympic Result @it
comment: Relation between College Coach and Olympic Result
domain: college coach
type: ObjectProperty

has Softball League
comment: Relation between College Coach and Softball League
range: softball league
comment: Relazione tra College Coach e Softball League @it
domain: college coach
type: ObjectProperty

has Supreme Court Of The United States Case
comment: Relation between College Coach and Supreme Court Of The United States Case
type: ObjectProperty
comment: Relazione tra College Coach e Supreme Court Of The United States Case @it
range: Supreme Court of the United States case
domain: college coach

stadium
label: stade @fr
type: Class

has Colour
related match: coachteams
domain: college coach
range: colour
comment: Relation between College Coach and Colour
type: ObjectProperty
comment: Relazione tra College Coach e Colour @it

soccer league
type: Class
label: ligue de football @fr

has Tennis League
comment: Relation between College Coach and Tennis League
comment: Relazione tra College Coach e Tennis League @it
type: ObjectProperty
range: tennis league
domain: college coach

astronaut
label: astronaute @fr
label: Astronaut @de
type: Class

wrestler
type: Class
label: lutteur @fr

has American Football League
related match: coachteams
related match: team
comment: Relazione tra College Coach e American Football League @it
type: ObjectProperty
range: american football league
comment: Relation between College Coach and American Football League
domain: college coach

mayor
label: maire @fr
type: Class

has Cricketer
comment: Relation between College Coach and Cricketer
domain: college coach
comment: Relazione tra College Coach e Cricketer @it
type: ObjectProperty
range: cricketer

has Baseball Player
domain: college coach
range: baseball player
comment: Relation between College Coach and Baseball Player
type: ObjectProperty
comment: Relazione tra College Coach e Baseball Player @it
related match: after
related match: before

newspaper
label: journal @fr
type: Class

protected area
label: aire protégée @fr
label: προστατευμένη περιοχή @el
type: Class

road
label: route @fr
type: Class

boxer
label: boxeur @fr
type: Class

has Currency
domain: college coach
comment: Relation between College Coach and Currency
comment: Relazione tra College Coach e Currency @it
range: currency
type: ObjectProperty

World Heritage Site
label: site du patrimoine mondial @fr
type: Class

has Road
domain: college coach
comment: Relazione tra College Coach e Road @it
comment: Relation between College Coach and Road
type: ObjectProperty
range: road

has Legislature
comment: Relation between College Coach and Legislature
type: ObjectProperty
comment: Relazione tra College Coach e Legislature @it
domain: college coach
range: legislature

has Basketball Player
domain: college coach
comment: Relazione tra College Coach e Basketball Player @it
range: basketball player
type: ObjectProperty
comment: Relation between College Coach and Basketball Player
related match: before
related match: after

language
label: langage @fr
type: Class

tennis league
label: ligue de tennis @fr
type: Class

has Olympics
range: olympics
comment: Relazione tra College Coach e Olympics @it
comment: Relation between College Coach and Olympics
domain: college coach
type: ObjectProperty

has Television Show
type: ObjectProperty
range: television show
comment: Relazione tra College Coach e Television Show @it
domain: college coach
comment: Relation between College Coach and Television Show

lake
label: lac @fr
type: Class

has Comics Character
comment: Relation between College Coach and Comics Character
domain: college coach
comment: Relazione tra College Coach e Comics Character @it
range: comics character
type: ObjectProperty

has Drug
type: ObjectProperty
comment: Relation between College Coach and Drug
comment: Relazione tra College Coach e Drug @it
domain: college coach
range: drug

governor
type: Class
label: gouverneur @fr

has Scientist
related match: after
range: scientist
comment: Relation between College Coach and Scientist
type: ObjectProperty
domain: college coach
comment: Relazione tra College Coach e Scientist @it

poker player
type: Class
label: joueur de poker @fr

river
label: rivière @fr
type: Class

lacrosse league
label: ligue de crosse @fr
type: Class

ship
label: navire @fr
type: Class

museum
label: musée @fr
type: Class

tennis player
label: joueur de tennis @fr
type: Class

has Criminal
comment: Relation between College Coach and Criminal
range: criminal
domain: college coach
type: ObjectProperty
comment: Relazione tra College Coach e Criminal @it

video game
type: Class
label: jeux vidéo @fr

has Military Person
related match: after
domain: college coach
range: military person
comment: Relazione tra College Coach e Military Person @it
comment: Relation between College Coach and Military Person
type: ObjectProperty

trade union
label: syndicat professionnel @fr
type: Class

Axiom
annotated source: has Military Person
matching quantification: 2
annotated target: after

currency
label: devise @fr
type: Class

has Governor
type: ObjectProperty
comment: Relation between College Coach and Governor
comment: Relazione tra College Coach e Governor @it
domain: college coach
range: governor

has Non- Profit Organisation
comment: Relazione tra College Coach e Non- Profit Organisation @it
comment: Relation between College Coach and Non- Profit Organisation
range: non-profit organisation
type: ObjectProperty
domain: college coach

historic place
label: site historique @fr
type: Class

softball league
label: ligue de softball @fr
type: Class

hospital
type: Class
label: hôpital @fr

has Member Of Parliament
range: member of parliament
domain: college coach
type: ObjectProperty
comment: Relation between College Coach and Member Of Parliament
comment: Relazione tra College Coach e Member Of Parliament @it

continent
type: Class
label: ήπειρος @el

has Basketball League
related match: championships
type: ObjectProperty
range: basketball league
domain: college coach
comment: Relazione tra College Coach e Basketball League @it
comment: Relation between College Coach and Basketball League

Axiom
annotated source: has Canadian Football League
annotated target: team
matching quantification: 2

president
type: Class
label: président @fr

has Military Unit
related match: unit
type: ObjectProperty
range: military unit
comment: Relazione tra College Coach e Military Unit @it
comment: Relation between College Coach and Military Unit
domain: college coach

Axiom
annotated source: has Writer
annotated target: after
matching quantification: 1

Axiom
matching quantification: 35
annotated source: has American Football Team
annotated target: team

has Writer
domain: college coach
comment: Relation between College Coach and Writer
type: ObjectProperty
comment: Relazione tra College Coach e Writer @it
range: writer
related match: after

has Trade Union
range: trade union
comment: Relazione tra College Coach e Trade Union @it
domain: college coach
type: ObjectProperty
comment: Relation between College Coach and Trade Union

has Airline
type: ObjectProperty
domain: college coach
comment: Relation between College Coach and Airline
range: airline
comment: Relazione tra College Coach e Airline @it

military unit
type: Class
label: unité militaire @fr

has Comics Creator
type: ObjectProperty
range: comics creator
comment: Relazione tra College Coach e Comics Creator @it
domain: college coach
comment: Relation between College Coach and Comics Creator

soccer manager
label: entraîneur de football @fr
type: Class

has Monarch
type: ObjectProperty
domain: college coach
comment: Relation between College Coach and Monarch
comment: Relazione tra College Coach e Monarch @it
range: monarch

basketball team
type: Class

has Island
type: ObjectProperty
comment: Relation between College Coach and Island
range: island
domain: college coach
comment: Relazione tra College Coach e Island @it

has Mammal
type: ObjectProperty
range: mammal
comment: Relazione tra College Coach e Mammal @it
comment: Relation between College Coach and Mammal
domain: college coach

canadian football team
type: Class
label: équipe canadienne de football américain @fr

has Town
domain: college coach
comment: Relation between College Coach and Town
comment: Relazione tra College Coach e Town @it
type: ObjectProperty
range: town
related match: coachteams

Axiom
matching quantification: 1
annotated source: has Colour
annotated target: coachteams

Axiom
annotated source: has Congressman
annotated target: before
matching quantification: 2

writer
type: Class
label: écrivain @fr

has Band
type: ObjectProperty
domain: college coach
range: Band
comment: Relation between College Coach and Band
comment: Relazione tra College Coach e Band @it

has Beverage
type: ObjectProperty
range: beverage
comment: Relazione tra College Coach e Beverage @it
domain: college coach
comment: Relation between College Coach and Beverage

Axiom
matching quantification: 23
annotated source: has Basketball Team
annotated target: coachteams

has Congressman
domain: college coach
comment: Relation between College Coach and Congressman
comment: Relazione tra College Coach e Congressman @it
type: ObjectProperty
range: congressman
related match: before

olympic result
label: résultat de Jeux Olympiques @fr
type: Class

Axiom
annotated target: awards
matching quantification: 1
annotated source: has Award

Axiom
annotated target: awards
matching quantification: 1
annotated source: has Museum

has American Football Team
related match: teams
related match: coachteams
related match: title
comment: Relazione tra College Coach e American Football Team @it
domain: college coach
related match: awards
type: ObjectProperty
related match: team
range: american football team
comment: Relation between College Coach and American Football Team

has Reptile
comment: Relazione tra College Coach e Reptile @it
range: reptile
type: ObjectProperty
comment: Relation between College Coach and Reptile
domain: college coach

Axiom
matching quantification: 1
annotated source: has Military Unit
annotated target: unit

Axiom
annotated source: has Historic Place
matching quantification: 1
annotated target: name

has Baseball League
comment: Relation between College Coach and Baseball League
range: baseball league
domain: college coach
comment: Relazione tra College Coach e Baseball League @it
type: ObjectProperty

comics creator
type: Class
label: créateur de bandes dessinées @fr

aircraft
label: avion @fr
type: Class
label: αεροσκάφος @el

hockey team
type: Class
label: équipe de hockey @fr

has Book
type: ObjectProperty
domain: college coach
range: book
comment: Relation between College Coach and Book
comment: Relazione tra College Coach e Book @it

soccer player
label: joueur de football @fr
type: Class

has Lacrosse League
range: lacrosse league
type: ObjectProperty
comment: Relation between College Coach and Lacrosse League
comment: Relazione tra College Coach e Lacrosse League @it
domain: college coach

reptile
type: Class

legislature
label: pouvoir législatif @fr
type: Class

has Award
related match: awards
type: ObjectProperty
range: award
comment: Relazione tra College Coach e Award @it
comment: Relation between College Coach and Award
domain: college coach

Axiom
annotated target: coachteams
annotated source: has Airport
matching quantification: 1

airline
label: compagnie aérienne @fr
type: Class

has Film
type: ObjectProperty
comment: Relazione tra College Coach e Film @it
domain: college coach
comment: Relation between College Coach and Film
range: film

Axiom
annotated source: has American Football Team
matching quantification: 4
annotated target: title

monarch
label: monarque @fr
type: Class

congressman
type: Class
label: membre du Congrès @fr

has Valley
comment: Relazione tra College Coach e Valley @it
comment: Relation between College Coach and Valley
range: valley
type: ObjectProperty
domain: college coach

golf player
label: golfeur @fr
type: Class

has Ice Hockey Player
range: ice hockey player
type: ObjectProperty
domain: college coach
comment: Relation between College Coach and Ice Hockey Player
comment: Relazione tra College Coach e Ice Hockey Player @it

journalist
label: journaliste @fr
type: Class

has Wrestler
comment: Relazione tra College Coach e Wrestler @it
comment: Relation between College Coach and Wrestler
range: wrestler
type: ObjectProperty
domain: college coach

Axiom
matching quantification: 2
annotated source: has American Football Team
annotated target: teams

film
label: ταινία @el
type: Class

american football team
label: équipe américaine de football américain @fr
type: Class

Axiom
annotated source: has Basketball League
matching quantification: 3
annotated target: championships

Supreme Court of the United States case
label: cas juridique de la Cour suprême des États-Unis @fr
type: Class

bird
label: oiseau @fr
type: Class

chemical compound
label: produit chimique @fr
type: Class

Axiom
annotated target: team
matching quantification: 2
annotated source: has American Football League

has Ski Area
range: ski area
comment: Relazione tra College Coach e Ski Area @it
domain: college coach
comment: Relation between College Coach and Ski Area
type: ObjectProperty

has Soccer Player
comment: Relation between College Coach and Soccer Player
comment: Relazione tra College Coach e Soccer Player @it
type: ObjectProperty
range: soccer player
domain: college coach

has Mountain Range
domain: college coach
range: mountain range
comment: Relation between College Coach and Mountain Range
type: ObjectProperty
comment: Relazione tra College Coach e Mountain Range @it

fungus
label: fungi @fr
type: Class

musical artist
label: artista musical @pt
type: Class
label: musicien @fr

Axiom
matching quantification: 1
annotated target: years
annotated source: has Office Holder

rugby player
type: Class
label: joueur de rugby @fr

has Canadian Football Team
related match: team
related match: coachteams
domain: college coach
comment: Relazione tra College Coach e Canadian Football Team @it
comment: Relation between College Coach and Canadian Football Team
type: ObjectProperty
range: canadian football team

has Military Conflict
type: ObjectProperty
comment: Relation between College Coach and Military Conflict
comment: Relazione tra College Coach e Military Conflict @it
range: military conflict
domain: college coach

american football league
type: Class

has Soccer League
comment: Relation between College Coach and Soccer League
type: ObjectProperty
range: soccer league
comment: Relazione tra College Coach e Soccer League @it
domain: college coach

has Actor
related match: years
range: actor
comment: Relazione tra College Coach e Actor @it
comment: Relation between College Coach and Actor
type: ObjectProperty
domain: college coach

musical
label: musique @fr
type: Class

Axiom
annotated source: has Actor
annotated target: years
matching quantification: 1

has Stadium
comment: Relazione tra College Coach e Stadium @it
range: stadium
comment: Relation between College Coach and Stadium
type: ObjectProperty
domain: college coach

actor
label: Schauspieler @de
type: Class
label: acteur @fr

Axiom
matching quantification: 7
annotated source: has Canadian Football Team
annotated target: team

national collegiate athletic association athlete
label: athlète de la national collegiate athletic association @fr
type: Class

has Mayor
comment: Relation between College Coach and Mayor
comment: Relazione tra College Coach e Mayor @it
domain: college coach
range: mayor
type: ObjectProperty

has President
type: ObjectProperty
domain: college coach
range: president
comment: Relazione tra College Coach e President @it
comment: Relation between College Coach and President

has Canadian Football League
related match: team
related match: coachteams
domain: college coach
type: ObjectProperty
comment: Relation between College Coach and Canadian Football League
comment: Relazione tra College Coach e Canadian Football League @it
range: canadian football league

has Bird
type: ObjectProperty
comment: Relazione tra College Coach e Bird @it
range: bird
domain: college coach
comment: Relation between College Coach and Bird

Axiom
annotated target: before
annotated source: has Astronaut
matching quantification: 1

Axiom
annotated target: formerTeams
matching quantification: 2
annotated source: has Basketball Team

basketball league
type: Class
label: ligue de basketball @fr

mountain
label: Βουνό @el
label: montagne @fr
type: Class

criminal
type: Class
label: criminel @fr

has Ship
comment: Relazione tra College Coach e Ship @it
range: ship
type: ObjectProperty
domain: college coach
comment: Relation between College Coach and Ship

Axiom
annotated target: coachteams
annotated source: has Canadian Football League
matching quantification: 1

flowering plant
label: angiospermes @fr
type: Class

Axiom
matching quantification: 1
annotated source: has Baseball Player
annotated target: before

senator
type: Class
label: sénateur @fr

has Lake
comment: Relation between College Coach and Lake
domain: college coach
comment: Relazione tra College Coach e Lake @it
range: lake
type: ObjectProperty

has Television Episode
range: television episode
comment: Relazione tra College Coach e Television Episode @it
domain: college coach
comment: Relation between College Coach and Television Episode
type: ObjectProperty

comedian
type: Class
label: comédien @fr

valley
label: vallée @fr
type: Class

has Tennis Player
type: ObjectProperty
comment: Relazione tra College Coach e Tennis Player @it
domain: college coach
range: tennis player
comment: Relation between College Coach and Tennis Player

Ontology
has intent: To represent the encyclopedic knowledge expressed by an object typed as CollegeCoach
imports: cpannotationschema.owl
extracted from: dbpedia.org
extracted from: en.wikipedia.org
has author: Aldo Gangemi
comment: CollegeCoach Encyclopedic Knowledge Pattern
has author: Valentina Presutti
has author: Andrea Giovanni Nuzzolese

has Broadcast
range: broadcast
domain: college coach
type: ObjectProperty
comment: Relation between College Coach and Broadcast
comment: Relazione tra College Coach e Broadcast @it

has Disease
type: ObjectProperty
comment: Relazione tra College Coach e Disease @it
comment: Relation between College Coach and Disease
domain: college coach
range: disease

Axiom
matching quantification: 3
annotated target: coachteams
annotated source: has American Football League

book
label: książka @pl
label: llibre @ca
label: βιβλίο @el
label: livre @fr
type: Class

has Chemical Compound
type: ObjectProperty
comment: Relazione tra College Coach e Chemical Compound @it
comment: Relation between College Coach and Chemical Compound
range: chemical compound
domain: college coach

has Journalist
domain: college coach
type: ObjectProperty
comment: Relation between College Coach and Journalist
comment: Relazione tra College Coach e Journalist @it
range: journalist

has Ethnic Group
range: ethnic group
domain: college coach
comment: Relazione tra College Coach e Ethnic Group @it
type: ObjectProperty
comment: Relation between College Coach and Ethnic Group

Axiom
matching quantification: 2
annotated target: after
annotated source: has National Collegiate Athletic Association Athlete

Axiom
annotated target: coachteams
annotated source: has Historic Place
matching quantification: 8

has Skyscraper
comment: Relazione tra College Coach e Skyscraper @it
range: skyscraper
domain: college coach
comment: Relation between College Coach and Skyscraper
type: ObjectProperty

has Hospital
range: hospital
domain: college coach
comment: Relazione tra College Coach e Hospital @it
comment: Relation between College Coach and Hospital
type: ObjectProperty

Axiom
annotated target: team
matching quantification: 31
annotated source: has Basketball Team

ski area
label: domaine skiable @fr
type: Class

non-profit organisation
type: Class
label: organisation à but non lucratif @fr

has Fungus
domain: college coach
range: fungus
type: ObjectProperty
comment: Relation between College Coach and Fungus
comment: Relazione tra College Coach e Fungus @it

canadian football league
type: Class

has Language
domain: college coach
comment: Relation between College Coach and Language
type: ObjectProperty
range: language
comment: Relazione tra College Coach e Language @it

has Website
comment: Relation between College Coach and Website
type: ObjectProperty
range: website
domain: college coach
comment: Relazione tra College Coach e Website @it

drug
label: médicament @fr
type: Class

Axiom
matching quantification: 1
annotated target: after
annotated source: has Scientist

magazine
label: περιοδικό @el
type: Class

Axiom
annotated source: has Basketball Player
matching quantification: 1
annotated target: before

has Flowering Plant
comment: Relazione tra College Coach e Flowering Plant @it
domain: college coach
range: flowering plant
type: ObjectProperty
comment: Relation between College Coach and Flowering Plant

has Musical Artist
domain: college coach
comment: Relation between College Coach and Musical Artist
range: musical artist
type: ObjectProperty
comment: Relazione tra College Coach e Musical Artist @it

canal
type: Class

has Automobile
comment: Relazione tra College Coach e Automobile @it
comment: Relation between College Coach and Automobile
type: ObjectProperty
range: automobile
domain: college coach

military person
label: militaire @fr
type: Class

philosopher
type: Class
label: philosophe @fr

award
type: Class
label: récompense @fr

has Artery
comment: Relation between College Coach and Artery
type: ObjectProperty
range: artery
comment: Relazione tra College Coach e Artery @it
domain: college coach

has Rugby Player
domain: college coach
range: rugby player
type: ObjectProperty
comment: Relazione tra College Coach e Rugby Player @it
comment: Relation between College Coach and Rugby Player

has Office Holder
related match: years
comment: Relazione tra College Coach e Office Holder @it
domain: college coach
range: office holder
comment: Relation between College Coach and Office Holder
type: ObjectProperty

cricketer
type: Class
label: joueur de cricket @fr

has Ice Hockey League
comment: Relation between College Coach and Ice Hockey League
range: ice hockey league
comment: Relazione tra College Coach e Ice Hockey League @it
domain: college coach
type: ObjectProperty

Band
label: groupe de musique @fr
type: Class
label: Musikgruppe @de
label: banda @pt

has Village
type: ObjectProperty
comment: Relation between College Coach and Village
domain: college coach
comment: Relazione tra College Coach e Village @it
range: village

Axiom
annotated target: coachteams
annotated source: has Town
matching quantification: 1

town
label: ville @fr
type: Class

has Hockey Team
comment: Relation between College Coach and Hockey Team
domain: college coach
range: hockey team
type: ObjectProperty
comment: Relazione tra College Coach e Hockey Team @it

ethnic group
type: Class
label: groupe ethnique @fr

artery
label: Arterie @de
type: Class
label: artère @fr

has Soccer Manager
domain: college coach
type: ObjectProperty
comment: Relazione tra College Coach e Soccer Manager @it
range: soccer manager
comment: Relation between College Coach and Soccer Manager

has Astronaut
range: astronaut
comment: Relazione tra College Coach e Astronaut @it
domain: college coach
comment: Relation between College Coach and Astronaut
type: ObjectProperty
related match: before

has Airport
related match: coachteams
type: ObjectProperty
domain: college coach
comment: Relazione tra College Coach e Airport @it
range: airport
comment: Relation between College Coach and Airport

hotel
label: hôtel @fr
type: Class

college coach
type: Class
label: entraîneur universitaire @fr

television episode
type: Class
label: épisode télévisé @fr

muscle
type: Class

village
label: χωριό @el
type: Class

ice hockey league
label: ligue d'hockey sur glace @fr
type: Class

soccer club
type: Class
label: club de football @fr

has Magazine
domain: college coach
comment: Relazione tra College Coach e Magazine @it
comment: Relation between College Coach and Magazine
range: magazine
type: ObjectProperty

has Golf Player
comment: Relazione tra College Coach e Golf Player @it
type: ObjectProperty
range: golf player
comment: Relation between College Coach and Golf Player
domain: college coach

has Basketball Team
domain: college coach
range: basketball team
type: ObjectProperty
comment: Relazione tra College Coach e Basketball Team @it
comment: Relation between College Coach and Basketball Team
related match: formerTeams
related match: coachteams
related match: team

baseball player
type: Class
label: joueur de baseball @fr

office holder
type: Class
label: Amtsinhaber @de
label: titulaire @fr

military conflict
type: Class
label: conflit militaire @fr

website
type: Class
label: site web @fr
label: Ιστότοπος @el

has Canal
range: canal
comment: Relation between College Coach and Canal
domain: college coach
comment: Relazione tra College Coach e Canal @it
type: ObjectProperty

has Continent
range: continent
domain: college coach
comment: Relation between College Coach and Continent
comment: Relazione tra College Coach e Continent @it
type: ObjectProperty

has Comedian
comment: Relazione tra College Coach e Comedian @it
type: ObjectProperty
comment: Relation between College Coach and Comedian
domain: college coach
range: comedian

has Golf League
domain: college coach
type: ObjectProperty
comment: Relation between College Coach and Golf League
comment: Relazione tra College Coach e Golf League @it
range: golf league

has Historic Place
range: historic place
type: ObjectProperty
comment: Relazione tra College Coach e Historic Place @it
comment: Relation between College Coach and Historic Place
domain: college coach
related match: coachteams
related match: name

has Mountain
comment: Relation between College Coach and Mountain
comment: Relazione tra College Coach e Mountain @it
type: ObjectProperty
domain: college coach
range: mountain

has Hotel
comment: Relazione tra College Coach e Hotel @it
comment: Relation between College Coach and Hotel
range: hotel
domain: college coach
type: ObjectProperty

Axiom
matching quantification: 1
annotated source: has Soccer Club
annotated target: coachteams

basketball player
type: Class
label: joueur de basketball @fr

has Boxer
domain: college coach
range: boxer
comment: Relazione tra College Coach e Boxer @it
comment: Relation between College Coach and Boxer
type: ObjectProperty

ice hockey player
label: joueur de hockey sur glace @fr
type: Class

has Museum
related match: awards
comment: Relazione tra College Coach e Museum @it
range: museum
type: ObjectProperty
comment: Relation between College Coach and Museum
domain: college coach

mountain range
type: Class
label: chaîne de montagne @fr

has Aircraft
comment: Relazione tra College Coach e Aircraft @it
domain: college coach
range: aircraft
type: ObjectProperty
comment: Relation between College Coach and Aircraft

has Radio Station
comment: Relazione tra College Coach e Radio Station @it
domain: college coach
comment: Relation between College Coach and Radio Station
range: radio station
type: ObjectProperty

beverage
label: boisson @fr
type: Class

has Senator
comment: Relation between College Coach and Senator
domain: college coach
type: ObjectProperty
comment: Relazione tra College Coach e Senator @it
range: senator

planet
type: Class
label: planète @fr

Axiom
annotated target: coachteams
matching quantification: 58
annotated source: has American Football Team

scientist
label: scientifique @fr
type: Class
label: Wissenschaftler @de

golf league
label: ligue de golf @fr
type: Class

has Musical
type: ObjectProperty
range: musical
comment: Relazione tra College Coach e Musical @it
domain: college coach
comment: Relation between College Coach and Musical

has Philosopher
range: philosopher
domain: college coach
comment: Relation between College Coach and Philosopher
comment: Relazione tra College Coach e Philosopher @it
type: ObjectProperty

has Muscle
domain: college coach
comment: Relation between College Coach and Muscle
range: muscle
type: ObjectProperty
comment: Relazione tra College Coach e Muscle @it

Axiom
annotated source: has Canadian Football Team
matching quantification: 24
annotated target: coachteams

Axiom
annotated target: after
annotated source: has Basketball Player
matching quantification: 3

olympics
label: Jeux Olympiques @fr
type: Class

has National Collegiate Athletic Association Athlete
range: national collegiate athletic association athlete
domain: college coach
comment: Relation between College Coach and National Collegiate Athletic Association Athlete
type: ObjectProperty
comment: Relazione tra College Coach e National Collegiate Athletic Association Athlete @it
related match: after

baseball league
type: Class
label: ligue de baseball @fr

has Election
range: Election
comment: Relazione tra College Coach e Election @it
domain: college coach
comment: Relation between College Coach and Election
type: ObjectProperty

has Newspaper
comment: Relation between College Coach and Newspaper
range: newspaper
comment: Relazione tra College Coach e Newspaper @it
type: ObjectProperty
domain: college coach

has Protected Area
range: protected area
comment: Relazione tra College Coach e Protected Area @it
type: ObjectProperty
comment: Relation between College Coach and Protected Area
domain: college coach

broadcast
type: Class
label: Émission de télévision @fr

mammal
type: Class
label: mammifère @fr

island
label: île @fr
label: νησί @el
type: Class

has Poker Player
comment: Relazione tra College Coach e Poker Player @it
range: poker player
type: ObjectProperty
domain: college coach
comment: Relation between College Coach and Poker Player

comics character
type: Class
label: personnage de bandes dessinées @fr

has Planet
range: planet
comment: Relazione tra College Coach e Planet @it
domain: college coach
comment: Relation between College Coach and Planet
type: ObjectProperty

skyscraper
label: gratte-ciel @fr
type: Class

radio station
type: Class
label: station de radio @fr

has World Heritage Site
domain: college coach
range: World Heritage Site
comment: Relation between College Coach and World Heritage Site
comment: Relazione tra College Coach e World Heritage Site @it
type: ObjectProperty

Axiom
matching quantification: 7
annotated source: has Baseball Player
annotated target: after

member of parliament
type: Class
label: membre du Parlement @fr

has Soccer Club
comment: Relation between College Coach and Soccer Club
range: soccer club
comment: Relazione tra College Coach e Soccer Club @it
domain: college coach
type: ObjectProperty
related match: coachteams

airport
label: aéroport @fr
label: Flughafen @de
type: Class

Axiom
matching quantification: 1
annotated source: has American Football Team
annotated target: awards