has Chemical Compound
type: ObjectProperty
domain: congressman
comment: Relazione tra Congressman e Chemical Compound @it
comment: Relation between Congressman and Chemical Compound
range: chemical compound

has Protected Area
type: ObjectProperty
domain: congressman
comment: Relazione tra Congressman e Protected Area @it
range: protected area
comment: Relation between Congressman and Protected Area

has Baseball Player
comment: Relazione tra Congressman e Baseball Player @it
range: baseball player
comment: Relation between Congressman and Baseball Player
domain: congressman
type: ObjectProperty

television show
label: émission de télévision @fr
type: Class

disease
label: maladie @fr
type: Class

has Soccer Player
range: soccer player
comment: Relazione tra Congressman e Soccer Player @it
domain: congressman
type: ObjectProperty
comment: Relation between Congressman and Soccer Player

has Award
comment: Relation between Congressman and Award
comment: Relazione tra Congressman e Award @it
type: ObjectProperty
range: award
domain: congressman

automobile
type: Class

has Book
type: ObjectProperty
domain: congressman
comment: Relation between Congressman and Book
range: book
comment: Relazione tra Congressman e Book @it

american football player
label: joueur de football américain @fr
type: Class

stadium
type: Class
label: stade @fr

Ontology
has intent: To represent the encyclopedic knowledge expressed by an object typed as Congressman
has author: Andrea Giovanni Nuzzolese
extracted from: dbpedia.org
imports: cpannotationschema.owl
has author: Aldo Gangemi
comment: Congressman Encyclopedic Knowledge Pattern
has author: Valentina Presutti
extracted from: en.wikipedia.org

astronaut
type: Class
label: Astronaut @de
label: astronaute @fr

has Radio Station
type: ObjectProperty
range: radio station
comment: Relazione tra Congressman e Radio Station @it
domain: congressman
comment: Relation between Congressman and Radio Station

has American Football Player
range: american football player
comment: Relation between Congressman and American Football Player
comment: Relazione tra Congressman e American Football Player @it
domain: congressman
type: ObjectProperty
related match: after
related match: before

mayor
type: Class
label: maire @fr

has College
type: ObjectProperty
comment: Relation between Congressman and College
domain: congressman
range: college
comment: Relazione tra Congressman e College @it

pope
type: Class
label: pape @fr

species
label: espèce @fr
type: Class

has Mountain
comment: Relation between Congressman and Mountain
range: mountain
domain: congressman
type: ObjectProperty
comment: Relazione tra Congressman e Mountain @it

has Golf League
comment: Relation between Congressman and Golf League
domain: congressman
comment: Relazione tra Congressman e Golf League @it
type: ObjectProperty
range: golf league

has Mayor
range: mayor
comment: Relazione tra Congressman e Mayor @it
comment: Relation between Congressman and Mayor
domain: congressman
type: ObjectProperty

newspaper
label: journal @fr
type: Class

has Member Of Parliament
comment: Relation between Congressman and Member Of Parliament
comment: Relazione tra Congressman e Member Of Parliament @it
type: ObjectProperty
domain: congressman
range: member of parliament

has Judge
type: ObjectProperty
comment: Relazione tra Congressman e Judge @it
domain: congressman
range: judge
comment: Relation between Congressman and Judge

has Musical Artist
comment: Relazione tra Congressman e Musical Artist @it
type: ObjectProperty
domain: congressman
comment: Relation between Congressman and Musical Artist
range: musical artist

protected area
type: Class
label: προστατευμένη περιοχή @el
label: aire protégée @fr

road
type: Class
label: route @fr

has Band
range: Band
comment: Relation between Congressman and Band
comment: Relazione tra Congressman e Band @it
domain: congressman
type: ObjectProperty

boxer
label: boxeur @fr
type: Class

judge
label: juge @fr
type: Class

World Heritage Site
label: site du patrimoine mondial @fr
type: Class

Axiom
annotated source: has Soccer Manager
matching quantification: 1
annotated target: after

has Fish
range: fish
domain: congressman
comment: Relation between Congressman and Fish
comment: Relazione tra Congressman e Fish @it
type: ObjectProperty

station
type: Class

language
type: Class
label: langage @fr

has Currency
domain: congressman
type: ObjectProperty
range: currency
comment: Relation between Congressman and Currency
comment: Relazione tra Congressman e Currency @it

has Tennis Player
range: tennis player
comment: Relazione tra Congressman e Tennis Player @it
domain: congressman
comment: Relation between Congressman and Tennis Player
type: ObjectProperty

has Bridge
comment: Relazione tra Congressman e Bridge @it
range: bridge
type: ObjectProperty
comment: Relation between Congressman and Bridge
domain: congressman

has Cardinal
comment: Relazione tra Congressman e Cardinal @it
domain: congressman
type: ObjectProperty
comment: Relation between Congressman and Cardinal
range: cardinal

has Space Mission
type: ObjectProperty
range: space mission
comment: Relation between Congressman and Space Mission
comment: Relazione tra Congressman e Space Mission @it
domain: congressman

has Disease
type: ObjectProperty
range: disease
comment: Relation between Congressman and Disease
comment: Relazione tra Congressman e Disease @it
domain: congressman

lake
label: lac @fr
type: Class

has Television Show
type: ObjectProperty
domain: congressman
comment: Relazione tra Congressman e Television Show @it
range: television show
comment: Relation between Congressman and Television Show

has Broadcast
type: ObjectProperty
comment: Relation between Congressman and Broadcast
range: broadcast
comment: Relazione tra Congressman e Broadcast @it
domain: congressman

has Road
comment: Relation between Congressman and Road
type: ObjectProperty
comment: Relazione tra Congressman e Road @it
domain: congressman
range: road

has Journalist
comment: Relation between Congressman and Journalist
comment: Relazione tra Congressman e Journalist @it
range: journalist
domain: congressman
type: ObjectProperty

river
label: rivière @fr
type: Class

fish
label: poisson @fr
type: Class

museum
label: musée @fr
type: Class

ship
type: Class
label: navire @fr

tennis player
label: joueur de tennis @fr
type: Class

video game
type: Class
label: jeux vidéo @fr

trade union
label: syndicat professionnel @fr
type: Class

has Song
comment: Relazione tra Congressman e Song @it
type: ObjectProperty
range: song
domain: congressman
comment: Relation between Congressman and Song

has Canadian Football League
comment: Relazione tra Congressman e Canadian Football League @it
comment: Relation between Congressman and Canadian Football League
domain: congressman
range: canadian football league
type: ObjectProperty

has World Heritage Site
comment: Relation between Congressman and World Heritage Site
domain: congressman
comment: Relazione tra Congressman e World Heritage Site @it
type: ObjectProperty
range: World Heritage Site

currency
type: Class
label: devise @fr

British royalty
label: royauté Britannique @fr
type: Class

prime minister
label: premier ministre @fr
type: Class

race
label: course @fr
type: Class

historic place
type: Class
label: site historique @fr

hospital
type: Class
label: hôpital @fr

has Ethnic Group
domain: congressman
range: ethnic group
comment: Relazione tra Congressman e Ethnic Group @it
type: ObjectProperty
comment: Relation between Congressman and Ethnic Group

has River
domain: congressman
comment: Relazione tra Congressman e River @it
comment: Relation between Congressman and River
range: river
type: ObjectProperty

has Basketball League
domain: congressman
comment: Relazione tra Congressman e Basketball League @it
comment: Relation between Congressman and Basketball League
range: basketball league
type: ObjectProperty

has Race
domain: congressman
range: race
comment: Relazione tra Congressman e Race @it
type: ObjectProperty
comment: Relation between Congressman and Race

has Ship
comment: Relazione tra Congressman e Ship @it
type: ObjectProperty
range: ship
comment: Relation between Congressman and Ship
domain: congressman

continent
label: ήπειρος @el
type: Class

has American Football Team
range: american football team
type: ObjectProperty
comment: Relazione tra Congressman e American Football Team @it
domain: congressman
comment: Relation between Congressman and American Football Team

album
label: Album @de
type: Class

has Architect
type: ObjectProperty
comment: Relazione tra Congressman e Architect @it
domain: congressman
comment: Relation between Congressman and Architect
range: architect

has Fictional Character
type: ObjectProperty
comment: Relazione tra Congressman e Fictional Character @it
range: fictional character
domain: congressman
comment: Relation between Congressman and Fictional Character

has Shopping Mall
range: shopping mall
type: ObjectProperty
comment: Relation between Congressman and Shopping Mall
comment: Relazione tra Congressman e Shopping Mall @it
domain: congressman

has Bird
type: ObjectProperty
range: bird
comment: Relazione tra Congressman e Bird @it
domain: congressman
comment: Relation between Congressman and Bird

has Airport
type: ObjectProperty
comment: Relation between Congressman and Airport
comment: Relazione tra Congressman e Airport @it
domain: congressman
range: airport

has British Royalty
range: British royalty
comment: Relation between Congressman and British Royalty
type: ObjectProperty
domain: congressman
comment: Relazione tra Congressman e British Royalty @it

soccer manager
label: entraîneur de football @fr
type: Class

basketball team
type: Class

canadian football team
type: Class
label: équipe canadienne de football américain @fr

music genre
label: genre musical @fr
label: género musical @pt
type: Class

writer
label: écrivain @fr
type: Class

record label
type: Class
label: label discographique @fr

has Monarch
domain: congressman
range: monarch
type: ObjectProperty
comment: Relation between Congressman and Monarch
comment: Relazione tra Congressman e Monarch @it

architect
type: Class
label: architecte @fr

ambassador
label: ambassadeur @fr
type: Class

crustacean
label: crustacés @fr
type: Class

has Mammal
comment: Relazione tra Congressman e Mammal @it
type: ObjectProperty
domain: congressman
comment: Relation between Congressman and Mammal
range: mammal

has Lake
comment: Relazione tra Congressman e Lake @it
domain: congressman
comment: Relation between Congressman and Lake
type: ObjectProperty
range: lake

has Comedian
type: ObjectProperty
range: comedian
domain: congressman
comment: Relation between Congressman and Comedian
comment: Relazione tra Congressman e Comedian @it

has Museum
domain: congressman
type: ObjectProperty
comment: Relation between Congressman and Museum
comment: Relazione tra Congressman e Museum @it
range: museum

Axiom
annotated target: succeeded
annotated source: has Military Person
matching quantification: 1

has Astronaut
type: ObjectProperty
domain: congressman
range: astronaut
comment: Relazione tra Congressman e Astronaut @it
comment: Relation between Congressman and Astronaut

has Album
domain: congressman
comment: Relazione tra Congressman e Album @it
type: ObjectProperty
comment: Relation between Congressman and Album
range: album

chancellor
type: Class
label: chancelier @fr

comics creator
label: créateur de bandes dessinées @fr
type: Class

aircraft
label: avion @fr
type: Class
label: αεροσκάφος @el

hockey team
label: équipe de hockey @fr
type: Class

soccer player
type: Class
label: joueur de football @fr

airline
type: Class
label: compagnie aérienne @fr

monarch
type: Class
label: monarque @fr

congressman
label: membre du Congrès @fr
type: Class

golf player
label: golfeur @fr
type: Class

Axiom
annotated target: commands
annotated source: has Historic Place
matching quantification: 1

journalist
label: journaliste @fr
type: Class

space mission
type: Class
label: διαστημική αποστολή @el
label: mission spatiale @fr

has Fungus
comment: Relation between Congressman and Fungus
range: fungus
domain: congressman
comment: Relazione tra Congressman e Fungus @it
type: ObjectProperty

film
label: ταινία @el
type: Class

has Beverage
comment: Relazione tra Congressman e Beverage @it
range: beverage
comment: Relation between Congressman and Beverage
domain: congressman
type: ObjectProperty

american football team
label: équipe américaine de football américain @fr
type: Class

has American Football League
domain: congressman
type: ObjectProperty
comment: Relazione tra Congressman e American Football League @it
range: american football league
comment: Relation between Congressman and American Football League

Supreme Court of the United States case
label: cas juridique de la Cour suprême des États-Unis @fr
type: Class

bird
label: oiseau @fr
type: Class

chemical compound
label: produit chimique @fr
type: Class

has Non- Profit Organisation
range: non-profit organisation
comment: Relation between Congressman and Non- Profit Organisation
domain: congressman
type: ObjectProperty
comment: Relazione tra Congressman e Non- Profit Organisation @it

has Sport
comment: Relation between Congressman and Sport
type: ObjectProperty
comment: Relazione tra Congressman e Sport @it
domain: congressman
range: sport

fungus
label: fungi @fr
type: Class

musical artist
label: artista musical @pt
type: Class
label: musicien @fr

has Single
domain: congressman
comment: Relazione tra Congressman e Single @it
type: ObjectProperty
comment: Relation between Congressman and Single
range: single

has Airline
range: airline
comment: Relazione tra Congressman e Airline @it
domain: congressman
comment: Relation between Congressman and Airline
type: ObjectProperty

has Olympics
range: olympics
domain: congressman
type: ObjectProperty
comment: Relation between Congressman and Olympics
comment: Relazione tra Congressman e Olympics @it

Axiom
annotated target: before
annotated source: has American Football Player
matching quantification: 2

fictional character
label: personnage de fiction @fr
type: Class

park
type: Class
label: parc @fr

has Soccer Manager
related match: after
comment: Relazione tra Congressman e Soccer Manager @it
type: ObjectProperty
comment: Relation between Congressman and Soccer Manager
range: soccer manager
domain: congressman

Axiom
annotated source: has Military Person
matching quantification: 1
annotated target: preceded

cardinal
type: Class

has Drug
type: ObjectProperty
domain: congressman
comment: Relazione tra Congressman e Drug @it
range: drug
comment: Relation between Congressman and Drug

rugby player
label: joueur de rugby @fr
type: Class

american football league
type: Class

has Cricketer
type: ObjectProperty
comment: Relation between Congressman and Cricketer
domain: congressman
range: cricketer
comment: Relazione tra Congressman e Cricketer @it

has Canal
comment: Relation between Congressman and Canal
domain: congressman
range: canal
type: ObjectProperty
comment: Relazione tra Congressman e Canal @it

actor
label: Schauspieler @de
type: Class
label: acteur @fr

has Actor
type: ObjectProperty
domain: congressman
comment: Relation between Congressman and Actor
range: actor
comment: Relazione tra Congressman e Actor @it

has Philosopher
range: philosopher
domain: congressman
comment: Relation between Congressman and Philosopher
comment: Relazione tra Congressman e Philosopher @it
type: ObjectProperty

has College Coach
comment: Relazione tra Congressman e College Coach @it
comment: Relation between Congressman and College Coach
type: ObjectProperty
domain: congressman
range: college coach

Axiom
matching quantification: 4
annotated source: has Military Person
annotated target: after

has Ambassador
related match: after
domain: congressman
type: ObjectProperty
range: ambassador
comment: Relation between Congressman and Ambassador
comment: Relazione tra Congressman e Ambassador @it

has Crustacean
comment: Relation between Congressman and Crustacean
type: ObjectProperty
domain: congressman
range: crustacean
comment: Relazione tra Congressman e Crustacean @it

basketball league
label: ligue de basketball @fr
type: Class

Axiom
annotated source: has Military Person
matching quantification: 6
annotated target: before

mountain
type: Class
label: montagne @fr
label: Βουνό @el

criminal
type: Class
label: criminel @fr

flowering plant
type: Class
label: angiospermes @fr

saint
type: Class

comedian
type: Class
label: comédien @fr

valley
label: vallée @fr
type: Class

song
label: chanson @fr
type: Class

has Golf Player
range: golf player
type: ObjectProperty
comment: Relation between Congressman and Golf Player
comment: Relazione tra Congressman e Golf Player @it
domain: congressman

has Mountain Range
comment: Relation between Congressman and Mountain Range
domain: congressman
type: ObjectProperty
comment: Relazione tra Congressman e Mountain Range @it
range: mountain range

book
type: Class
label: livre @fr
label: βιβλίο @el
label: llibre @ca
label: książka @pl

has Hockey Team
comment: Relazione tra Congressman e Hockey Team @it
comment: Relation between Congressman and Hockey Team
range: hockey team
type: ObjectProperty
domain: congressman

shopping mall
label: centre commercial @fr
type: Class

has Saint
comment: Relazione tra Congressman e Saint @it
comment: Relation between Congressman and Saint
type: ObjectProperty
range: saint
domain: congressman

non-profit organisation
label: organisation à but non lucratif @fr
type: Class

space station
label: station spatiale @fr
type: Class

has Artery
comment: Relazione tra Congressman e Artery @it
comment: Relation between Congressman and Artery
range: artery
domain: congressman
type: ObjectProperty

Axiom
matching quantification: 1
annotated target: after
annotated source: has Ambassador

canadian football league
type: Class

weapon
type: Class
label: arme @fr

has Species
domain: congressman
range: species
comment: Relazione tra Congressman e Species @it
type: ObjectProperty
comment: Relation between Congressman and Species

drug
label: médicament @fr
type: Class

has Trade Union
comment: Relation between Congressman and Trade Union
type: ObjectProperty
comment: Relazione tra Congressman e Trade Union @it
range: trade union
domain: congressman

magazine
label: περιοδικό @el
type: Class

has Video Game
domain: congressman
type: ObjectProperty
range: video game
comment: Relation between Congressman and Video Game
comment: Relazione tra Congressman e Video Game @it

canal
type: Class

has Film
comment: Relazione tra Congressman e Film @it
type: ObjectProperty
range: film
domain: congressman
comment: Relation between Congressman and Film

military person
type: Class
label: militaire @fr

Axiom
annotated source: has Military Person
annotated target: spouse
matching quantification: 1

has Historic Building
comment: Relation between Congressman and Historic Building
comment: Relazione tra Congressman e Historic Building @it
range: historic building
domain: congressman
type: ObjectProperty

philosopher
label: philosophe @fr
type: Class

award
type: Class
label: récompense @fr

college
type: Class

sport
type: Class

cricketer
label: joueur de cricket @fr
type: Class

single
type: Class

Band
label: banda @pt
label: Musikgruppe @de
type: Class
label: groupe de musique @fr

has Conifer
type: ObjectProperty
comment: Relation between Congressman and Conifer
comment: Relazione tra Congressman e Conifer @it
domain: congressman
range: conifer

has Criminal
range: criminal
type: ObjectProperty
domain: congressman
comment: Relazione tra Congressman e Criminal @it
comment: Relation between Congressman and Criminal

has Military Person
related match: after
comment: Relazione tra Congressman e Military Person @it
related match: preceded
related match: succeeded
type: ObjectProperty
range: military person
related match: spouse
domain: congressman
comment: Relation between Congressman and Military Person
related match: before

has Baseball League
comment: Relation between Congressman and Baseball League
type: ObjectProperty
domain: congressman
comment: Relazione tra Congressman e Baseball League @it
range: baseball league

has Continent
comment: Relazione tra Congressman e Continent @it
comment: Relation between Congressman and Continent
range: continent
type: ObjectProperty
domain: congressman

ethnic group
type: Class
label: groupe ethnique @fr

has Prime Minister
comment: Relazione tra Congressman e Prime Minister @it
type: ObjectProperty
comment: Relation between Congressman and Prime Minister
range: prime minister
domain: congressman

has Comics Creator
comment: Relazione tra Congressman e Comics Creator @it
type: ObjectProperty
domain: congressman
comment: Relation between Congressman and Comics Creator
range: comics creator

artery
label: Arterie @de
type: Class
label: artère @fr

has Skyscraper
domain: congressman
comment: Relation between Congressman and Skyscraper
comment: Relazione tra Congressman e Skyscraper @it
type: ObjectProperty
range: skyscraper

has Park
comment: Relation between Congressman and Park
type: ObjectProperty
range: park
domain: congressman
comment: Relazione tra Congressman e Park @it

college coach
label: entraîneur universitaire @fr
type: Class

village
label: χωριό @el
type: Class

has Newspaper
type: ObjectProperty
comment: Relazione tra Congressman e Newspaper @it
comment: Relation between Congressman and Newspaper
range: newspaper
domain: congressman

historic building
label: bâtiment historique @fr
type: Class

has Basketball Team
range: basketball team
comment: Relazione tra Congressman e Basketball Team @it
comment: Relation between Congressman and Basketball Team
type: ObjectProperty
domain: congressman

has Aircraft
type: ObjectProperty
domain: congressman
comment: Relazione tra Congressman e Aircraft @it
comment: Relation between Congressman and Aircraft
range: aircraft

baseball player
label: joueur de baseball @fr
type: Class

basketball player
label: joueur de basketball @fr
type: Class

has Hospital
type: ObjectProperty
comment: Relation between Congressman and Hospital
range: hospital
comment: Relazione tra Congressman e Hospital @it
domain: congressman

has Pope
domain: congressman
type: ObjectProperty
comment: Relazione tra Congressman e Pope @it
comment: Relation between Congressman and Pope
range: pope

has Island
type: ObjectProperty
range: island
domain: congressman
comment: Relazione tra Congressman e Island @it
comment: Relation between Congressman and Island

has Writer
range: writer
comment: Relazione tra Congressman e Writer @it
domain: congressman
comment: Relation between Congressman and Writer
type: ObjectProperty

has Stadium
comment: Relation between Congressman and Stadium
domain: congressman
type: ObjectProperty
range: stadium
comment: Relazione tra Congressman e Stadium @it

has Space Station
range: space station
comment: Relation between Congressman and Space Station
domain: congressman
type: ObjectProperty
comment: Relazione tra Congressman e Space Station @it

has Rugby Player
domain: congressman
type: ObjectProperty
comment: Relazione tra Congressman e Rugby Player @it
comment: Relation between Congressman and Rugby Player
range: rugby player

mountain range
label: chaîne de montagne @fr
type: Class

beverage
label: boisson @fr
type: Class

has Canadian Football Team
range: canadian football team
domain: congressman
comment: Relazione tra Congressman e Canadian Football Team @it
comment: Relation between Congressman and Canadian Football Team
type: ObjectProperty

has Station
domain: congressman
range: station
type: ObjectProperty
comment: Relazione tra Congressman e Station @it
comment: Relation between Congressman and Station

has Boxer
type: ObjectProperty
comment: Relazione tra Congressman e Boxer @it
domain: congressman
comment: Relation between Congressman and Boxer
range: boxer

has Chancellor
domain: congressman
comment: Relation between Congressman and Chancellor
comment: Relazione tra Congressman e Chancellor @it
range: chancellor
type: ObjectProperty

scientist
label: Wissenschaftler @de
type: Class
label: scientifique @fr

golf league
label: ligue de golf @fr
type: Class

has Historic Place
related match: commands
type: ObjectProperty
comment: Relazione tra Congressman e Historic Place @it
range: historic place
comment: Relation between Congressman and Historic Place
domain: congressman

olympics
type: Class
label: Jeux Olympiques @fr

baseball league
type: Class
label: ligue de baseball @fr

Axiom
matching quantification: 3
annotated source: has American Football Player
annotated target: after

bridge
label: pont @fr
type: Class

has Flowering Plant
range: flowering plant
comment: Relazione tra Congressman e Flowering Plant @it
comment: Relation between Congressman and Flowering Plant
type: ObjectProperty
domain: congressman

has Automobile
type: ObjectProperty
comment: Relation between Congressman and Automobile
domain: congressman
range: automobile
comment: Relazione tra Congressman e Automobile @it

broadcast
type: Class
label: Émission de télévision @fr

has Supreme Court Of The United States Case
comment: Relation between Congressman and Supreme Court Of The United States Case
type: ObjectProperty
range: Supreme Court of the United States case
comment: Relazione tra Congressman e Supreme Court Of The United States Case @it
domain: congressman

has Basketball Player
range: basketball player
comment: Relazione tra Congressman e Basketball Player @it
domain: congressman
comment: Relation between Congressman and Basketball Player
type: ObjectProperty

mammal
type: Class
label: mammifère @fr

has Language
comment: Relation between Congressman and Language
domain: congressman
comment: Relazione tra Congressman e Language @it
type: ObjectProperty
range: language

has Magazine
type: ObjectProperty
domain: congressman
range: magazine
comment: Relation between Congressman and Magazine
comment: Relazione tra Congressman e Magazine @it

island
label: île @fr
label: νησί @el
type: Class

has Village
domain: congressman
comment: Relation between Congressman and Village
type: ObjectProperty
range: village
comment: Relazione tra Congressman e Village @it

has Scientist
comment: Relazione tra Congressman e Scientist @it
type: ObjectProperty
domain: congressman
comment: Relation between Congressman and Scientist
range: scientist

has Weapon
domain: congressman
comment: Relazione tra Congressman e Weapon @it
comment: Relation between Congressman and Weapon
range: weapon
type: ObjectProperty

skyscraper
label: gratte-ciel @fr
type: Class

radio station
label: station de radio @fr
type: Class

has Valley
range: valley
type: ObjectProperty
comment: Relazione tra Congressman e Valley @it
comment: Relation between Congressman and Valley
domain: congressman

member of parliament
type: Class
label: membre du Parlement @fr

has Record Label
range: record label
type: ObjectProperty
comment: Relation between Congressman and Record Label
comment: Relazione tra Congressman e Record Label @it
domain: congressman

has Music Genre
comment: Relation between Congressman and Music Genre
comment: Relazione tra Congressman e Music Genre @it
range: music genre
domain: congressman
type: ObjectProperty

conifer
label: conifères @fr
type: Class

airport
type: Class
label: Flughafen @de
label: aéroport @fr