has Stadium
comment: Relation between Convention and Stadium
domain: convention
range: stadium
type: ObjectProperty
comment: Relazione tra Convention e Stadium @it

has Military Unit
comment: Relation between Convention and Military Unit
domain: convention
comment: Relazione tra Convention e Military Unit @it
type: ObjectProperty
range: military unit

disease
label: maladie @fr
type: Class

has Music Genre
comment: Relation between Convention and Music Genre
type: ObjectProperty
comment: Relazione tra Convention e Music Genre @it
domain: convention
range: music genre

has Comics Character
type: ObjectProperty
range: comics character
comment: Relazione tra Convention e Comics Character @it
comment: Relation between Convention and Comics Character
domain: convention

rugby player
label: joueur de rugby @fr
type: Class

has Hotel
comment: Relation between Convention and Hotel
range: hotel
comment: Relazione tra Convention e Hotel @it
domain: convention
type: ObjectProperty

has Wrestler
type: ObjectProperty
domain: convention
comment: Relazione tra Convention e Wrestler @it
comment: Relation between Convention and Wrestler
range: wrestler

american football player
type: Class
label: joueur de football américain @fr

stadium
label: stade @fr
type: Class

has Astronaut
comment: Relazione tra Convention e Astronaut @it
range: astronaut
comment: Relation between Convention and Astronaut
domain: convention
type: ObjectProperty

astronaut
type: Class
label: Astronaut @de
label: astronaute @fr

videogames league
type: Class
label: ligue de jeux vidéo @fr

has Film Festival
comment: Relazione tra Convention e Film Festival @it
domain: convention
type: ObjectProperty
range: film festival
comment: Relation between Convention and Film Festival

has Game
comment: Relation between Convention and Game
range: game
type: ObjectProperty
domain: convention
comment: Relazione tra Convention e Game @it

has Song
comment: Relazione tra Convention e Song @it
type: ObjectProperty
range: song
domain: convention
comment: Relation between Convention and Song

wrestler
type: Class
label: lutteur @fr

has World Heritage Site
comment: Relation between Convention and World Heritage Site
range: World Heritage Site
type: ObjectProperty
comment: Relazione tra Convention e World Heritage Site @it
domain: convention

has Hospital
comment: Relazione tra Convention e Hospital @it
comment: Relation between Convention and Hospital
range: hospital
type: ObjectProperty
domain: convention

comedian
label: comédien @fr
type: Class

song
label: chanson @fr
type: Class

newspaper
type: Class
label: journal @fr

has Continent
type: ObjectProperty
comment: Relazione tra Convention e Continent @it
range: continent
domain: convention
comment: Relation between Convention and Continent

has Adult Actor
comment: Relazione tra Convention e Adult Actor @it
range: adult actor
comment: Relation between Convention and Adult Actor
type: ObjectProperty
domain: convention

game
label: jeu @fr
type: Class

road
label: route @fr
type: Class

has Rugby Player
range: rugby player
comment: Relation between Convention and Rugby Player
domain: convention
type: ObjectProperty
comment: Relazione tra Convention e Rugby Player @it

has Videogames League
comment: Relazione tra Convention e Videogames League @it
domain: convention
type: ObjectProperty
comment: Relation between Convention and Videogames League
range: videogames league

convention
type: Class
label: congrès @fr

book
type: Class
label: livre @fr
label: βιβλίο @el
label: książka @pl
label: llibre @ca

boxer
label: boxeur @fr
type: Class

has Model
type: ObjectProperty
comment: Relation between Convention and Model
comment: Relazione tra Convention e Model @it
domain: convention
range: model

World Heritage Site
type: Class
label: site du patrimoine mondial @fr

shopping mall
label: centre commercial @fr
type: Class

has Architect
comment: Relation between Convention and Architect
domain: convention
range: architect
comment: Relazione tra Convention e Architect @it
type: ObjectProperty

language
type: Class
label: langage @fr

has Village
comment: Relation between Convention and Village
range: village
comment: Relazione tra Convention e Village @it
type: ObjectProperty
domain: convention

non-profit organisation
type: Class
label: organisation à but non lucratif @fr

has Disease
comment: Relazione tra Convention e Disease @it
type: ObjectProperty
range: disease
comment: Relation between Convention and Disease
domain: convention

has Island
comment: Relation between Convention and Island
type: ObjectProperty
domain: convention
comment: Relazione tra Convention e Island @it
range: island

has Newspaper
range: newspaper
comment: Relazione tra Convention e Newspaper @it
comment: Relation between Convention and Newspaper
type: ObjectProperty
domain: convention

has British Royalty
comment: Relation between Convention and British Royalty
domain: convention
type: ObjectProperty
range: British royalty
comment: Relazione tra Convention e British Royalty @it

has Soccer Manager
type: ObjectProperty
comment: Relazione tra Convention e Soccer Manager @it
domain: convention
comment: Relation between Convention and Soccer Manager
range: soccer manager

has Airport
type: ObjectProperty
comment: Relazione tra Convention e Airport @it
domain: convention
comment: Relation between Convention and Airport
range: airport

river
label: rivière @fr
type: Class

magazine
label: περιοδικό @el
type: Class

school
label: école @fr
type: Class

fish
type: Class
label: poisson @fr

museum
type: Class
label: musée @fr

has Video Game
comment: Relazione tra Convention e Video Game @it
type: ObjectProperty
comment: Relation between Convention and Video Game
domain: convention
range: video game

tennis player
type: Class
label: joueur de tennis @fr

video game
type: Class
label: jeux vidéo @fr

has Journalist
domain: convention
comment: Relazione tra Convention e Journalist @it
comment: Relation between Convention and Journalist
type: ObjectProperty
range: journalist

military person
label: militaire @fr
type: Class

has Historic Place
type: ObjectProperty
range: historic place
domain: convention
comment: Relazione tra Convention e Historic Place @it
comment: Relation between Convention and Historic Place

award
type: Class
label: récompense @fr

has Language
type: ObjectProperty
comment: Relazione tra Convention e Language @it
domain: convention
comment: Relation between Convention and Language
range: language

has Soccer Player
comment: Relation between Convention and Soccer Player
range: soccer player
domain: convention
comment: Relazione tra Convention e Soccer Player @it
type: ObjectProperty

British royalty
label: royauté Britannique @fr
type: Class

historic place
type: Class
label: site historique @fr

has Shopping Mall
comment: Relazione tra Convention e Shopping Mall @it
range: shopping mall
comment: Relation between Convention and Shopping Mall
domain: convention
type: ObjectProperty

college
type: Class

hospital
type: Class
label: hôpital @fr

sport
type: Class

has Website
comment: Relazione tra Convention e Website @it
range: website
type: ObjectProperty
domain: convention
comment: Relation between Convention and Website

single
type: Class

town
type: Class
label: ville @fr

has Skyscraper
domain: convention
comment: Relazione tra Convention e Skyscraper @it
type: ObjectProperty
comment: Relation between Convention and Skyscraper
range: skyscraper

has Road
comment: Relazione tra Convention e Road @it
range: road
type: ObjectProperty
comment: Relation between Convention and Road
domain: convention

continent
label: ήπειρος @el
type: Class

ethnic group
label: groupe ethnique @fr
type: Class

has Sport
type: ObjectProperty
range: sport
comment: Relation between Convention and Sport
domain: convention
comment: Relazione tra Convention e Sport @it

has Scientist
range: scientist
comment: Relation between Convention and Scientist
type: ObjectProperty
comment: Relazione tra Convention e Scientist @it
domain: convention

album
type: Class
label: Album @de

figure skater
type: Class
label: patineur artistique @fr

has Congressman
domain: convention
type: ObjectProperty
comment: Relazione tra Convention e Congressman @it
comment: Relation between Convention and Congressman
range: congressman

has School
comment: Relazione tra Convention e School @it
domain: convention
range: school
type: ObjectProperty
comment: Relation between Convention and School

Ontology
imports: cpannotationschema.owl
has author: Valentina Presutti
comment: Convention Encyclopedic Knowledge Pattern
extracted from: dbpedia.org
has author: Andrea Giovanni Nuzzolese
extracted from: en.wikipedia.org
has intent: To represent the encyclopedic knowledge expressed by an object typed as Convention
has author: Aldo Gangemi

hotel
type: Class
label: hôtel @fr

has Basketball Player
comment: Relazione tra Convention e Basketball Player @it
domain: convention
type: ObjectProperty
range: basketball player
comment: Relation between Convention and Basketball Player

has Magazine
range: magazine
comment: Relation between Convention and Magazine
type: ObjectProperty
domain: convention
comment: Relazione tra Convention e Magazine @it

has Award
range: award
comment: Relazione tra Convention e Award @it
comment: Relation between Convention and Award
type: ObjectProperty
domain: convention

military unit
label: unité militaire @fr
type: Class

has Figure Skater
comment: Relazione tra Convention e Figure Skater @it
range: figure skater
comment: Relation between Convention and Figure Skater
domain: convention
type: ObjectProperty

television episode
label: épisode télévisé @fr
type: Class

soccer manager
label: entraîneur de football @fr
type: Class

has River
type: ObjectProperty
comment: Relazione tra Convention e River @it
comment: Relation between Convention and River
domain: convention
range: river

village
label: χωριό @el
type: Class

has Album
domain: convention
comment: Relazione tra Convention e Album @it
comment: Relation between Convention and Album
type: ObjectProperty
range: album

has Television Episode
comment: Relazione tra Convention e Television Episode @it
domain: convention
type: ObjectProperty
range: television episode
comment: Relation between Convention and Television Episode

has Tennis Player
type: ObjectProperty
range: tennis player
comment: Relation between Convention and Tennis Player
domain: convention
comment: Relazione tra Convention e Tennis Player @it

music genre
label: genre musical @fr
label: género musical @pt
type: Class

has Comedian
type: ObjectProperty
domain: convention
comment: Relazione tra Convention e Comedian @it
range: comedian
comment: Relation between Convention and Comedian

has Broadcast
type: ObjectProperty
range: broadcast
comment: Relazione tra Convention e Broadcast @it
comment: Relation between Convention and Broadcast
domain: convention

has Formula One Racer
range: Formula One racer
comment: Relazione tra Convention e Formula One Racer @it
domain: convention
comment: Relation between Convention and Formula One Racer
type: ObjectProperty

has Boxer
range: boxer
comment: Relazione tra Convention e Boxer @it
domain: convention
comment: Relation between Convention and Boxer
type: ObjectProperty

baseball player
type: Class
label: joueur de baseball @fr

office holder
label: titulaire @fr
label: Amtsinhaber @de
type: Class

architect
label: architecte @fr
type: Class

website
type: Class
label: site web @fr
label: Ιστότοπος @el

model
type: Class
label: mannequin @fr

has Member Of Parliament
range: member of parliament
type: ObjectProperty
domain: convention
comment: Relazione tra Convention e Member Of Parliament @it
comment: Relation between Convention and Member Of Parliament

has Office Holder
domain: convention
type: ObjectProperty
range: office holder
comment: Relazione tra Convention e Office Holder @it
comment: Relation between Convention and Office Holder

has Fish
domain: convention
type: ObjectProperty
comment: Relation between Convention and Fish
comment: Relazione tra Convention e Fish @it
range: fish

has Book
domain: convention
type: ObjectProperty
comment: Relation between Convention and Book
range: book
comment: Relazione tra Convention e Book @it

film festival
label: festival du film @fr
type: Class

basketball player
type: Class
label: joueur de basketball @fr

adult actor
label: erwachsener Schauspieler @de
type: Class
label: acteur adulte @fr

has Baseball Player
type: ObjectProperty
domain: convention
comment: Relazione tra Convention e Baseball Player @it
comment: Relation between Convention and Baseball Player
range: baseball player

ice hockey player
type: Class
label: joueur de hockey sur glace @fr

has Mammal
range: mammal
comment: Relazione tra Convention e Mammal @it
comment: Relation between Convention and Mammal
type: ObjectProperty
domain: convention

beverage
type: Class
label: boisson @fr

has Military Person
comment: Relation between Convention and Military Person
range: military person
comment: Relazione tra Convention e Military Person @it
domain: convention
type: ObjectProperty

has Museum
comment: Relazione tra Convention e Museum @it
comment: Relation between Convention and Museum
type: ObjectProperty
range: museum
domain: convention

has Bird
type: ObjectProperty
comment: Relation between Convention and Bird
range: bird
comment: Relazione tra Convention e Bird @it
domain: convention

planet
label: planète @fr
type: Class

has Ice Hockey Player
comment: Relazione tra Convention e Ice Hockey Player @it
domain: convention
range: ice hockey player
comment: Relation between Convention and Ice Hockey Player
type: ObjectProperty

soccer player
type: Class
label: joueur de football @fr

scientist
label: Wissenschaftler @de
type: Class
label: scientifique @fr

has Planet
domain: convention
type: ObjectProperty
comment: Relation between Convention and Planet
comment: Relazione tra Convention e Planet @it
range: planet

legislature
type: Class
label: pouvoir législatif @fr

has American Football Player
range: american football player
domain: convention
comment: Relation between Convention and American Football Player
type: ObjectProperty
comment: Relazione tra Convention e American Football Player @it

has Beverage
type: ObjectProperty
domain: convention
comment: Relazione tra Convention e Beverage @it
range: beverage
comment: Relation between Convention and Beverage

has College
range: college
comment: Relation between Convention and College
comment: Relazione tra Convention e College @it
domain: convention
type: ObjectProperty

olympics
type: Class
label: Jeux Olympiques @fr

has Legislature
comment: Relation between Convention and Legislature
type: ObjectProperty
domain: convention
range: legislature
comment: Relazione tra Convention e Legislature @it

congressman
type: Class
label: membre du Congrès @fr

has Non- Profit Organisation
domain: convention
range: non-profit organisation
comment: Relazione tra Convention e Non- Profit Organisation @it
comment: Relation between Convention and Non- Profit Organisation
type: ObjectProperty

journalist
label: journaliste @fr
type: Class

has Single
range: single
type: ObjectProperty
comment: Relation between Convention and Single
comment: Relazione tra Convention e Single @it
domain: convention

broadcast
label: Émission de télévision @fr
type: Class

insect
label: insecte @fr
type: Class

mammal
type: Class
label: mammifère @fr

island
label: île @fr
label: νησί @el
type: Class

has Insect
domain: convention
type: ObjectProperty
comment: Relation between Convention and Insect
range: insect
comment: Relazione tra Convention e Insect @it

comics character
type: Class
label: personnage de bandes dessinées @fr

chemical compound
type: Class
label: produit chimique @fr

bird
label: oiseau @fr
type: Class

skyscraper
label: gratte-ciel @fr
type: Class

Formula One racer
type: Class
label: pilote de formule 1 @fr

has Chemical Compound
range: chemical compound
domain: convention
comment: Relation between Convention and Chemical Compound
comment: Relazione tra Convention e Chemical Compound @it
type: ObjectProperty

has Olympics
comment: Relation between Convention and Olympics
type: ObjectProperty
range: olympics
comment: Relazione tra Convention e Olympics @it
domain: convention

member of parliament
label: membre du Parlement @fr
type: Class

has Town
comment: Relazione tra Convention e Town @it
domain: convention
range: town
type: ObjectProperty
comment: Relation between Convention and Town

has Ethnic Group
type: ObjectProperty
domain: convention
comment: Relazione tra Convention e Ethnic Group @it
comment: Relation between Convention and Ethnic Group
range: ethnic group

airport
label: aéroport @fr
label: Flughafen @de
type: Class