has Mountain
range: mountain
comment: Relation between Film Festival and Mountain
type: ObjectProperty
domain: film festival
comment: Relazione tra Film Festival e Mountain @it

television show
label: émission de télévision @fr
type: Class

park
label: parc @fr
type: Class

disease
label: maladie @fr
type: Class

has Single
range: single
comment: Relation between Film Festival and Single
domain: film festival
comment: Relazione tra Film Festival e Single @it
type: ObjectProperty

has Stadium
domain: film festival
range: stadium
comment: Relazione tra Film Festival e Stadium @it
comment: Relation between Film Festival and Stadium
type: ObjectProperty

has Baseball Player
comment: Relazione tra Film Festival e Baseball Player @it
domain: film festival
comment: Relation between Film Festival and Baseball Player
type: ObjectProperty
range: baseball player

has University
type: ObjectProperty
domain: film festival
comment: Relazione tra Film Festival e University @it
comment: Relation between Film Festival and University
range: university

Election
type: Class
label: élection @fr

musical
label: musique @fr
type: Class

has Congressman
domain: film festival
type: ObjectProperty
range: congressman
comment: Relation between Film Festival and Congressman
comment: Relazione tra Film Festival e Congressman @it

has Convention
comment: Relation between Film Festival and Convention
range: convention
type: ObjectProperty
comment: Relazione tra Film Festival e Convention @it
domain: film festival

has Band
range: Band
comment: Relazione tra Film Festival e Band @it
comment: Relation between Film Festival and Band
type: ObjectProperty
domain: film festival

has Museum
domain: film festival
range: museum
type: ObjectProperty
comment: Relazione tra Film Festival e Museum @it
comment: Relation between Film Festival and Museum

has Military Person
range: military person
comment: Relazione tra Film Festival e Military Person @it
comment: Relation between Film Festival and Military Person
type: ObjectProperty
domain: film festival

has Village
comment: Relazione tra Film Festival e Village @it
type: ObjectProperty
domain: film festival
comment: Relation between Film Festival and Village
range: village

has President
type: ObjectProperty
domain: film festival
comment: Relation between Film Festival and President
range: president
comment: Relazione tra Film Festival e President @it

stadium
type: Class
label: stade @fr

has Comics Creator
type: ObjectProperty
comment: Relation between Film Festival and Comics Creator
comment: Relazione tra Film Festival e Comics Creator @it
range: comics creator
domain: film festival

has Wrestler
comment: Relation between Film Festival and Wrestler
type: ObjectProperty
range: wrestler
domain: film festival
comment: Relazione tra Film Festival e Wrestler @it

mountain
type: Class
label: montagne @fr
label: Βουνό @el

wrestler
type: Class
label: lutteur @fr

criminal
label: criminel @fr
type: Class

has Language
related match: language
type: ObjectProperty
comment: Relation between Film Festival and Language
domain: film festival
range: language
comment: Relazione tra Film Festival e Language @it

mayor
label: maire @fr
type: Class

has Musical
range: musical
domain: film festival
type: ObjectProperty
comment: Relazione tra Film Festival e Musical @it
comment: Relation between Film Festival and Musical

has Airline
comment: Relation between Film Festival and Airline
type: ObjectProperty
range: airline
domain: film festival
comment: Relazione tra Film Festival e Airline @it

senator
type: Class
label: sénateur @fr

has Military Conflict
range: military conflict
domain: film festival
type: ObjectProperty
comment: Relation between Film Festival and Military Conflict
comment: Relazione tra Film Festival e Military Conflict @it

comedian
type: Class
label: comédien @fr

has Town
range: town
type: ObjectProperty
comment: Relazione tra Film Festival e Town @it
domain: film festival
comment: Relation between Film Festival and Town

has British Royalty
comment: Relazione tra Film Festival e British Royalty @it
domain: film festival
range: British royalty
comment: Relation between Film Festival and British Royalty
type: ObjectProperty

newspaper
type: Class
label: journal @fr

convention
type: Class
label: congrès @fr

book
type: Class
label: livre @fr
label: βιβλίο @el
label: llibre @ca
label: książka @pl

has Bird
comment: Relazione tra Film Festival e Bird @it
comment: Relation between Film Festival and Bird
type: ObjectProperty
domain: film festival
range: bird

has Video Game
comment: Relazione tra Film Festival e Video Game @it
domain: film festival
range: video game
comment: Relation between Film Festival and Video Game
type: ObjectProperty

World Heritage Site
label: site du patrimoine mondial @fr
type: Class

shopping mall
type: Class
label: centre commercial @fr

has Mammal
range: mammal
domain: film festival
type: ObjectProperty
comment: Relation between Film Festival and Mammal
comment: Relazione tra Film Festival e Mammal @it

Ontology
imports: cpannotationschema.owl
has author: Aldo Gangemi
comment: FilmFestival Encyclopedic Knowledge Pattern
extracted from: en.wikipedia.org
has intent: To represent the encyclopedic knowledge expressed by an object typed as FilmFestival
extracted from: dbpedia.org
has author: Andrea Giovanni Nuzzolese
has author: Valentina Presutti

language
label: langage @fr
type: Class

has Member Of Parliament
type: ObjectProperty
comment: Relazione tra Film Festival e Member Of Parliament @it
comment: Relation between Film Festival and Member Of Parliament
domain: film festival
range: member of parliament

has Election
type: ObjectProperty
comment: Relation between Film Festival and Election
domain: film festival
range: Election
comment: Relazione tra Film Festival e Election @it

non-profit organisation
type: Class
label: organisation à but non lucratif @fr

has Senator
domain: film festival
comment: Relazione tra Film Festival e Senator @it
type: ObjectProperty
comment: Relation between Film Festival and Senator
range: senator

has Non- Profit Organisation
type: ObjectProperty
comment: Relazione tra Film Festival e Non- Profit Organisation @it
comment: Relation between Film Festival and Non- Profit Organisation
range: non-profit organisation
domain: film festival

governor
type: Class
label: gouverneur @fr

has Airport
range: airport
comment: Relation between Film Festival and Airport
type: ObjectProperty
domain: film festival
comment: Relazione tra Film Festival e Airport @it

has Skyscraper
comment: Relazione tra Film Festival e Skyscraper @it
domain: film festival
range: skyscraper
type: ObjectProperty
comment: Relation between Film Festival and Skyscraper

magazine
type: Class
label: περιοδικό @el

school
label: école @fr
type: Class

museum
label: musée @fr
type: Class

has Comedian
comment: Relazione tra Film Festival e Comedian @it
domain: film festival
range: comedian
comment: Relation between Film Festival and Comedian
type: ObjectProperty

has World Heritage Site
comment: Relation between Film Festival and World Heritage Site
type: ObjectProperty
domain: film festival
range: World Heritage Site
comment: Relazione tra Film Festival e World Heritage Site @it

has Continent
domain: film festival
type: ObjectProperty
comment: Relation between Film Festival and Continent
comment: Relazione tra Film Festival e Continent @it
range: continent

has Comics Character
type: ObjectProperty
domain: film festival
comment: Relation between Film Festival and Comics Character
range: comics character
comment: Relazione tra Film Festival e Comics Character @it

video game
type: Class
label: jeux vidéo @fr

trade union
label: syndicat professionnel @fr
type: Class

military person
label: militaire @fr
type: Class

philosopher
type: Class
label: philosophe @fr

currency
label: devise @fr
type: Class

British royalty
type: Class
label: royauté Britannique @fr

has School
comment: Relazione tra Film Festival e School @it
type: ObjectProperty
domain: film festival
comment: Relation between Film Festival and School
range: school

has Radio Station
comment: Relazione tra Film Festival e Radio Station @it
range: radio station
type: ObjectProperty
comment: Relation between Film Festival and Radio Station
domain: film festival

historic place
type: Class
label: site historique @fr

has Broadcast
comment: Relation between Film Festival and Broadcast
type: ObjectProperty
domain: film festival
range: broadcast
comment: Relazione tra Film Festival e Broadcast @it

cricketer
type: Class
label: joueur de cricket @fr

single
type: Class

has Adult Actor
comment: Relazione tra Film Festival e Adult Actor @it
comment: Relation between Film Festival and Adult Actor
range: adult actor
type: ObjectProperty
domain: film festival

Band
label: banda @pt
label: Musikgruppe @de
type: Class
label: groupe de musique @fr

has Album
domain: film festival
comment: Relazione tra Film Festival e Album @it
type: ObjectProperty
range: album
comment: Relation between Film Festival and Album

town
type: Class
label: ville @fr

has Television Show
domain: film festival
type: ObjectProperty
comment: Relation between Film Festival and Television Show
comment: Relazione tra Film Festival e Television Show @it
range: television show

university
type: Class
label: université @fr
label: πανεπιστήμιο @el

has Shopping Mall
domain: film festival
type: ObjectProperty
comment: Relation between Film Festival and Shopping Mall
range: shopping mall
comment: Relazione tra Film Festival e Shopping Mall @it

has Historic Place
comment: Relation between Film Festival and Historic Place
range: historic place
comment: Relazione tra Film Festival e Historic Place @it
domain: film festival
type: ObjectProperty

continent
label: ήπειρος @el
type: Class

ethnic group
label: groupe ethnique @fr
type: Class

Axiom
matching quantification: 7
annotated target: language
annotated source: has Language

president
label: président @fr
type: Class

album
type: Class
label: Album @de

has Office Holder
range: office holder
domain: film festival
comment: Relazione tra Film Festival e Office Holder @it
type: ObjectProperty
comment: Relation between Film Festival and Office Holder

has Architect
comment: Relation between Film Festival and Architect
range: architect
domain: film festival
comment: Relazione tra Film Festival e Architect @it
type: ObjectProperty

has Trade Union
comment: Relazione tra Film Festival e Trade Union @it
domain: film festival
type: ObjectProperty
range: trade union
comment: Relation between Film Festival and Trade Union

music festival
label: festival de musique @fr
type: Class

has Music Festival
domain: film festival
range: music festival
type: ObjectProperty
comment: Relazione tra Film Festival e Music Festival @it
comment: Relation between Film Festival and Music Festival

television episode
type: Class
label: épisode télévisé @fr

soccer manager
type: Class
label: entraîneur de football @fr

has Scientist
type: ObjectProperty
comment: Relazione tra Film Festival e Scientist @it
range: scientist
domain: film festival
comment: Relation between Film Festival and Scientist

has Soccer Player
domain: film festival
range: soccer player
comment: Relazione tra Film Festival e Soccer Player @it
type: ObjectProperty
comment: Relation between Film Festival and Soccer Player

village
label: χωριό @el
type: Class

has Criminal
type: ObjectProperty
comment: Relation between Film Festival and Criminal
range: criminal
comment: Relazione tra Film Festival e Criminal @it
domain: film festival

has Book
comment: Relazione tra Film Festival e Book @it
comment: Relation between Film Festival and Book
type: ObjectProperty
domain: film festival
range: book

has Disease
domain: film festival
comment: Relation between Film Festival and Disease
comment: Relazione tra Film Festival e Disease @it
range: disease
type: ObjectProperty

has Ethnic Group
comment: Relation between Film Festival and Ethnic Group
comment: Relazione tra Film Festival e Ethnic Group @it
type: ObjectProperty
range: ethnic group
domain: film festival

has Currency
comment: Relation between Film Festival and Currency
domain: film festival
comment: Relazione tra Film Festival e Currency @it
range: currency
type: ObjectProperty

baseball player
type: Class
label: joueur de baseball @fr

office holder
type: Class
label: Amtsinhaber @de
label: titulaire @fr

military conflict
label: conflit militaire @fr
type: Class

architect
label: architecte @fr
type: Class

model
label: mannequin @fr
type: Class

has Beverage
comment: Relazione tra Film Festival e Beverage @it
comment: Relation between Film Festival and Beverage
type: ObjectProperty
range: beverage
domain: film festival

has Magazine
type: ObjectProperty
comment: Relazione tra Film Festival e Magazine @it
range: magazine
domain: film festival
comment: Relation between Film Festival and Magazine

film festival
label: festival du film @fr
type: Class

adult actor
label: acteur adulte @fr
type: Class
label: erwachsener Schauspieler @de

has Plant
comment: Relation between Film Festival and Plant
domain: film festival
type: ObjectProperty
comment: Relazione tra Film Festival e Plant @it
range: plant

has Journalist
comment: Relation between Film Festival and Journalist
type: ObjectProperty
range: journalist
comment: Relazione tra Film Festival e Journalist @it
domain: film festival

has Monarch
comment: Relation between Film Festival and Monarch
comment: Relazione tra Film Festival e Monarch @it
type: ObjectProperty
range: monarch
domain: film festival

has Musical Artist
domain: film festival
comment: Relazione tra Film Festival e Musical Artist @it
comment: Relation between Film Festival and Musical Artist
range: musical artist
type: ObjectProperty

has Model
comment: Relation between Film Festival and Model
comment: Relazione tra Film Festival e Model @it
range: model
domain: film festival
type: ObjectProperty

beverage
type: Class
label: boisson @fr

comics creator
label: créateur de bandes dessinées @fr
type: Class

has Cricketer
comment: Relation between Film Festival and Cricketer
comment: Relazione tra Film Festival e Cricketer @it
type: ObjectProperty
domain: film festival
range: cricketer

soccer player
type: Class
label: joueur de football @fr

scientist
label: Wissenschaftler @de
type: Class
label: scientifique @fr

has Mayor
domain: film festival
comment: Relation between Film Festival and Mayor
range: mayor
comment: Relazione tra Film Festival e Mayor @it
type: ObjectProperty

legislature
label: pouvoir législatif @fr
type: Class

airline
type: Class
label: compagnie aérienne @fr

monarch
label: monarque @fr
type: Class

congressman
type: Class
label: membre du Congrès @fr

has Television Episode
comment: Relation between Film Festival and Television Episode
comment: Relazione tra Film Festival e Television Episode @it
range: television episode
domain: film festival
type: ObjectProperty

journalist
type: Class
label: journaliste @fr

plant
type: Class
label: plante @fr

has Newspaper
range: newspaper
type: ObjectProperty
domain: film festival
comment: Relazione tra Film Festival e Newspaper @it
comment: Relation between Film Festival and Newspaper

broadcast
label: Émission de télévision @fr
type: Class

has Soccer Manager
comment: Relation between Film Festival and Soccer Manager
range: soccer manager
domain: film festival
comment: Relazione tra Film Festival e Soccer Manager @it
type: ObjectProperty

mammal
type: Class
label: mammifère @fr

island
type: Class
label: νησί @el
label: île @fr

has Park
type: ObjectProperty
comment: Relation between Film Festival and Park
comment: Relazione tra Film Festival e Park @it
range: park
domain: film festival

comics character
label: personnage de bandes dessinées @fr
type: Class

has Philosopher
comment: Relation between Film Festival and Philosopher
comment: Relazione tra Film Festival e Philosopher @it
type: ObjectProperty
domain: film festival
range: philosopher

bird
type: Class
label: oiseau @fr

has Island
type: ObjectProperty
domain: film festival
comment: Relazione tra Film Festival e Island @it
range: island
comment: Relation between Film Festival and Island

skyscraper
label: gratte-ciel @fr
type: Class

radio station
type: Class
label: station de radio @fr

has Governor
domain: film festival
comment: Relazione tra Film Festival e Governor @it
range: governor
comment: Relation between Film Festival and Governor
type: ObjectProperty

has Legislature
domain: film festival
range: legislature
type: ObjectProperty
comment: Relation between Film Festival and Legislature
comment: Relazione tra Film Festival e Legislature @it

member of parliament
label: membre du Parlement @fr
type: Class

musical artist
label: artista musical @pt
type: Class
label: musicien @fr

airport
type: Class
label: Flughafen @de
label: aéroport @fr